{"text_format":"1","workbook":"xlsx","n_sheets":63,"sheets":["Sheet1","Dictionary","Back up_2","Back up","Vacancy","Matrix_All","Matrix_Top5","MatrixTop5_Blank","AP1","AP2","AP3","AP4","AP5","AP6","AP7","AP8","AP9","AP10","AP11","AP12","AP13","AP14","AP15","AP16","AP17","AP18","AP19","AP20","AP21","AP22","AP23","AP24","AP25","AP26","AP27","AP28","AP29","AP30","AP31","AP32","AP33","AP34","AP35","AP36","AP37","AP38","AP39","AP40","AP41","AP42","AP43","AP44","AP45","AP46","AP47","AP48","AP49","AP50","Educ_2","Highest_#","Trg_Exp","Checkbox_Value","datadict"],"not_rendered":{"charts":0,"images":1,"macros":1,"external_links":1,"defined_names":6,"comments":50,"pivot_tables":0},"unopened":[],"bounds":{"document_bytes":16777216,"sheet_cells":100000,"rows_first":2000,"rows_last":500,"rows_between":2000,"halvings":0,"cell_chars":16384,"cell_head_chars":4096},"cells_cut":0,"cells_raw":0,"read":"whole","date_system":"1900"}

{"sheet":"Sheet1","index":0,"n_rows":1,"n_cols":2,"rows_kept":1,"cut":false,"hidden":true,"merged":[]}
["Title","No. of hours"]

{"sheet":"Dictionary","index":1,"n_rows":61,"n_cols":4,"rows_kept":61,"cut":false,"hidden":true,"merged":[[0,0,0,1]]}
["Potential",null,"Level"]
["First Level","Not 1st Level","First Level"]
[0,1,"Second Level"]
[null,2,"Executive/Managerial"]
[null,3]
[null,4]
[]
[]
["Education"]
["1st level","2nd"]
["Below Elementary","Bachelor's degree"]
["Elementary Graduate","Master's degree"]
["High School Graduate"]
["Vocational"]
["2 years studies in College"]
[]
["Highest attaintment"]
["Below Elementary","Bachelor's degree","Master's degree/C-Pro or its Equivalent","Not applicable"]
["Elementary Graduate","Post Bac Diploma","With Units earned in PhD degree"]
["Below High School","With Units earned in Master's","PhD/Doctoral degree"]
["High School Graduate","Master's degree/C-Pro or its Equivalent"]
["Vocational","With Units earned in PhD/Doctoral"]
["1st Year College < 72 Units","PhD/Doctoral degree"]
["2nd Year College = 72 Units"]
["3rd Year College > 72 Units"]
["Bachelor's degree"]
["Post Bac Diploma"]
["6 Units in Master's"]
["7 and above Units in Master's"]
[]
[]
[]
[null,"1st","2nd","exe"]
["PR",20,15,35]
["Educ",15,10,5]
["Training",10,10,10]
["Exp",25,25,10]
["Acc",10,15,10]
["PCPT",5,5,10]
["Potential",3,5,5]
["exam",12,15,15]
[null,{"$f":"SUM(B34:B41)","v":100},{"$f":"SUM(C34:C41)","v":100},{"$f":"SUM(D34:D41)","v":100}]
[]
[]
["None required","None required"]
[4,1]
[8,2]
[16,3]
[24,4]
[40,5]
[120]
[]
[]
[]
[]
["UP Permanent"]
["UP Contractual"]
["UP Temporary"]
["Individual Contract of Service"]
["Outsider"]
["Project-Based"]

{"sheet":"Back up_2","index":2,"n_rows":42,"n_cols":29,"rows_kept":42,"cut":false,"hidden":true,"merged":[[41,6,41,7],[2,4,2,6],[19,9,19,13],[19,16,19,20],[1,1,1,28],[15,11,15,12],[6,23,6,25],[8,23,8,25],[4,9,4,27],[13,13,16,16],[15,21,15,22]]}
[]
[null,"MSP CALCULATOR"]
[null,null,"Levels",":","First Level"]
[]
[null,null,"A. Performance Rating",null,null,null,null,null,null,"C. Experience/Accomplishment"]
[null,null,null,null,null,null,null,null,null,null,null,null,null,null,null,null,null,null,"C.2.1  Awards/Citation"]
[null,null,"1st rating",":",3.21,null,null,null,null,null,null,"Year",null,{"$f":"K7","v":0},null,null,null,null,"A. Unit Level",null,null,null,null,"C.2.2. Innovations"]
[]
[null,null,"2nd rating",":",3.51,null,null,null,null,null,null,"Month",null,{"$f":"K9/12","v":0},null,null,null,null,"B. University Level",null,null,null,null,"C.2.3. Critical Incidents"]
[]
[null,null,"Total Score",":",{"$f":"IF(E3=\"First Level\",SUM(E7*1,E9*1.5)/2.5*50/5,IF(E3=\"Second Level\",SUM(E7*1,E9*1.5)/2.5*45/5,IF(E3=\"Division Chief and Higher\",SUM(E7*1,E9*1.5)/2.5*45/5,\"\")))","v":33.899999999999991},"pts.",null,null,null,null,null,"Day",null,{"$f":"K11/365","v":0},null,null,null,null,"C. National/CSC Level"]
[]
[]
[false,null,null,null,null,null,null,null,null,"Next-in-Rank?",null,null,null,"Experience (relevant work for the last 5 yrs.)"]
[{"$f":"(10*SUM(N11,N9,N7)/5)","v":0}]
[{"$f":"(10*SUM(N11,N9,N7)/5)*0.9","v":0},null,null,null,null,null,null,null,null,"C.1. Total Score:",null,{"$f":"IF(A14=TRUE,IF(A15>10,10,A15),IF(A16>9,9,A16))","v":0},null,null,null,null,null,null,"C.2. Total Score:",null,null,{"$f":"(5*SUM(Y16,AB9,AB7)/10)","v":0},null,null,{"$f":"(SUM(W7,W9,W11)*5)/9","v":0}]
[]
[null,null,"B. Education"]
[]
[]
[false,null,"Completion B.S. Degree",null,null,null,{"$f":"IF($A$21=FALSE,\"\",IF($E$3=\"First Level\",10,IF($E$3=\"Second Level\",\"\",\"\")))","v":""},"pts.",null,"Total Units Required (TUR)",null,null,null,null,"pts.",null,"Total Units Required (TUR)",null,null,null,null,"pts.",null,"Total Units Required (TUR)",null,null,null,null,"pts."]
[]
[false,null,"Completion Master's Degree",null,null,null,{"$f":"IF($A$23=FALSE,\"\",IF($E$3=\"First Level\",5,IF($E$3=\"Second Level\",5,\"\")))","v":""},"pts.",null,"Total Units Earned (TUE)",null,null,null,null,"pts.",null,"Total Units Earned (TUE)",null,null,null,null,"pts.",null,"Total Units Earned (TUE)",null,null,null,null,"pts."]
[]
[false,null,"Completion Ph.D.",null,null,null,{"$f":"IF($A$25=FALSE,\"\",IF($E$3=\"First Level\",\"\",IF($E$3=\"Second Level\",5,5)))","v":""},"pts.",null,null,"Points Earned",null,null,{"$f":"IFERROR(IF($E$3=\"First Level\",(N23*10/N21),\"\"),\"\")","v":""},"pts.",null,null,"Points Earned",null,null,{"$f":"IFERROR(IF($E$3=\"First Level\",(U23*5/U21),IF($E$3=\"Second Level\",(U23*5/U21),\"\")),\"\")","v":""},"pts.",null,null,"Points Earned",null,null,{"$f":"IFERROR(IF($E$3=\"Division Chief and Higher\",(AB23*5/AB21),\"\"),\"\")","v":""},"pts."]
[]
[null,null,null,null,"Sub Total",null,{"$f":"IF(AND(G21=\"\",G23=\"\",G25=\"\"),\"\",SUM(G25,G23,G21))","v":""},"pts."]
[]
[null,null,"Total Points Earned in Education",null,null,null,{"$f":"_xlfn.AGGREGATE(9,6,G27,N25,U25,AB25)","v":0},"pts."]
[]
[]
[null,null,"B1. Training"]
[]
[null,null,"Required (hrs.)",null,null,8]
[]
[null,null,"Acquired (hrs.)",null,null,54]
[]
[null,null,null,"Total",null,{"$f":"IF(E3=\"First Level\",(F36-F34)*10/50,IF(E3=\"Second Level\",(F36-F34)*10/75,IF(E3=\"Division Chief and Higher\",(F36-F34)*10/100,\"\")))","v":9.1999999999999993},"pts."]
[]
[null,null,"D. Physical Characteristics and Personality Traits"]
[]
[null,null,"Supervisor",null,"Co-worker 1",null,"Co-worker 2"]

{"sheet":"Back up","index":3,"n_rows":27,"n_cols":29,"rows_kept":27,"cut":false,"hidden":true,"merged":[[1,1,1,28],[2,4,2,6],[14,9,14,13],[14,16,14,20]]}
[]
[null,"MSP CALCULATOR"]
[null,null,"Levels",":","First Level"]
[]
[null,null,"A. Performance Rating",null,null,null,null,null,null,"B1. Training",null,null,null,null,null,"C. Experience/Accomplishment"]
[]
[null,null,"1st rating",":",3.21,null,null,null,null,"Required (hrs.)",null,8,null,null,null,null,"Experience (relevant work for the last 5 yrs.)",null,null,null,null,null,null,"  pts."]
[]
[null,null,"2nd rating",":",3.51,null,null,null,null,"Acquired (hrs.)",null,96,null,null,null,null,"C.1.1  Awards/Citation",null,null,null,1,"  pts."]
[]
[null,null,"Total Score",":",{"$f":"IF(E3=\"First Level\",SUM(E7*1,E9*1.5)/2.5*50/5,IF(E3=\"Second Level\",SUM(E7*1,E9*1.5)/2.5*45/5,IF(E3=\"Division Chief and Higher\",SUM(E7*1,E9*1.5)/2.5*45/5,\"\")))","v":33.899999999999991},"pts.",null,null,null,null,"Total",{"$f":"IF(E3=\"First Level\",(L9-L7)*10/50,IF(E3=\"Second Level\",(L9-L7)*10/75,IF(E3=\"Division Chief and Higher\",(L9-L7)*10/100,\"\")))","v":17.600000000000001},null,"pts.",null,null,"C.1.2. Innovations",null,null,null,null,"  pts.",null,"Critical Incidents",null,null,"  pts."]
[]
[null,null,"B. Education"]
[]
[]
[false,null,"Completion B.S. Degree",null,null,null,{"$f":"IF($A$16=FALSE,\"\",IF($E$3=\"First Level\",10,IF($E$3=\"Second Level\",\"\",\"\")))","v":""},"pts.",null,"Total Units Required (TUR)",null,null,null,null,"pts.",null,"Total Units Required (TUR)",null,null,null,null,"pts.",null,"Total Units Required (TUR)",null,null,null,null,"pts."]
[]
[false,null,"Completion Master's Degree",null,null,null,{"$f":"IF($A$18=FALSE,\"\",IF($E$3=\"First Level\",5,IF($E$3=\"Second Level\",5,\"\")))","v":""},"pts.",null,"Total Units Earned (TUE)",null,null,null,null,"pts.",null,"Total Units Earned (TUE)",null,null,null,null,"pts.",null,"Total Units Earned (TUE)",null,null,null,null,"pts."]
[]
[false,null,"Completion Ph.D.",null,null,null,{"$f":"IF($A$20=FALSE,\"\",IF($E$3=\"First Level\",\"\",IF($E$3=\"Second Level\",5,5)))","v":""},"pts.",null,null,"Points Earned",null,null,{"$f":"IFERROR(IF($E$3=\"First Level\",(N18*10/N16),\"\"),\"\")","v":""},"pts.",null,null,"Points Earned",null,null,{"$f":"IFERROR(IF($E$3=\"First Level\",(U18*5/U16),IF($E$3=\"Second Level\",(U18*5/U16),\"\")),\"\")","v":""},"pts.",null,null,"Points Earned",null,null,{"$f":"IFERROR(IF($E$3=\"Division Chief and Higher\",(AB18*5/AB16),\"\"),\"\")","v":""},"pts."]
[]
[null,null,null,null,"Sub Total",null,{"$f":"IF(AND(G16=\"\",G18=\"\",G20=\"\"),\"\",SUM(G20,G18,G16))","v":""},"pts."]
[]
[null,null,"Total Points Earned in Education",null,null,null,{"$f":"_xlfn.AGGREGATE(9,6,G22,N20,U20,AB20)","v":0},"pts."]
[]
[null,null,"D. Physical Characteristics and Personality Traits"]
[null,null,null,null,"TO FOLLOW PO…"]

{"sheet":"Vacancy","index":4,"n_rows":14,"n_cols":26,"rows_kept":14,"cut":false,"hidden":false,"merged":[[15,2,15,30],[13,5,13,13],[13,22,13,26],[11,2,11,30],[5,26,5,30],[3,2,3,30],[7,2,7,30],[9,26,9,30],[9,4,9,13],[5,4,5,9],[5,13,5,22],[9,17,9,21]]}
[]
[]
[]
[null,null,"P R O F I L E  O F  V A C A N C Y"]
[]
[null,null,"Levels",":",null,null,null,null,null,null,null,"Position:",null,null,null,null,null,null,null,null,null,null,null,null,"Plantilla Item:"]
[]
[null,null,"REQUIREMENT"]
[]
[null,null,"Education:",null,null,null,null,null,null,null,null,null,null,null,null,null,"Training (# of hrs.):",null,null,null,null,null,null,null,null,"Experience (# of yrs.)"]
[]
[]
[]
[null,null,"College/Unit:",null,null,null,null,null,null,null,null,null,null,null,null,null,null,null,"Date of Deliberation:"]

{"sheet":"Matrix_All","index":5,"n_rows":64,"n_cols":16,"rows_kept":64,"cut":false,"hidden":false,"merged":[[6,13,7,13],[6,9,7,9],[6,10,7,10],[6,14,8,14],[6,12,7,12],[6,7,7,7],[6,8,7,8],[6,11,7,11],[6,1,8,1],[6,3,8,3],[6,4,7,4],[6,5,7,5],[6,6,7,6],[6,2,8,2],[5,1,5,4],[0,1,0,14],[1,1,1,14],[2,1,2,14],[3,1,3,14],[4,1,4,14]]}
[null,"HUMAN RESOURCE MERIT PROMOTION AND SELECTION BOARD (HRMPSB)"]
[null,"EVALUATION MATRIX"]
[null,{"$f":"Vacancy!N6&\" - \"&Vacancy!AA6","v":" - "}]
[null,{"$f":"IF(Vacancy!F14=\"\",\"\",Vacancy!F14)","v":""}]
[null,{"$f":"\"DATE OF DELIBERATION: \"&\" \"&Vacancy!W14","v":"DATE OF DELIBERATION:  "}]
[]
[null,"#","EMPLOYMENT CATEGORY","NAME","PERFORMANCE RATING (A)","EDUCATION (B)","TRAINING\n(C)","EXPERIENCE\n(D)","ACCOMPLISHMENTS\n(E)","PERSONAL TRAITS\n(F) ","POTENTIALS\n(G)","WRITTEN EXAM\n(H)","PUBLIC SERVICE\n(I)","TOTAL\nPOINTS","RANK"]
[]
[null,null,null,null,{"$f":"IF(Vacancy!$E$6=\"First Level\",Dictionary!$B$34&\"%\",IF(Vacancy!$E$6=\"Second Level\",Dictionary!$C$34&\"%\",Dictionary!$D$34&\"%\"))","v":"35%"},{"$f":"IF(Vacancy!$E$6=\"First Level\",Dictionary!$B$35&\"%\",IF(Vacancy!$E$6=\"Second Level\",Dictionary!$C$35&\"%\",Dictionary!$D$35&\"%\"))","v":"5%"},{"$f":"IF(Vacancy!$E$6=\"First Level\",Dictionary!$B$36&\"%\",IF(Vacancy!$E$6=\"Second Level\",Dictionary!$C$36&\"%\",Dictionary!$D$36&\"%\"))","v":"10%"},{"$f":"IF(Vacancy!$E$6=\"First Level\",Dictionary!$B$37&\"%\",IF(Vacancy!$E$6=\"Second Level\",Dictionary!$C$37&\"%\",Dictionary!$D$37&\"%\"))","v":"10%"},{"$f":"IF(Vacancy!$E$6=\"First Level\",Dictionary!$B$38&\"%\",IF(Vacancy!$E$6=\"Second Level\",Dictionary!$C$38&\"%\",Dictionary!$D$38&\"%\"))","v":"10%"},{"$f":"IF(Vacancy!$E$6=\"First Level\",Dictionary!$B$39&\"%\",IF(Vacancy!$E$6=\"Second Level\",Dictionary!$C$39&\"%\",Dictionary!$D$39&\"%\"))","v":"10%"},{"$f":"IF(Vacancy!$E$6=\"First Level\",Dictionary!$B$40&\"%\",IF(Vacancy!$E$6=\"Second Level\",Dictionary!$C$40&\"%\",Dictionary!$D$40&\"%\"))","v":"5%"},{"$f":"IF(Vacancy!$E$6=\"First Level\",Dictionary!$B$41&\"%\",IF(Vacancy!$E$6=\"Second Level\",Dictionary!$C$41&\"%\",Dictionary!$D$41&\"%\"))","v":"15%"},"(+10)",1]
[{"$f":"_xlfn.NUMBERVALUE(O10)","v":1},1,{"$f":"'AP1'!$AB$3","v":0},{"$f":"'AP1'!N3","v":0},{"$f":"'AP1'!F13","v":""},{"$f":"'AP1'!Y17","v":0},{"$f":"'AP1'!E25","v":0},{"$f":"'AP1'!Z25","v":0},{"$f":"'AP1'!J40","v":0},{"$f":"'AP1'!Q51","v":0},{"$f":"'AP1'!K67","v":0},{"$f":"'AP1'!K77","v":0},{"$f":"'AP1'!D81","v":0},{"$f":"'AP1'!AG3","v":0},{"$f":"SUMPRODUCT((N10<$N$10:$N$59)/COUNTIF($N$10:$N$59,$N$10:$N$59))+1","v":1},{"$f":"IF(D10=0,\"No\",IF(O10<6,\"Ok\",\"No\"))","v":"No"}]
[{"$f":"_xlfn.NUMBERVALUE(O11)","v":1},2,{"$f":"'AP2'!$AB$3","v":0},{"$f":"'AP2'!N3","v":0},{"$f":"'AP2'!F13","v":""},{"$f":"'AP2'!Y17","v":0},{"$f":"'AP2'!E25","v":0},{"$f":"'AP2'!Z25","v":0},{"$f":"'AP2'!J40","v":0},{"$f":"'AP2'!Q51","v":0},{"$f":"'AP2'!K67","v":0},{"$f":"'AP2'!K77","v":0},{"$f":"'AP2'!D81","v":0},{"$f":"'AP2'!AG3","v":0},{"$f":"SUMPRODUCT((N11<$N$10:$N$59)/COUNTIF($N$10:$N$59,$N$10:$N$59))+1","v":1},{"$f":"IF(D11=0,\"No\",IF(O11<6,\"Ok\",\"No\"))","v":"No"}]
[1,3,{"$f":"'AP3'!$AB$3","v":0},{"$f":"'AP3'!N3","v":0},{"$f":"'AP3'!F13","v":""},{"$f":"'AP3'!Y17","v":0},{"$f":"'AP3'!E25","v":0},{"$f":"'AP3'!Z25","v":0},{"$f":"'AP3'!J40","v":0},{"$f":"'AP3'!Q51","v":0},{"$f":"'AP3'!K67","v":0},{"$f":"'AP3'!K77","v":0},{"$f":"'AP3'!D81","v":0},{"$f":"'AP3'!AG3","v":0},{"$f":"SUMPRODUCT((N12<$N$10:$N$59)/COUNTIF($N$10:$N$59,$N$10:$N$59))+1","v":1},"No"]
[1,4,{"$f":"'AP4'!$AB$3","v":0},{"$f":"'AP4'!N3","v":0},{"$f":"'AP4'!F13","v":""},{"$f":"'AP4'!Y17","v":0},{"$f":"'AP4'!E25","v":0},{"$f":"'AP4'!Z25","v":0},{"$f":"'AP4'!J40","v":0},{"$f":"'AP4'!Q51","v":0},{"$f":"'AP4'!K67","v":0},{"$f":"'AP4'!K77","v":0},{"$f":"'AP4'!D81","v":0},{"$f":"'AP4'!AG3","v":0},{"$f":"SUMPRODUCT((N13<$N$10:$N$59)/COUNTIF($N$10:$N$59,$N$10:$N$59))+1","v":1},"No"]
[1,5,{"$f":"'AP5'!$AB$3","v":0},{"$f":"'AP5'!N3","v":0},{"$f":"'AP5'!F13","v":""},{"$f":"'AP5'!Y17","v":0},{"$f":"'AP5'!E25","v":0},{"$f":"'AP5'!Z25","v":0},{"$f":"'AP5'!J40","v":0},{"$f":"'AP5'!Q51","v":0},{"$f":"'AP5'!K67","v":0},{"$f":"'AP5'!K77","v":0},{"$f":"'AP5'!D81","v":0},{"$f":"'AP5'!AG3","v":0},{"$f":"SUMPRODUCT((N14<$N$10:$N$59)/COUNTIF($N$10:$N$59,$N$10:$N$59))+1","v":1},"No"]
[1,6,{"$f":"'AP6'!$AB$3","v":0},{"$f":"'AP6'!N3","v":0},{"$f":"'AP6'!F13","v":""},{"$f":"'AP6'!Y17","v":0},{"$f":"'AP6'!E25","v":0},{"$f":"'AP6'!Z25","v":0},{"$f":"'AP6'!J40","v":0},{"$f":"'AP6'!Q51","v":0},{"$f":"'AP6'!K67","v":0},{"$f":"'AP6'!K77","v":0},{"$f":"'AP6'!D81","v":0},{"$f":"'AP6'!AG3","v":0},{"$f":"SUMPRODUCT((N15<$N$10:$N$59)/COUNTIF($N$10:$N$59,$N$10:$N$59))+1","v":1},"No"]
[1,7,{"$f":"'AP7'!$AB$3","v":0},{"$f":"'AP7'!N3","v":0},{"$f":"'AP7'!F13","v":""},{"$f":"'AP7'!Y17","v":0},{"$f":"'AP7'!E25","v":0},{"$f":"'AP7'!Z25","v":0},{"$f":"'AP7'!J40","v":0},{"$f":"'AP7'!Q51","v":0},{"$f":"'AP7'!K67","v":0},{"$f":"'AP7'!K77","v":0},{"$f":"'AP7'!D81","v":0},{"$f":"'AP7'!AG3","v":0},{"$f":"SUMPRODUCT((N16<$N$10:$N$59)/COUNTIF($N$10:$N$59,$N$10:$N$59))+1","v":1},"No"]
[1,8,{"$f":"'AP8'!$AB$3","v":0},{"$f":"'AP8'!N3","v":0},{"$f":"'AP8'!F13","v":""},{"$f":"'AP8'!Y17","v":0},{"$f":"'AP8'!E25","v":0},{"$f":"'AP8'!Z25","v":0},{"$f":"'AP8'!J40","v":0},{"$f":"'AP8'!Q51","v":0},{"$f":"'AP8'!K67","v":0},{"$f":"'AP8'!K77","v":0},{"$f":"'AP8'!D81","v":0},{"$f":"'AP8'!AG3","v":0},{"$f":"SUMPRODUCT((N17<$N$10:$N$59)/COUNTIF($N$10:$N$59,$N$10:$N$59))+1","v":1},"No"]
[1,9,{"$f":"'AP9'!$AB$3","v":0},{"$f":"'AP9'!N3","v":0},{"$f":"'AP9'!F13","v":""},{"$f":"'AP9'!Y17","v":0},{"$f":"'AP9'!E25","v":0},{"$f":"'AP9'!Z25","v":0},{"$f":"'AP9'!J40","v":0},{"$f":"'AP9'!Q51","v":0},{"$f":"'AP9'!K67","v":0},{"$f":"'AP9'!K77","v":0},{"$f":"'AP9'!D81","v":0},{"$f":"'AP9'!AG3","v":0},{"$f":"SUMPRODUCT((N18<$N$10:$N$59)/COUNTIF($N$10:$N$59,$N$10:$N$59))+1","v":1},"No"]
[1,10,{"$f":"'AP10'!$AB$3","v":0},{"$f":"'AP10'!$N$3","v":0},{"$f":"'AP10'!$F$13","v":""},{"$f":"'AP10'!$Y$17","v":0},{"$f":"'AP10'!$E$25","v":0},{"$f":"'AP10'!$Z$25","v":0},{"$f":"'AP10'!$J$40","v":0},{"$f":"'AP10'!$Q$51","v":0},{"$f":"'AP10'!$K$67","v":0},{"$f":"'AP10'!$K$77","v":0},{"$f":"'AP10'!$D$81","v":0},{"$f":"'AP10'!$AG$3","v":0},{"$f":"SUMPRODUCT((N19<$N$10:$N$59)/COUNTIF($N$10:$N$59,$N$10:$N$59))+1","v":1},"No"]
[1,11,{"$f":"'AP11'!$AB$3","v":0},{"$f":"'AP11'!$N$3","v":0},{"$f":"'AP11'!$F$13","v":""},{"$f":"'AP11'!$Y$17","v":0},{"$f":"'AP11'!$E$25","v":0},{"$f":"'AP11'!$Z$25","v":0},{"$f":"'AP11'!$J$40","v":0},{"$f":"'AP11'!$Q$51","v":0},{"$f":"'AP11'!$K$67","v":0},{"$f":"'AP11'!$K$77","v":0},{"$f":"'AP11'!$D$81","v":0},{"$f":"'AP11'!$AG$3","v":0},{"$f":"SUMPRODUCT((N20<$N$10:$N$59)/COUNTIF($N$10:$N$59,$N$10:$N$59))+1","v":1},"No"]
[1,12,{"$f":"'AP12'!$AB$3","v":0},{"$f":"'AP12'!$N$3","v":0},{"$f":"'AP12'!$F$13","v":""},{"$f":"'AP12'!$Y$17","v":0},{"$f":"'AP12'!$E$25","v":0},{"$f":"'AP12'!$Z$25","v":0},{"$f":"'AP12'!$J$40","v":0},{"$f":"'AP12'!$Q$51","v":0},{"$f":"'AP12'!$K$67","v":0},{"$f":"'AP12'!$K$77","v":0},{"$f":"'AP12'!$D$81","v":0},{"$f":"'AP12'!$AG$3","v":0},{"$f":"SUMPRODUCT((N21<$N$10:$N$59)/COUNTIF($N$10:$N$59,$N$10:$N$59))+1","v":1},"No"]
[1,13,{"$f":"'AP13'!$AB$3","v":0},{"$f":"'AP13'!$N$3","v":0},{"$f":"'AP13'!$F$13","v":""},{"$f":"'AP13'!$Y$17","v":0},{"$f":"'AP13'!$E$25","v":0},{"$f":"'AP13'!$Z$25","v":0},{"$f":"'AP13'!$J$40","v":0},{"$f":"'AP13'!$Q$51","v":0},{"$f":"'AP13'!$K$67","v":0},{"$f":"'AP13'!$K$77","v":0},{"$f":"'AP13'!$D$81","v":0},{"$f":"'AP13'!$AG$3","v":0},{"$f":"SUMPRODUCT((N22<$N$10:$N$59)/COUNTIF($N$10:$N$59,$N$10:$N$59))+1","v":1},"No"]
[1,14,{"$f":"'AP14'!$AB$3","v":0},{"$f":"'AP14'!$N$3","v":0},{"$f":"'AP14'!$F$13","v":""},{"$f":"'AP14'!$Y$17","v":0},{"$f":"'AP14'!$E$25","v":0},{"$f":"'AP14'!$Z$25","v":0},{"$f":"'AP14'!$J$40","v":0},{"$f":"'AP14'!$Q$51","v":0},{"$f":"'AP14'!$K$67","v":0},{"$f":"'AP14'!$K$77","v":0},{"$f":"'AP14'!$D$81","v":0},{"$f":"'AP14'!$AG$3","v":0},{"$f":"SUMPRODUCT((N23<$N$10:$N$59)/COUNTIF($N$10:$N$59,$N$10:$N$59))+1","v":1},"No"]
[1,15,{"$f":"'AP15'!$AB$3","v":0},{"$f":"'AP15'!$N$3","v":0},{"$f":"'AP15'!$F$13","v":""},{"$f":"'AP15'!$Y$17","v":0},{"$f":"'AP15'!$E$25","v":0},{"$f":"'AP15'!$Z$25","v":0},{"$f":"'AP15'!$J$40","v":0},{"$f":"'AP15'!$Q$51","v":0},{"$f":"'AP15'!$K$67","v":0},{"$f":"'AP15'!$K$77","v":0},{"$f":"'AP15'!$D$81","v":0},{"$f":"'AP15'!$AG$3","v":0},{"$f":"SUMPRODUCT((N24<$N$10:$N$59)/COUNTIF($N$10:$N$59,$N$10:$N$59))+1","v":1},"No"]
[1,16,{"$f":"'AP16'!$AB$3","v":0},{"$f":"'AP16'!$N$3","v":0},{"$f":"'AP16'!$F$13","v":""},{"$f":"'AP16'!$Y$17","v":0},{"$f":"'AP16'!$E$25","v":0},{"$f":"'AP16'!$Z$25","v":0},{"$f":"'AP16'!$J$40","v":0},{"$f":"'AP16'!$Q$51","v":0},{"$f":"'AP16'!$K$67","v":0},{"$f":"'AP16'!$K$77","v":0},{"$f":"'AP16'!$D$81","v":0},{"$f":"'AP16'!$AG$3","v":0},{"$f":"SUMPRODUCT((N25<$N$10:$N$59)/COUNTIF($N$10:$N$59,$N$10:$N$59))+1","v":1},"No"]
[1,17,{"$f":"'AP17'!$AB$3","v":0},{"$f":"'AP17'!$N$3","v":0},{"$f":"'AP17'!$F$13","v":""},{"$f":"'AP17'!$Y$17","v":0},{"$f":"'AP17'!$E$25","v":0},{"$f":"'AP17'!$Z$25","v":0},{"$f":"'AP17'!$J$40","v":0},{"$f":"'AP17'!$Q$51","v":0},{"$f":"'AP17'!$K$67","v":0},{"$f":"'AP17'!$K$77","v":0},{"$f":"'AP17'!$D$81","v":0},{"$f":"'AP17'!$AG$3","v":0},{"$f":"SUMPRODUCT((N26<$N$10:$N$59)/COUNTIF($N$10:$N$59,$N$10:$N$59))+1","v":1},"No"]
[1,18,{"$f":"'AP18'!$AB$3","v":0},{"$f":"'AP18'!$N$3","v":0},{"$f":"'AP18'!$F$13","v":""},{"$f":"'AP18'!$Y$17","v":0},{"$f":"'AP18'!$E$25","v":0},{"$f":"'AP18'!$Z$25","v":0},{"$f":"'AP18'!$J$40","v":0},{"$f":"'AP18'!$Q$51","v":0},{"$f":"'AP18'!$K$67","v":0},{"$f":"'AP18'!$K$77","v":0},{"$f":"'AP18'!$D$81","v":0},{"$f":"'AP18'!$AG$3","v":0},{"$f":"SUMPRODUCT((N27<$N$10:$N$59)/COUNTIF($N$10:$N$59,$N$10:$N$59))+1","v":1},"No"]
[1,19,{"$f":"'AP19'!$AB$3","v":0},{"$f":"'AP19'!$N$3","v":0},{"$f":"'AP19'!$F$13","v":""},{"$f":"'AP19'!$Y$17","v":0},{"$f":"'AP19'!$E$25","v":0},{"$f":"'AP19'!$Z$25","v":0},{"$f":"'AP19'!$J$40","v":0},{"$f":"'AP19'!$Q$51","v":0},{"$f":"'AP19'!$K$67","v":0},{"$f":"'AP19'!$K$77","v":0},{"$f":"'AP19'!$D$81","v":0},{"$f":"'AP19'!$AG$3","v":0},{"$f":"SUMPRODUCT((N28<$N$10:$N$59)/COUNTIF($N$10:$N$59,$N$10:$N$59))+1","v":1},"No"]
[1,20,{"$f":"'AP20'!$AB$3","v":0},{"$f":"'AP20'!$N$3","v":0},{"$f":"'AP20'!$F$13","v":""},{"$f":"'AP20'!$Y$17","v":0},{"$f":"'AP20'!$E$25","v":0},{"$f":"'AP20'!$Z$25","v":0},{"$f":"'AP20'!$J$40","v":0},{"$f":"'AP20'!$Q$51","v":0},{"$f":"'AP20'!$K$67","v":0},{"$f":"'AP20'!$K$77","v":0},{"$f":"'AP20'!$D$81","v":0},{"$f":"'AP20'!$AG$3","v":0},{"$f":"SUMPRODUCT((N29<$N$10:$N$59)/COUNTIF($N$10:$N$59,$N$10:$N$59))+1","v":1},"No"]
[1,21,{"$f":"'AP21'!$AB$3","v":0},{"$f":"'AP21'!$N$3","v":0},{"$f":"'AP21'!$F$13","v":""},{"$f":"'AP21'!$Y$17","v":0},{"$f":"'AP21'!$E$25","v":0},{"$f":"'AP21'!$Z$25","v":0},{"$f":"'AP21'!$J$40","v":0},{"$f":"'AP21'!$Q$51","v":0},{"$f":"'AP21'!$K$67","v":0},{"$f":"'AP21'!$K$77","v":0},{"$f":"'AP21'!$D$81","v":0},{"$f":"'AP21'!$AG$3","v":0},{"$f":"SUMPRODUCT((N30<$N$10:$N$59)/COUNTIF($N$10:$N$59,$N$10:$N$59))+1","v":1},"No"]
[1,22,{"$f":"'AP22'!$AB$3","v":0},{"$f":"'AP22'!$N$3","v":0},{"$f":"'AP22'!$F$13","v":""},{"$f":"'AP22'!$Y$17","v":0},{"$f":"'AP22'!$E$25","v":0},{"$f":"'AP22'!$Z$25","v":0},{"$f":"'AP22'!$J$40","v":0},{"$f":"'AP22'!$Q$51","v":0},{"$f":"'AP22'!$K$67","v":0},{"$f":"'AP22'!$K$77","v":0},{"$f":"'AP22'!$D$81","v":0},{"$f":"'AP22'!$AG$3","v":0},{"$f":"SUMPRODUCT((N31<$N$10:$N$59)/COUNTIF($N$10:$N$59,$N$10:$N$59))+1","v":1},"No"]
[1,23,{"$f":"'AP23'!$AB$3","v":0},{"$f":"'AP23'!$N$3","v":0},{"$f":"'AP23'!$F$13","v":""},{"$f":"'AP23'!$Y$17","v":0},{"$f":"'AP23'!$E$25","v":0},{"$f":"'AP23'!$Z$25","v":0},{"$f":"'AP23'!$J$40","v":0},{"$f":"'AP23'!$Q$51","v":0},{"$f":"'AP23'!$K$67","v":0},{"$f":"'AP23'!$K$77","v":0},{"$f":"'AP23'!$D$81","v":0},{"$f":"'AP23'!$AG$3","v":0},{"$f":"SUMPRODUCT((N32<$N$10:$N$59)/COUNTIF($N$10:$N$59,$N$10:$N$59))+1","v":1},"No"]
[1,24,{"$f":"'AP24'!$AB$3","v":0},{"$f":"'AP24'!$N$3","v":0},{"$f":"'AP24'!$F$13","v":""},{"$f":"'AP24'!$Y$17","v":0},{"$f":"'AP24'!$E$25","v":0},{"$f":"'AP24'!$Z$25","v":0},{"$f":"'AP24'!$J$40","v":0},{"$f":"'AP24'!$Q$51","v":0},{"$f":"'AP24'!$K$67","v":0},{"$f":"'AP24'!$K$77","v":0},{"$f":"'AP24'!$D$81","v":0},{"$f":"'AP24'!$AG$3","v":0},{"$f":"SUMPRODUCT((N33<$N$10:$N$59)/COUNTIF($N$10:$N$59,$N$10:$N$59))+1","v":1},"No"]
[1,25,{"$f":"'AP25'!$AB$3","v":0},{"$f":"'AP25'!$N$3","v":0},{"$f":"'AP25'!$F$13","v":""},{"$f":"'AP25'!$Y$17","v":0},{"$f":"'AP25'!$E$25","v":0},{"$f":"'AP25'!$Z$25","v":0},{"$f":"'AP25'!$J$40","v":0},{"$f":"'AP25'!$Q$51","v":0},{"$f":"'AP25'!$K$67","v":0},{"$f":"'AP25'!$K$77","v":0},{"$f":"'AP25'!$D$81","v":0},{"$f":"'AP25'!$AG$3","v":0},{"$f":"SUMPRODUCT((N34<$N$10:$N$59)/COUNTIF($N$10:$N$59,$N$10:$N$59))+1","v":1},"No"]
[1,26,{"$f":"'AP26'!$AB$3","v":0},{"$f":"'AP26'!$N$3","v":0},{"$f":"'AP26'!$F$13","v":""},{"$f":"'AP26'!$Y$17","v":0},{"$f":"'AP26'!$E$25","v":0},{"$f":"'AP26'!$Z$25","v":0},{"$f":"'AP26'!$J$40","v":0},{"$f":"'AP26'!$Q$51","v":0},{"$f":"'AP26'!$K$67","v":0},{"$f":"'AP26'!$K$77","v":0},{"$f":"'AP26'!$D$81","v":0},{"$f":"'AP26'!$AG$3","v":0},{"$f":"SUMPRODUCT((N35<$N$10:$N$59)/COUNTIF($N$10:$N$59,$N$10:$N$59))+1","v":1},"No"]
[1,27,{"$f":"'AP27'!$AB$3","v":0},{"$f":"'AP27'!$N$3","v":0},{"$f":"'AP27'!$F$13","v":""},{"$f":"'AP27'!$Y$17","v":0},{"$f":"'AP27'!$E$25","v":0},{"$f":"'AP27'!$Z$25","v":0},{"$f":"'AP27'!$J$40","v":0},{"$f":"'AP27'!$Q$51","v":0},{"$f":"'AP27'!$K$67","v":0},{"$f":"'AP27'!$K$77","v":0},{"$f":"'AP27'!$D$81","v":0},{"$f":"'AP27'!$AG$3","v":0},{"$f":"SUMPRODUCT((N36<$N$10:$N$59)/COUNTIF($N$10:$N$59,$N$10:$N$59))+1","v":1},"No"]
[1,28,{"$f":"'AP28'!$AB$3","v":0},{"$f":"'AP28'!$N$3","v":0},{"$f":"'AP28'!$F$13","v":""},{"$f":"'AP28'!$Y$17","v":0},{"$f":"'AP28'!$E$25","v":0},{"$f":"'AP28'!$Z$25","v":0},{"$f":"'AP28'!$J$40","v":0},{"$f":"'AP28'!$Q$51","v":0},{"$f":"'AP28'!$K$67","v":0},{"$f":"'AP28'!$K$77","v":0},{"$f":"'AP28'!$D$81","v":0},{"$f":"'AP28'!$AG$3","v":0},{"$f":"SUMPRODUCT((N37<$N$10:$N$59)/COUNTIF($N$10:$N$59,$N$10:$N$59))+1","v":1},"No"]
[1,29,{"$f":"'AP29'!$AB$3","v":0},{"$f":"'AP29'!$N$3","v":0},{"$f":"'AP29'!$F$13","v":""},{"$f":"'AP29'!$Y$17","v":0},{"$f":"'AP29'!$E$25","v":0},{"$f":"'AP29'!$Z$25","v":0},{"$f":"'AP29'!$J$40","v":0},{"$f":"'AP29'!$Q$51","v":0},{"$f":"'AP29'!$K$67","v":0},{"$f":"'AP29'!$K$77","v":0},{"$f":"'AP29'!$D$81","v":0},{"$f":"'AP29'!$AG$3","v":0},{"$f":"SUMPRODUCT((N38<$N$10:$N$59)/COUNTIF($N$10:$N$59,$N$10:$N$59))+1","v":1},"No"]
[1,30,{"$f":"'AP30'!$AB$3","v":0},{"$f":"'AP30'!$N$3","v":0},{"$f":"'AP30'!$F$13","v":""},{"$f":"'AP30'!$Y$17","v":0},{"$f":"'AP30'!$E$25","v":0},{"$f":"'AP30'!$Z$25","v":0},{"$f":"'AP30'!$J$40","v":0},{"$f":"'AP30'!$Q$51","v":0},{"$f":"'AP30'!$K$67","v":0},{"$f":"'AP30'!$K$77","v":0},{"$f":"'AP30'!$D$81","v":0},{"$f":"'AP30'!$AG$3","v":0},{"$f":"SUMPRODUCT((N39<$N$10:$N$59)/COUNTIF($N$10:$N$59,$N$10:$N$59))+1","v":1},"No"]
[{"$f":"_xlfn.NUMBERVALUE(O40)","v":1},31,{"$f":"'AP31'!$AB$3","v":0},{"$f":"'AP31'!$N$3","v":0},{"$f":"'AP31'!$F$13","v":""},{"$f":"'AP31'!$Y$17","v":0},{"$f":"'AP31'!$E$25","v":0},{"$f":"'AP31'!$Z$25","v":0},{"$f":"'AP31'!$J$40","v":0},{"$f":"'AP31'!$Q$51","v":0},{"$f":"'AP31'!$K$67","v":0},{"$f":"'AP31'!$K$77","v":0},{"$f":"'AP31'!$D$81","v":0},{"$f":"'AP31'!$AG$3","v":0},{"$f":"SUMPRODUCT((N40<$N$10:$N$59)/COUNTIF($N$10:$N$59,$N$10:$N$59))+1","v":1},{"$f":"IF(D40=0,\"No\",IF(O40<6,\"Ok\",\"No\"))","v":"No"}]
[1,32,{"$f":"'AP32'!$AB$3","v":0},{"$f":"'AP32'!$N$3","v":0},{"$f":"'AP32'!$F$13","v":""},{"$f":"'AP32'!$Y$17","v":0},{"$f":"'AP32'!$E$25","v":0},{"$f":"'AP32'!$Z$25","v":0},{"$f":"'AP32'!$J$40","v":0},{"$f":"'AP32'!$Q$51","v":0},{"$f":"'AP32'!$K$67","v":0},{"$f":"'AP32'!$K$77","v":0},{"$f":"'AP32'!$D$81","v":0},{"$f":"'AP32'!$AG$3","v":0},{"$f":"SUMPRODUCT((N41<$N$10:$N$59)/COUNTIF($N$10:$N$59,$N$10:$N$59))+1","v":1},"No"]
[1,33,{"$f":"'AP33'!$AB$3","v":0},{"$f":"'AP33'!$N$3","v":0},{"$f":"'AP33'!$F$13","v":""},{"$f":"'AP33'!$Y$17","v":0},{"$f":"'AP33'!$E$25","v":0},{"$f":"'AP33'!$Z$25","v":0},{"$f":"'AP33'!$J$40","v":0},{"$f":"'AP33'!$Q$51","v":0},{"$f":"'AP33'!$K$67","v":0},{"$f":"'AP33'!$K$77","v":0},{"$f":"'AP33'!$D$81","v":0},{"$f":"'AP33'!$AG$3","v":0},{"$f":"SUMPRODUCT((N42<$N$10:$N$59)/COUNTIF($N$10:$N$59,$N$10:$N$59))+1","v":1},"No"]
[1,34,{"$f":"'AP34'!$AB$3","v":0},{"$f":"'AP34'!$N$3","v":0},{"$f":"'AP34'!$F$13","v":""},{"$f":"'AP34'!$Y$17","v":0},{"$f":"'AP34'!$E$25","v":0},{"$f":"'AP34'!$Z$25","v":0},{"$f":"'AP34'!$J$40","v":0},{"$f":"'AP34'!$Q$51","v":0},{"$f":"'AP34'!$K$67","v":0},{"$f":"'AP34'!$K$77","v":0},{"$f":"'AP34'!$D$81","v":0},{"$f":"'AP34'!$AG$3","v":0},{"$f":"SUMPRODUCT((N43<$N$10:$N$59)/COUNTIF($N$10:$N$59,$N$10:$N$59))+1","v":1},"No"]
[1,35,{"$f":"'AP35'!$AB$3","v":0},{"$f":"'AP35'!$N$3","v":0},{"$f":"'AP35'!$F$13","v":""},{"$f":"'AP35'!$Y$17","v":0},{"$f":"'AP35'!$E$25","v":0},{"$f":"'AP35'!$Z$25","v":0},{"$f":"'AP35'!$J$40","v":0},{"$f":"'AP35'!$Q$51","v":0},{"$f":"'AP35'!$K$67","v":0},{"$f":"'AP35'!$K$77","v":0},{"$f":"'AP35'!$D$81","v":0},{"$f":"'AP35'!$AG$3","v":0},{"$f":"SUMPRODUCT((N44<$N$10:$N$59)/COUNTIF($N$10:$N$59,$N$10:$N$59))+1","v":1},"No"]
[1,36,{"$f":"'AP36'!$AB$3","v":0},{"$f":"'AP36'!$N$3","v":0},{"$f":"'AP36'!$F$13","v":""},{"$f":"'AP36'!$Y$17","v":0},{"$f":"'AP36'!$E$25","v":0},{"$f":"'AP36'!$Z$25","v":0},{"$f":"'AP36'!$J$40","v":0},{"$f":"'AP36'!$Q$51","v":0},{"$f":"'AP36'!$K$67","v":0},{"$f":"'AP36'!$K$77","v":0},{"$f":"'AP36'!$D$81","v":0},{"$f":"'AP36'!$AG$3","v":0},{"$f":"SUMPRODUCT((N45<$N$10:$N$59)/COUNTIF($N$10:$N$59,$N$10:$N$59))+1","v":1},"No"]
[1,37,{"$f":"'AP37'!$AB$3","v":0},{"$f":"'AP37'!$N$3","v":0},{"$f":"'AP37'!$F$13","v":""},{"$f":"'AP37'!$Y$17","v":0},{"$f":"'AP37'!$E$25","v":0},{"$f":"'AP37'!$Z$25","v":0},{"$f":"'AP37'!$J$40","v":0},{"$f":"'AP37'!$Q$51","v":0},{"$f":"'AP37'!$K$67","v":0},{"$f":"'AP37'!$K$77","v":0},{"$f":"'AP37'!$D$81","v":0},{"$f":"'AP37'!$AG$3","v":0},{"$f":"SUMPRODUCT((N46<$N$10:$N$59)/COUNTIF($N$10:$N$59,$N$10:$N$59))+1","v":1},"No"]
[1,38,{"$f":"'AP38'!$AB$3","v":0},{"$f":"'AP38'!$N$3","v":0},{"$f":"'AP38'!$F$13","v":""},{"$f":"'AP38'!$Y$17","v":0},{"$f":"'AP38'!$E$25","v":0},{"$f":"'AP38'!$Z$25","v":0},{"$f":"'AP38'!$J$40","v":0},{"$f":"'AP38'!$Q$51","v":0},{"$f":"'AP38'!$K$67","v":0},{"$f":"'AP38'!$K$77","v":0},{"$f":"'AP38'!$D$81","v":0},{"$f":"'AP38'!$AG$3","v":0},{"$f":"SUMPRODUCT((N47<$N$10:$N$59)/COUNTIF($N$10:$N$59,$N$10:$N$59))+1","v":1},"No"]
[1,39,{"$f":"'AP39'!$AB$3","v":0},{"$f":"'AP39'!$N$3","v":0},{"$f":"'AP39'!$F$13","v":""},{"$f":"'AP39'!$Y$17","v":0},{"$f":"'AP39'!$E$25","v":0},{"$f":"'AP39'!$Z$25","v":0},{"$f":"'AP39'!$J$40","v":0},{"$f":"'AP39'!$Q$51","v":0},{"$f":"'AP39'!$K$67","v":0},{"$f":"'AP39'!$K$77","v":0},{"$f":"'AP39'!$D$81","v":0},{"$f":"'AP39'!$AG$3","v":0},{"$f":"SUMPRODUCT((N48<$N$10:$N$59)/COUNTIF($N$10:$N$59,$N$10:$N$59))+1","v":1},"No"]
[1,40,{"$f":"'AP40'!$AB$3","v":0},{"$f":"'AP40'!$N$3","v":0},{"$f":"'AP40'!$F$13","v":""},{"$f":"'AP40'!$Y$17","v":0},{"$f":"'AP40'!$E$25","v":0},{"$f":"'AP40'!$Z$25","v":0},{"$f":"'AP40'!$J$40","v":0},{"$f":"'AP40'!$Q$51","v":0},{"$f":"'AP40'!$K$67","v":0},{"$f":"'AP40'!$K$77","v":0},{"$f":"'AP40'!$D$81","v":0},{"$f":"'AP40'!$AG$3","v":0},{"$f":"SUMPRODUCT((N49<$N$10:$N$59)/COUNTIF($N$10:$N$59,$N$10:$N$59))+1","v":1},"No"]
[1,41,{"$f":"'AP41'!$AB$3","v":0},{"$f":"'AP41'!$N$3","v":0},{"$f":"'AP41'!$F$13","v":""},{"$f":"'AP41'!$Y$17","v":0},{"$f":"'AP41'!$E$25","v":0},{"$f":"'AP41'!$Z$25","v":0},{"$f":"'AP41'!$J$40","v":0},{"$f":"'AP41'!$Q$51","v":0},{"$f":"'AP41'!$K$67","v":0},{"$f":"'AP41'!$K$77","v":0},{"$f":"'AP41'!$D$81","v":0},{"$f":"'AP41'!$AG$3","v":0},{"$f":"SUMPRODUCT((N50<$N$10:$N$59)/COUNTIF($N$10:$N$59,$N$10:$N$59))+1","v":1},"No"]
[1,42,{"$f":"'AP42'!$AB$3","v":0},{"$f":"'AP42'!$N$3","v":0},{"$f":"'AP42'!$F$13","v":""},{"$f":"'AP42'!$Y$17","v":0},{"$f":"'AP42'!$E$25","v":0},{"$f":"'AP42'!$Z$25","v":0},{"$f":"'AP42'!$J$40","v":0},{"$f":"'AP42'!$Q$51","v":0},{"$f":"'AP42'!$K$67","v":0},{"$f":"'AP42'!$K$77","v":0},{"$f":"'AP42'!$D$81","v":0},{"$f":"'AP42'!$AG$3","v":0},{"$f":"SUMPRODUCT((N51<$N$10:$N$59)/COUNTIF($N$10:$N$59,$N$10:$N$59))+1","v":1},"No"]
[1,43,{"$f":"'AP43'!$AB$3","v":0},{"$f":"'AP43'!$N$3","v":0},{"$f":"'AP43'!$F$13","v":""},{"$f":"'AP43'!$Y$17","v":0},{"$f":"'AP43'!$E$25","v":0},{"$f":"'AP43'!$Z$25","v":0},{"$f":"'AP43'!$J$40","v":0},{"$f":"'AP43'!$Q$51","v":0},{"$f":"'AP43'!$K$67","v":0},{"$f":"'AP43'!$K$77","v":0},{"$f":"'AP43'!$D$81","v":0},{"$f":"'AP43'!$AG$3","v":0},{"$f":"SUMPRODUCT((N52<$N$10:$N$59)/COUNTIF($N$10:$N$59,$N$10:$N$59))+1","v":1},"No"]
[1,44,{"$f":"'AP44'!$AB$3","v":0},{"$f":"'AP44'!$N$3","v":0},{"$f":"'AP44'!$F$13","v":""},{"$f":"'AP44'!$Y$17","v":0},{"$f":"'AP44'!$E$25","v":0},{"$f":"'AP44'!$Z$25","v":0},{"$f":"'AP44'!$J$40","v":0},{"$f":"'AP44'!$Q$51","v":0},{"$f":"'AP44'!$K$67","v":0},{"$f":"'AP44'!$K$77","v":0},{"$f":"'AP44'!$D$81","v":0},{"$f":"'AP44'!$AG$3","v":0},{"$f":"SUMPRODUCT((N53<$N$10:$N$59)/COUNTIF($N$10:$N$59,$N$10:$N$59))+1","v":1},"No"]
[1,45,{"$f":"'AP45'!$AB$3","v":0},{"$f":"'AP45'!$N$3","v":0},{"$f":"'AP45'!$F$13","v":""},{"$f":"'AP45'!$Y$17","v":0},{"$f":"'AP45'!$E$25","v":0},{"$f":"'AP45'!$Z$25","v":0},{"$f":"'AP45'!$J$40","v":0},{"$f":"'AP45'!$Q$51","v":0},{"$f":"'AP45'!$K$67","v":0},{"$f":"'AP45'!$K$77","v":0},{"$f":"'AP45'!$D$81","v":0},{"$f":"'AP45'!$AG$3","v":0},{"$f":"SUMPRODUCT((N54<$N$10:$N$59)/COUNTIF($N$10:$N$59,$N$10:$N$59))+1","v":1},"No"]
[1,46,{"$f":"'AP46'!$AB$3","v":0},{"$f":"'AP46'!$N$3","v":0},{"$f":"'AP46'!$F$13","v":""},{"$f":"'AP46'!$Y$17","v":0},{"$f":"'AP46'!$E$25","v":0},{"$f":"'AP46'!$Z$25","v":0},{"$f":"'AP46'!$J$40","v":0},{"$f":"'AP46'!$Q$51","v":0},{"$f":"'AP46'!$K$67","v":0},{"$f":"'AP46'!$K$77","v":0},{"$f":"'AP46'!$D$81","v":0},{"$f":"'AP46'!$AG$3","v":0},{"$f":"SUMPRODUCT((N55<$N$10:$N$59)/COUNTIF($N$10:$N$59,$N$10:$N$59))+1","v":1},"No"]
[1,47,{"$f":"'AP47'!$AB$3","v":0},{"$f":"'AP47'!$N$3","v":0},{"$f":"'AP47'!$F$13","v":""},{"$f":"'AP47'!$Y$17","v":0},{"$f":"'AP47'!$E$25","v":0},{"$f":"'AP47'!$Z$25","v":0},{"$f":"'AP47'!$J$40","v":0},{"$f":"'AP47'!$Q$51","v":0},{"$f":"'AP47'!$K$67","v":0},{"$f":"'AP47'!$K$77","v":0},{"$f":"'AP47'!$D$81","v":0},{"$f":"'AP47'!$AG$3","v":0},{"$f":"SUMPRODUCT((N56<$N$10:$N$59)/COUNTIF($N$10:$N$59,$N$10:$N$59))+1","v":1},"No"]
[1,48,{"$f":"'AP48'!$AB$3","v":0},{"$f":"'AP48'!$N$3","v":0},{"$f":"'AP48'!$F$13","v":""},{"$f":"'AP48'!$Y$17","v":0},{"$f":"'AP48'!$E$25","v":0},{"$f":"'AP48'!$Z$25","v":0},{"$f":"'AP48'!$J$40","v":0},{"$f":"'AP48'!$Q$51","v":0},{"$f":"'AP48'!$K$67","v":0},{"$f":"'AP48'!$K$77","v":0},{"$f":"'AP48'!$D$81","v":0},{"$f":"'AP48'!$AG$3","v":0},{"$f":"SUMPRODUCT((N57<$N$10:$N$59)/COUNTIF($N$10:$N$59,$N$10:$N$59))+1","v":1},"No"]
[1,49,{"$f":"'AP49'!$AB$3","v":0},{"$f":"'AP49'!$N$3","v":0},{"$f":"'AP49'!$F$13","v":""},{"$f":"'AP49'!$Y$17","v":0},{"$f":"'AP49'!$E$25","v":0},{"$f":"'AP49'!$Z$25","v":0},{"$f":"'AP49'!$J$40","v":0},{"$f":"'AP49'!$Q$51","v":0},{"$f":"'AP49'!$K$67","v":0},{"$f":"'AP49'!$K$77","v":0},{"$f":"'AP49'!$D$81","v":0},{"$f":"'AP49'!$AG$3","v":0},{"$f":"SUMPRODUCT((N58<$N$10:$N$59)/COUNTIF($N$10:$N$59,$N$10:$N$59))+1","v":1},"No"]
[1,50,{"$f":"'AP50'!$AB$3","v":0},{"$f":"'AP50'!$N$3","v":0},{"$f":"'AP50'!$F$13","v":""},{"$f":"'AP50'!$Y$17","v":0},{"$f":"'AP50'!$E$25","v":0},{"$f":"'AP50'!$Z$25","v":0},{"$f":"'AP50'!$J$40","v":0},{"$f":"'AP50'!$Q$51","v":0},{"$f":"'AP50'!$K$67","v":0},{"$f":"'AP50'!$K$77","v":0},{"$f":"'AP50'!$D$81","v":0},{"$f":"'AP50'!$AG$3","v":0},{"$f":"SUMPRODUCT((N59<$N$10:$N$59)/COUNTIF($N$10:$N$59,$N$10:$N$59))+1","v":1},"No"]
[]
[]
[]
[]
[null,null,"HRMPSB Committee:"]

{"sheet":"Matrix_Top5","index":6,"n_rows":23,"n_cols":14,"rows_kept":23,"cut":false,"hidden":false,"merged":[[0,0,0,13],[1,0,1,13],[2,0,2,13],[3,0,3,13],[4,0,4,13],[5,0,5,3],[6,0,8,0],[6,1,8,1],[6,2,8,2],[6,3,7,3],[6,4,7,4],[6,12,7,12],[6,13,8,13],[6,6,7,6],[6,7,7,7],[6,8,7,8],[6,9,7,9],[6,10,7,10],[6,11,7,11],[6,5,7,5]]}
["HUMAN RESOURCE MERIT PROMOTION AND SELECTION BOARD (HRMPSB)"]
["EVALUATION MATRIX"]
[{"$f":"Vacancy!N6&\" - \"&Vacancy!AA6","v":" - "}]
[{"$f":"IF(Vacancy!F14=\"\",\"\",Vacancy!F14)","v":""}]
[{"$f":"\"DATE OF DELIBERATION: \"&\" \"&Vacancy!W14","v":"DATE OF DELIBERATION:  "}]
[]
["#","EMPLOYMENT CATEGORY","NAME","PERFORMANCE RATING (A)","EDUCATION (B)","TRAINING\n(C)","EXPERIENCE\n(D)","ACCOMPLISHMENTS\n(E)","PERSONAL TRAITS\n(F) ","POTENTIALS\n(G)","WRITTEN EXAM\n(H)","PUBLIC SERVICE\n(I)","TOTAL\nPOINTS","RANK"]
[]
[null,null,null,{"$f":"IF(Vacancy!$E$6=\"First Level\",Dictionary!$B$34&\"%\",IF(Vacancy!$E$6=\"Second Level\",Dictionary!$C$34&\"%\",Dictionary!$D$34&\"%\"))","v":"35%"},{"$f":"IF(Vacancy!$E$6=\"First Level\",Dictionary!$B$35&\"%\",IF(Vacancy!$E$6=\"Second Level\",Dictionary!$C$35&\"%\",Dictionary!$D$35&\"%\"))","v":"5%"},{"$f":"IF(Vacancy!$E$6=\"First Level\",Dictionary!$B$36&\"%\",IF(Vacancy!$E$6=\"Second Level\",Dictionary!$C$36&\"%\",Dictionary!$D$36&\"%\"))","v":"10%"},{"$f":"IF(Vacancy!$E$6=\"First Level\",Dictionary!$B$37&\"%\",IF(Vacancy!$E$6=\"Second Level\",Dictionary!$C$37&\"%\",Dictionary!$D$37&\"%\"))","v":"10%"},{"$f":"IF(Vacancy!$E$6=\"First Level\",Dictionary!$B$38&\"%\",IF(Vacancy!$E$6=\"Second Level\",Dictionary!$C$38&\"%\",Dictionary!$D$38&\"%\"))","v":"10%"},{"$f":"IF(Vacancy!$E$6=\"First Level\",Dictionary!$B$39&\"%\",IF(Vacancy!$E$6=\"Second Level\",Dictionary!$C$39&\"%\",Dictionary!$D$39&\"%\"))","v":"10%"},{"$f":"IF(Vacancy!$E$6=\"First Level\",Dictionary!$B$40&\"%\",IF(Vacancy!$E$6=\"Second Level\",Dictionary!$C$40&\"%\",Dictionary!$D$40&\"%\"))","v":"5%"},{"$f":"IF(Vacancy!$E$6=\"First Level\",Dictionary!$B$41&\"%\",IF(Vacancy!$E$6=\"Second Level\",Dictionary!$C$41&\"%\",Dictionary!$D$41&\"%\"))","v":"15%"},"(+10)",1]
[{"$f":"IF(N10=\"\",\"\",N10)","v":""},{"$f":"IFERROR(_xlfn._xlws.SORT(_xlfn._xlws.FILTER(Matrix_All!$C$10:$P$59,Matrix_All!$P$10:$P$59=\"Ok\"),13,1,FALSE),\"\")","v":""}]
[{"$f":"IF(N11=\"\",\"\",N11)","v":""}]
[""]
[""]
[""]
[""]
[""]
[""]
[{"$f":"IF(N18=\"\",\"\",N18)","v":""}]
[]
[]
[]
[]
[null,"HRMPSB Committee:"]

{"sheet":"MatrixTop5_Blank","index":7,"n_rows":26,"n_cols":14,"rows_kept":26,"cut":false,"hidden":false,"merged":[[6,4,7,4],[6,12,7,12],[6,13,8,13],[6,6,7,6],[6,7,7,7],[6,8,7,8],[6,9,7,9],[6,10,7,10],[6,11,7,11],[6,5,7,5],[5,0,5,3],[6,0,8,0],[6,1,8,1],[6,2,8,2],[6,3,7,3],[0,0,0,13],[1,0,1,13],[2,0,2,13],[3,0,3,13],[4,0,4,13]]}
["HUMAN RESOURCE MERIT PROMOTION AND SELECTION BOARD (HRMPSB)"]
["EVALUATION MATRIX"]
[{"$f":"Vacancy!N6&\" - \"&Vacancy!AA6","v":" - "}]
[{"$f":"IF(Vacancy!F14=\"\",\"\",Vacancy!F14)","v":""}]
[{"$f":"\"DATE OF DELIBERATION: \"&\" \"&Vacancy!W14","v":"DATE OF DELIBERATION:  "}]
[]
["#","EMPLOYMENT CATEGORY","NAME","PERFORMANCE RATING (A)","EDUCATION (B)","TRAINING\n(C)","EXPERIENCE\n(D)","ACCOMPLISHMENTS\n(E)","PERSONAL TRAITS\n(F) ","POTENTIALS\n(G)","WRITTEN EXAM\n(H)","PUBLIC SERVICE\n(I)","TOTAL\nPOINTS","RANK"]
[]
[null,null,null,{"$f":"IF(Vacancy!$E$6=\"First Level\",Dictionary!$B$34&\"%\",IF(Vacancy!$E$6=\"Second Level\",Dictionary!$C$34&\"%\",Dictionary!$D$34&\"%\"))","v":"35%"},{"$f":"IF(Vacancy!$E$6=\"First Level\",Dictionary!$B$35&\"%\",IF(Vacancy!$E$6=\"Second Level\",Dictionary!$C$35&\"%\",Dictionary!$D$35&\"%\"))","v":"5%"},{"$f":"IF(Vacancy!$E$6=\"First Level\",Dictionary!$B$36&\"%\",IF(Vacancy!$E$6=\"Second Level\",Dictionary!$C$36&\"%\",Dictionary!$D$36&\"%\"))","v":"10%"},{"$f":"IF(Vacancy!$E$6=\"First Level\",Dictionary!$B$37&\"%\",IF(Vacancy!$E$6=\"Second Level\",Dictionary!$C$37&\"%\",Dictionary!$D$37&\"%\"))","v":"10%"},{"$f":"IF(Vacancy!$E$6=\"First Level\",Dictionary!$B$38&\"%\",IF(Vacancy!$E$6=\"Second Level\",Dictionary!$C$38&\"%\",Dictionary!$D$38&\"%\"))","v":"10%"},{"$f":"IF(Vacancy!$E$6=\"First Level\",Dictionary!$B$39&\"%\",IF(Vacancy!$E$6=\"Second Level\",Dictionary!$C$39&\"%\",Dictionary!$D$39&\"%\"))","v":"10%"},{"$f":"IF(Vacancy!$E$6=\"First Level\",Dictionary!$B$40&\"%\",IF(Vacancy!$E$6=\"Second Level\",Dictionary!$C$40&\"%\",Dictionary!$D$40&\"%\"))","v":"5%"},{"$f":"IF(Vacancy!$E$6=\"First Level\",Dictionary!$B$41&\"%\",IF(Vacancy!$E$6=\"Second Level\",Dictionary!$C$41&\"%\",Dictionary!$D$41&\"%\"))","v":"15%"},"(+10)",1]
[{"$f":"IF(N10=\"\",\"\",N10)","v":""},""]
[{"$f":"IF(N11=\"\",\"\",N11)","v":""}]
[""]
[""]
[""]
[""]
[""]
[""]
[""]
[]
[]
[]
[]
[]
[]
[]
[null,"HRMPSB Committee:"]

{"sheet":"AP1","index":8,"n_rows":81,"n_cols":33,"rows_kept":81,"cut":false,"hidden":false,"merged":[[47,28,47,29],[48,4,48,5],[48,6,48,7],[48,8,48,9],[48,10,48,11],[48,13,48,14],[48,15,48,16],[48,17,48,18],[48,19,48,20],[48,22,48,23],[48,24,48,25],[48,26,48,27],[48,28,48,29],[46,22,46,23],[46,24,46,25],[46,26,46,27],[50,16,50,17],[47,24,47,25],[47,26,47,27],[45,24,45,25],[45,26,45,27],[45,28,45,29],[46,28,46,29],[47,4,47,5],[47,6,47,7],[47,8,47,9],[47,10,47,11],[47,13,47,14],[47,15,47,16],[47,17,47,18],[47,19,47,20],[47,22,47,23],[46,15,46,16],[46,17,46,18],[46,19,46,20],[46,4,46,5],[46,6,46,7],[46,8,46,9],[46,10,46,11],[46,13,46,14],[12,15,12,22],[14,15,14,22],[35,4,37,7],[45,4,45,5],[45,6,45,7],[45,8,45,9],[45,10,45,11],[45,13,45,14],[45,15,45,16],[45,17,45,18],[45,19,45,20],[45,22,45,23],[19,19,19,22],[10,15,10,22],[1,2,1,29],[2,4,2,9],[2,13,2,22],[2,32,2,33],[6,11,6,22],[2,27,2,30]]}
[]
[null,null,"MSP CALCULATOR"]
[null,null,"Levels",":",{"$f":"IF(Vacancy!E6=\"\",\"\",Vacancy!E6)","v":""},null,null,null,null,null,null,"Name",":",null,null,null,null,null,null,null,null,null,null,null,null,null,"Employment Category:",null,null,null,null,null,{"$f":"SUM(F13,Y11,Y13,Y15,E25,Z25,J40,Q51,K67,K77,D81)","v":0}]
[null,null,null,null,null,null,null,null,null,null,null,null,null,null,null,null,null,null,null,null,null,null,null,null,null,null,null,null,null,null,null,null,"TOTAL MATRIX POINTS"]
[null,null,{"$f":"IF(E3=\"First Level\",\"A. Performance Rating (20 pts)\",IF(E3=\"Second Level\",\"A. Performance Rating (15 pts)\",\"A. Performance Rating (35 pts)\"))","v":"A. Performance Rating (35 pts)"},null,null,null,null,null,null,null,null,{"$f":"IF(E3=\"First Level\",\"B. Education (15 pts.)\",IF(E3=\"Second Level\",\"B. Education (10 pts.)\",\"B. Education (5 pts.)\"))","v":"B. Education (5 pts.)"}]
[null,null,"New Graduates (No previous work experience)",null,null,null,null,null,null,null,null,"Required:"]
[false,null,null,null,null,null,null,{"$f":"IF(F9>=2.75,1,IF(F9>=2.5,3,IF(F9>=2.25,5,IF(F9>=2,7,IF(F9>=1.75,9,IF(F9>=1.5,11,IF(F9>=1.25,13,IF(F9>=1,15))))))))","v":false},null,null,null,{"$f":"IF(Vacancy!E10=\"\",\"\",Vacancy!E10)","v":""}]
[]
[null,null,"GWA",null,null,null,{"$f":"IF(F9>=2.75,2,IF(F9>=2.5,5,IF(F9>=2.25,8,IF(F9>=2,11,IF(F9>=1.75,14,IF(F9>=1.5,16,IF(F9>=1.25,18,IF(F9>=1,20))))))))","v":false},{"$f":"IF(E3=\"First Level\",(20*F11)/5,IF(E3=\"Second Level\",(15*F11)/5,IF(E3=\"Executive/Managerial\",(35*F11)/5,\"\")))","v":""},null,null,null,"Highest Educational Attainment:",null,null,null,null,null,null,null,null,null,null,null,null,"Total Score:"]
[]
[null,null,"Last Rating Period",null,null,null,null,{"$f":"IFERROR(IF(AND(A7=TRUE,E3=\"First Level\"),G9,IF(AND(A7=TRUE,E3=\"Second Level\"),H7,H9)),\"\")","v":""},null,null,null,"First Level:",null,null,null,null,null,null,null,null,null,null,null,{"$f":"VLOOKUP(P11,Educ_2!$A$11:$B$26,2,FALSE)","v":{"$error":"#N/A"}},{"$f":"IFERROR(VLOOKUP($L$7,Educ_2!$A$1:$Q$8,X11+1,FALSE),\"\")","v":""}]
[]
[false,null,"Total Score",null,":",{"$f":"IF(H11=FALSE,0,H11)","v":""},"pts.",null,null,null,null,"Second Level:",null,null,null,null,null,null,null,null,null,null,null,{"$f":"VLOOKUP(P13,Educ_2!$A$11:$B$26,2,FALSE)","v":{"$error":"#N/A"}},{"$f":"IFERROR(VLOOKUP($L$7,Educ_2!$A$1:$Q$8,X13+1,FALSE),\"\")","v":""}]
[]
[null,null,null,null,null,null,null,null,null,null,null,"Executive/Managerial:",null,null,null,null,null,null,null,null,null,null,null,{"$f":"VLOOKUP(P15,Educ_2!$A$11:$B$26,2,FALSE)","v":{"$error":"#N/A"}},{"$f":"IFERROR(VLOOKUP($L$7,Educ_2!$A$1:$Q$8,X15+1,FALSE),\"\")","v":""}]
[]
[null,null,null,null,null,null,null,null,null,null,null,null,null,null,null,null,null,null,null,null,null,null,null,null,{"$f":"SUM(Y11,Y13,Y15)","v":0}]
[]
[null,null,"C. Training (10 pts.)",null,null,null,null,null,null,null,null,null,null,null,null,null,null,null,null,null,null,null,null,null,{"$f":"IF(E3=\"Executive/Managerial\",\"D. Experience (10 pts)\",\"D. Experience (25 pts)\")","v":"D. Experience (25 pts)"}]
[null,null,null,null,null,null,null,null,null,null,null,null,null,null,null,null,null,null,null,"Coversion to YEAR"]
[true,null,null,null,{"$f":"IF(Vacancy!$R$10=\"None required\",0,IF(Vacancy!$R$10=\"\",\"\",Vacancy!$R$10))","v":""},"Required (hrs.)",null,null,null,null,null,null,null,null,null,null,null,null,null,null,"Year",null,{"$f":"T21","v":0},null,null,{"$f":"IF(Vacancy!$AA$10=\"None required\",0,IF(Vacancy!$AA$10=\"\",\"\",Vacancy!$AA$10))","v":""},"Required Exp."]
[]
[null,null,null,{"$f":"E23-E21","v":{"$error":"#VALUE!"}},null,"Relevant training hrs. acquired",null,null,null,null,null,null,null,null,null,null,null,null,null,null,"Month",null,{"$f":"T23/12","v":0},null,{"$f":"Z23-Z21","v":{"$error":"#VALUE!"}},{"$f":"SUM(W21,W23,W25)","v":0},"Relevant years of experience"]
[]
[null,null,null,null,{"$f":"IF(N3=\"\",0,IFERROR(IF(E21=E23,5,IF(E23>=E21,((5*D23)/Trg_Exp!$D$2)+5,0)),0))","v":0},"Total",null,null,null,null,null,null,null,null,null,null,null,null,null,null,"Day",null,{"$f":"T25/365","v":0},null,{"$f":"IFERROR(IF(AND(Z21=Z23),10,IF(Vacancy!E6=\"Executive/Managerial\",((10*Y23)/Trg_Exp!$K$2),IF(Z23>=Z21,((15*Y23)/Trg_Exp!$K$2)+10,0))),0)","v":0},{"$f":"IF(N3=\"\",0,IF(Y25<0,0,Y25))","v":0},"Total Score:"]
[]
[null,null,{"$f":"IF(Vacancy!E6=\"Second Level\",\"E. Accomplishment (15 pts.)\",\"E. Accomplishment (10 pts.)\")","v":"E. Accomplishment (10 pts.)"}]
[]
[null,null,null,null,"E.1  Awards/Citations/Commendations"]
[]
[false,null,null,null,"E.1.1. Unit Level",null,null,null,null,{"$f":"IF(A31=TRUE,1,\"\")","v":""}]
[]
[false,null,null,null,"E.1.2. University Level",null,null,null,null,{"$f":"IF(A33=TRUE,3,\"\")","v":""}]
[]
[false,null,null,null,"E.1.3. National/CSC Level",null,null,null,null,{"$f":"IF(A35=TRUE,5,\"\")","v":""}]
[null,null,null,null,"E.2. Innovations/ Systems Improvement"]
[false,null,null,null,null,null,null,null,null,{"$f":"IF(A37=TRUE,IF(Vacancy!E6=\"Second Level\",4,3),\"\")","v":""}]
[null,null,null,null,null,null,null,null,null,null,{"$f":"IF(E3=\"Second Level\",((SUM(J31,J33,J35)*11)/9),((SUM(J31,J33,J35)*7)/9))","v":0}]
[]
[null,null,null,null,"C.2. Total Score:",null,null,null,null,{"$f":"IF(E3=\"Second Level\",(15*SUM(K38,J37)/15),(10*SUM(K38,J37)/10))","v":0}]
[]
[null,null,{"$f":"IF(E3=\"Executive/Managerial\",\"F. Physical Characteristics and Personality Traits (10 pts.)\",\"F. Physical Characteristics and Personality Traits (5 pts.)\")","v":"F. Physical Characteristics and Personality Traits (5 pts.)"}]
[]
[null,null,null,null,"Supervisor",null,"Co-worker 1",null,"Co-worker 2",null,"Co-worker 3",null,null,"Supervisor",null,"Co-worker 1",null,"Co-worker 2",null,"Co-worker 3",null,null,"Supervisor",null,"Co-worker 1",null,"Co-worker 2",null,"Co-worker 3"]
[null,null,null,null,"ATTITUDE",null,null,null,null,null,null,null,null,"COMMITMENT",null,null,null,null,null,null,null,null,"APPEARANCE"]
[null,null,null,"F.1.1. ",null,null,null,null,null,null,null,null,"F.2.1. ",null,null,null,null,null,null,null,null,"F.3.1. "]
[null,null,null,"F.1.2. ",null,null,null,null,null,null,null,null,"F.2.2. ",null,null,null,null,null,null,null,null,"F.3.2. "]
[null,null,null,"F.1.3. ",null,null,null,null,null,null,null,null,"F.2.3. "]
[null,null,null,null,{"$f":"IF($E$3=\"Executive/Managerial\",(4*(SUM(E46:F48)/12)),(2*(SUM(E46:F48)/12)))","v":0},null,{"$f":"IF($E$3=\"Executive/Managerial\",(4*(SUM(G46:H48)/12)),(2*(SUM(G46:H48)/12)))","v":0},null,{"$f":"IF($E$3=\"Executive/Managerial\",(4*(SUM(I46:J48)/12)),(2*(SUM(I46:J48)/12)))","v":0},null,{"$f":"IF($E$3=\"Executive/Managerial\",(4*(SUM(K46:L48)/12)),(2*(SUM(K46:L48)/12)))","v":0},null,null,{"$f":"IF($E$3=\"Executive/Managerial\",(4*(SUM(N46:O48)/12)),(2*(SUM(N46:O48)/12)))","v":0},null,{"$f":"IF($E$3=\"Executive/Managerial\",(4*(SUM(P46:Q48)/12)),(2*(SUM(P46:Q48)/12)))","v":0},null,{"$f":"IF($E$3=\"Executive/Managerial\",(4*(SUM(R46:S48)/12)),(2*(SUM(R46:S48)/12)))","v":0},null,{"$f":"IF($E$3=\"Executive/Managerial\",(4*(SUM(T46:U48)/12)),(2*(SUM(T46:U48)/12)))","v":0},null,null,{"$f":"IF($E$3=\"Executive/Managerial\",(2*(SUM(W46:X48))/8),(1*(SUM(W46:X48))/8))","v":0},null,{"$f":"IF($E$3=\"Executive/Managerial\",(2*(SUM(Y46:Z48))/8),(1*(SUM(Y46:Z48))/8))","v":0},null,{"$f":"IF($E$3=\"Executive/Managerial\",(2*(SUM(AA46:AB48))/8),(1*(SUM(AA46:AB48))/8))","v":0},null,{"$f":"IF($E$3=\"Executive/Managerial\",(2*(SUM(AC46:AD48))/8),(1*(SUM(AC46:AD48))/8))","v":0}]
[null,null,null,null,null,null,"Supervisor",null,"Co-worker"]
[null,null,null,null,"Attitude",null,{"$f":"E49","v":0},null,{"$f":"SUM(G49:L49)/3","v":0},null,null,null,null,"Total Score PCPT:",null,null,{"$f":"IF(E3=\"Executive/Managerial\",SUM(G54:J54),SUM(G54:J54))","v":0}]
[null,null,null,null,"Commitment",null,{"$f":"N49","v":0},null,{"$f":"SUM(P49:U49)/3","v":0}]
[null,null,null,null,"Appearance",null,{"$f":"W49","v":0},null,{"$f":"SUM(Y49:AD49)/3","v":0}]
[null,null,null,null,null,null,{"$f":"SUM(G51:G53)*0.6","v":0},null,{"$f":"SUM(I51:I53)*0.4","v":0}]
[null,null,{"$f":"IF(E3=\"First Level\",\"G. Potential [Assessment Form No. 2] (3 pts.)\",\"G. Potential [Assessment Form No. 2] (5 pts.)\")","v":"G. Potential [Assessment Form No. 2] (5 pts.)"}]
[]
[null,null,null,"INTERVIEW"]
[]
[null,null,null,null,"G.1.1. Sound judgement",null,null,null,null,null,null,{"$f":"IF($E$3=\"First Level\",\"Not Applicable for First Level position\",\"\")","v":""}]
[null,null,null,null,"G.1.2. Analytical mind",null,null,null,null,null,null,{"$f":"IF($E$3=\"First Level\",\"Not Applicable for First Level position\",\"\")","v":""}]
[null,null,null,null,"G.1.3. The ability to motivate co-workers",null,null,null,null,null,null,{"$f":"IF($E$3=\"First Level\",\"Not Applicable for First Level position\",\"\")","v":""}]
[null,null,null,null,"G.1.4. Unifying Factor",null,null,null,null,null,null,{"$f":"IF($E$3=\"First Level\",\"Not Applicable for First Level position\",\"\")","v":""}]
[null,null,null,null,"G.1.5. Vision/foresight",null,null,null,null,null,null,{"$f":"IF($E$3=\"First Level\",\"Not Applicable for First Level position\",\"\")","v":""}]
[null,null,null,null,"G.2. Resourcefulness"]
[null,null,null,null,"G.3. Creativity/ Ingenuity "]
[]
[null,null,null,"TOTAL POINTS FOR POTENTIAL",null,null,null,null,null,null,{"$f":"IF(E3=\"First Level\",(3*(SUM(K64:K65)/8)),(5*(SUM(K59:K65)/28)))","v":0}]
[]
[null,null,{"$f":"IF(E3=\"First Level\",\"H. Written/ Skills Examination (12 pts.)\",\"H. Written/ Skills Examination (15 pts.)\")","v":"H. Written/ Skills Examination (15 pts.)"}]
[null,null,null,null,null,null,null,null,null,null,{"$f":"IFERROR(SUM(K59:K65)/7,0)","v":0}]
[null,null,null,"WRITTEN/SKILLS EXAMINATION"]
[]
[null,null,null,null,"Perfect/Entire Score",null,null,"="]
[null,null,null,null,"Raw Score",null,null,"="]
[]
[]
[null,null,null,"TOTAL FOR EXAMINATION",null,null,null,null,null,null,{"$f":"IFERROR(IF(E3=\"First Level\",IF(K74>K73,0,(K74*12)/K73),IF(K74>K73,0,(K74*15)/K73)),0)","v":0}]
[]
[null,null,"I. Public Service"]
[]
[null,null,null,null,"Additional Pts. in excess of Total Score"]

{"sheet":"AP2","index":9,"n_rows":81,"n_cols":33,"rows_kept":81,"cut":false,"hidden":false,"merged":[[1,2,1,29],[2,4,2,9],[2,13,2,22],[2,27,2,30],[2,32,2,33],[45,4,45,5],[45,6,45,7],[45,8,45,9],[45,10,45,11],[45,13,45,14],[10,15,10,22],[12,15,12,22],[14,15,14,22],[19,19,19,22],[35,4,37,7],[45,28,45,29],[45,24,45,25],[45,26,45,27],[6,11,6,22],[46,4,46,5],[46,6,46,7],[46,8,46,9],[46,10,46,11],[46,13,46,14],[46,17,46,18],[46,19,46,20],[46,22,46,23],[45,15,45,16],[45,17,45,18],[45,19,45,20],[45,22,45,23],[46,24,46,25],[46,26,46,27],[46,28,46,29],[47,4,47,5],[47,6,47,7],[47,8,47,9],[47,10,47,11],[47,13,47,14],[47,15,47,16],[47,17,47,18],[47,19,47,20],[47,22,47,23],[47,24,47,25],[47,26,47,27],[47,28,47,29],[46,15,46,16],[48,4,48,5],[48,6,48,7],[48,8,48,9],[48,10,48,11],[48,13,48,14],[48,28,48,29],[50,16,50,17],[48,15,48,16],[48,17,48,18],[48,19,48,20],[48,22,48,23],[48,24,48,25],[48,26,48,27]]}
[]
[null,null,"MSP CALCULATOR"]
[null,null,"Levels",":",{"$f":"IF(Vacancy!E6=\"\",\"\",Vacancy!E6)","v":""},null,null,null,null,null,null,"Name",":",null,null,null,null,null,null,null,null,null,null,null,null,null,"Employment Category:",null,null,null,null,null,{"$f":"SUM(F13,Y11,Y13,Y15,E25,Z25,J40,Q51,K67,K77,D81)","v":0}]
[null,null,null,null,null,null,null,null,null,null,null,null,null,null,null,null,null,null,null,null,null,null,null,null,null,null,null,null,null,null,null,null,"TOTAL MATRIX POINTS"]
[null,null,{"$f":"IF(E3=\"First Level\",\"A. Performance Rating (20 pts)\",IF(E3=\"Second Level\",\"A. Performance Rating (15 pts)\",\"A. Performance Rating (35 pts)\"))","v":"A. Performance Rating (35 pts)"},null,null,null,null,null,null,null,null,{"$f":"IF(E3=\"First Level\",\"B. Education (15 pts.)\",IF(E3=\"Second Level\",\"B. Education (10 pts.)\",\"B. Education (5 pts.)\"))","v":"B. Education (5 pts.)"}]
[null,null,"New Graduates (No previous work experience)",null,null,null,null,null,null,null,null,"Required:"]
[false,null,null,null,null,null,null,{"$f":"IF(F9>=2.75,1,IF(F9>=2.5,3,IF(F9>=2.25,5,IF(F9>=2,7,IF(F9>=1.75,9,IF(F9>=1.5,11,IF(F9>=1.25,13,IF(F9>=1,15))))))))","v":false},null,null,null,{"$f":"IF(Vacancy!E10=\"\",\"\",Vacancy!E10)","v":""}]
[]
[null,null,"GWA",null,null,null,{"$f":"IF(F9>=2.75,2,IF(F9>=2.5,5,IF(F9>=2.25,8,IF(F9>=2,11,IF(F9>=1.75,14,IF(F9>=1.5,16,IF(F9>=1.25,18,IF(F9>=1,20))))))))","v":false},{"$f":"IF(E3=\"First Level\",(20*F11)/5,IF(E3=\"Second Level\",(15*F11)/5,IF(E3=\"Executive/Managerial\",(35*F11)/5,\"\")))","v":""},null,null,null,"Highest Educational Attainment:",null,null,null,null,null,null,null,null,null,null,null,null,"Total Score:"]
[]
[null,null,"Last Rating Period",null,null,null,null,{"$f":"IFERROR(IF(AND(A7=TRUE,E3=\"First Level\"),G9,IF(AND(A7=TRUE,E3=\"Second Level\"),H7,H9)),\"\")","v":""},null,null,null,"First Level:",null,null,null,null,null,null,null,null,null,null,null,{"$f":"VLOOKUP(P11,Educ_2!$A$11:$B$26,2,FALSE)","v":{"$error":"#N/A"}},{"$f":"IFERROR(VLOOKUP($L$7,Educ_2!$A$1:$Q$8,X11+1,FALSE),\"\")","v":""}]
[]
[false,null,"Total Score",null,":",{"$f":"IF(H11=FALSE,0,H11)","v":""},"pts.",null,null,null,null,"Second Level:",null,null,null,null,null,null,null,null,null,null,null,{"$f":"VLOOKUP(P13,Educ_2!$A$11:$B$26,2,FALSE)","v":{"$error":"#N/A"}},{"$f":"IFERROR(VLOOKUP($L$7,Educ_2!$A$1:$Q$8,X13+1,FALSE),\"\")","v":""}]
[]
[null,null,null,null,null,null,null,null,null,null,null,"Executive/Managerial:",null,null,null,null,null,null,null,null,null,null,null,{"$f":"VLOOKUP(P15,Educ_2!$A$11:$B$26,2,FALSE)","v":{"$error":"#N/A"}},{"$f":"IFERROR(VLOOKUP($L$7,Educ_2!$A$1:$Q$8,X15+1,FALSE),\"\")","v":""}]
[]
[null,null,null,null,null,null,null,null,null,null,null,null,null,null,null,null,null,null,null,null,null,null,null,null,{"$f":"SUM(Y11,Y13,Y15)","v":0}]
[]
[null,null,"C. Training (10 pts.)",null,null,null,null,null,null,null,null,null,null,null,null,null,null,null,null,null,null,null,null,null,{"$f":"IF(E3=\"Executive/Managerial\",\"D. Experience (10 pts)\",\"D. Experience (25 pts)\")","v":"D. Experience (25 pts)"}]
[null,null,null,null,null,null,null,null,null,null,null,null,null,null,null,null,null,null,null,"Coversion to YEAR"]
[true,null,null,null,{"$f":"IF(Vacancy!$R$10=\"None required\",0,IF(Vacancy!$R$10=\"\",\"\",Vacancy!$R$10))","v":""},"Required (hrs.)",null,null,null,null,null,null,null,null,null,null,null,null,null,null,"Year",null,{"$f":"T21","v":0},null,null,{"$f":"IF(Vacancy!$AA$10=\"None required\",0,IF(Vacancy!$AA$10=\"\",\"\",Vacancy!$AA$10))","v":""},"Required Exp."]
[]
[null,null,null,{"$f":"E23-E21","v":{"$error":"#VALUE!"}},null,"Relevant training hrs. acquired",null,null,null,null,null,null,null,null,null,null,null,null,null,null,"Month",null,{"$f":"T23/12","v":0},null,{"$f":"Z23-Z21","v":{"$error":"#VALUE!"}},{"$f":"SUM(W21,W23,W25)","v":0},"Relevant years of experience"]
[]
[null,null,null,null,{"$f":"IF(N3=\"\",0,IFERROR(IF(E21=E23,5,IF(E23>=E21,((5*D23)/Trg_Exp!$D$2)+5,0)),0))","v":0},"Total",null,null,null,null,null,null,null,null,null,null,null,null,null,null,"Day",null,{"$f":"T25/365","v":0},null,{"$f":"IFERROR(IF(AND(Z21=Z23),10,IF(Vacancy!E6=\"Executive/Managerial\",((10*Y23)/Trg_Exp!$K$2),IF(Z23>=Z21,((15*Y23)/Trg_Exp!$K$2)+10,0))),0)","v":0},{"$f":"IF(N3=\"\",0,IF(Y25<0,0,Y25))","v":0},"Total Score:"]
[]
[null,null,{"$f":"IF(Vacancy!E6=\"Second Level\",\"E. Accomplishment (15 pts.)\",\"E. Accomplishment (10 pts.)\")","v":"E. Accomplishment (10 pts.)"}]
[]
[null,null,null,null,"E.1  Awards/Citations/Commendations"]
[]
[false,null,null,null,"E.1.1. Unit Level",null,null,null,null,{"$f":"IF(A31=TRUE,1,\"\")","v":""}]
[]
[false,null,null,null,"E.1.2. University Level",null,null,null,null,{"$f":"IF(A33=TRUE,3,\"\")","v":""}]
[]
[false,null,null,null,"E.1.3. National/CSC Level",null,null,null,null,{"$f":"IF(A35=TRUE,5,\"\")","v":""}]
[null,null,null,null,"E.2. Innovations/ Systems Improvement"]
[false,null,null,null,null,null,null,null,null,{"$f":"IF(A37=TRUE,IF(Vacancy!E6=\"Second Level\",4,3),\"\")","v":""}]
[null,null,null,null,null,null,null,null,null,null,{"$f":"IF(E3=\"Second Level\",((SUM(J31,J33,J35)*11)/9),((SUM(J31,J33,J35)*7)/9))","v":0}]
[]
[null,null,null,null,"C.2. Total Score:",null,null,null,null,{"$f":"IF(E3=\"Second Level\",(15*SUM(K38,J37)/15),(10*SUM(K38,J37)/10))","v":0}]
[]
[null,null,{"$f":"IF(E3=\"Executive/Managerial\",\"F. Physical Characteristics and Personality Traits (10 pts.)\",\"F. Physical Characteristics and Personality Traits (5 pts.)\")","v":"F. Physical Characteristics and Personality Traits (5 pts.)"}]
[]
[null,null,null,null,"Supervisor",null,"Co-worker 1",null,"Co-worker 2",null,"Co-worker 3",null,null,"Supervisor",null,"Co-worker 1",null,"Co-worker 2",null,"Co-worker 3",null,null,"Supervisor",null,"Co-worker 1",null,"Co-worker 2",null,"Co-worker 3"]
[null,null,null,null,"ATTITUDE",null,null,null,null,null,null,null,null,"COMMITMENT",null,null,null,null,null,null,null,null,"APPEARANCE"]
[null,null,null,"F.1.1. ",null,null,null,null,null,null,null,null,"F.2.1. ",null,null,null,null,null,null,null,null,"F.3.1. "]
[null,null,null,"F.1.2. ",null,null,null,null,null,null,null,null,"F.2.2. ",null,null,null,null,null,null,null,null,"F.3.2. "]
[null,null,null,"F.1.3. ",null,null,null,null,null,null,null,null,"F.2.3. "]
[null,null,null,null,{"$f":"IF($E$3=\"Executive/Managerial\",(4*(SUM(E46:F48)/12)),(2*(SUM(E46:F48)/12)))","v":0},null,{"$f":"IF($E$3=\"Executive/Managerial\",(4*(SUM(G46:H48)/12)),(2*(SUM(G46:H48)/12)))","v":0},null,{"$f":"IF($E$3=\"Executive/Managerial\",(4*(SUM(I46:J48)/12)),(2*(SUM(I46:J48)/12)))","v":0},null,{"$f":"IF($E$3=\"Executive/Managerial\",(4*(SUM(K46:L48)/12)),(2*(SUM(K46:L48)/12)))","v":0},null,null,{"$f":"IF($E$3=\"Executive/Managerial\",(4*(SUM(N46:O48)/12)),(2*(SUM(N46:O48)/12)))","v":0},null,{"$f":"IF($E$3=\"Executive/Managerial\",(4*(SUM(P46:Q48)/12)),(2*(SUM(P46:Q48)/12)))","v":0},null,{"$f":"IF($E$3=\"Executive/Managerial\",(4*(SUM(R46:S48)/12)),(2*(SUM(R46:S48)/12)))","v":0},null,{"$f":"IF($E$3=\"Executive/Managerial\",(4*(SUM(T46:U48)/12)),(2*(SUM(T46:U48)/12)))","v":0},null,null,{"$f":"IF($E$3=\"Executive/Managerial\",(2*(SUM(W46:X48))/8),(1*(SUM(W46:X48))/8))","v":0},null,{"$f":"IF($E$3=\"Executive/Managerial\",(2*(SUM(Y46:Z48))/8),(1*(SUM(Y46:Z48))/8))","v":0},null,{"$f":"IF($E$3=\"Executive/Managerial\",(2*(SUM(AA46:AB48))/8),(1*(SUM(AA46:AB48))/8))","v":0},null,{"$f":"IF($E$3=\"Executive/Managerial\",(2*(SUM(AC46:AD48))/8),(1*(SUM(AC46:AD48))/8))","v":0}]
[null,null,null,null,null,null,"Supervisor",null,"Co-worker"]
[null,null,null,null,"Attitude",null,{"$f":"E49","v":0},null,{"$f":"SUM(G49:L49)/3","v":0},null,null,null,null,"Total Score PCPT:",null,null,{"$f":"IF(E3=\"Executive/Managerial\",SUM(G54:J54),SUM(G54:J54))","v":0}]
[null,null,null,null,"Commitment",null,{"$f":"N49","v":0},null,{"$f":"SUM(P49:U49)/3","v":0}]
[null,null,null,null,"Appearance",null,{"$f":"W49","v":0},null,{"$f":"SUM(Y49:AD49)/3","v":0}]
[null,null,null,null,null,null,{"$f":"SUM(G51:G53)*0.6","v":0},null,{"$f":"SUM(I51:I53)*0.4","v":0}]
[null,null,{"$f":"IF(E3=\"First Level\",\"G. Potential [Assessment Form No. 2] (3 pts.)\",\"G. Potential [Assessment Form No. 2] (5 pts.)\")","v":"G. Potential [Assessment Form No. 2] (5 pts.)"}]
[]
[null,null,null,"INTERVIEW"]
[]
[null,null,null,null,"G.1.1. Sound judgement",null,null,null,null,null,null,{"$f":"IF($E$3=\"First Level\",\"Not Applicable for First Level position\",\"\")","v":""}]
[null,null,null,null,"G.1.2. Analytical mind",null,null,null,null,null,null,{"$f":"IF($E$3=\"First Level\",\"Not Applicable for First Level position\",\"\")","v":""}]
[null,null,null,null,"G.1.3. The ability to motivate co-workers",null,null,null,null,null,null,{"$f":"IF($E$3=\"First Level\",\"Not Applicable for First Level position\",\"\")","v":""}]
[null,null,null,null,"G.1.4. Unifying Factor",null,null,null,null,null,null,{"$f":"IF($E$3=\"First Level\",\"Not Applicable for First Level position\",\"\")","v":""}]
[null,null,null,null,"G.1.5. Vision/foresight",null,null,null,null,null,null,{"$f":"IF($E$3=\"First Level\",\"Not Applicable for First Level position\",\"\")","v":""}]
[null,null,null,null,"G.2. Resourcefulness"]
[null,null,null,null,"G.3. Creativity/ Ingenuity "]
[]
[null,null,null,"TOTAL POINTS FOR POTENTIAL",null,null,null,null,null,null,{"$f":"IF(E3=\"First Level\",(3*(SUM(K64:K65)/8)),(5*(SUM(K59:K65)/28)))","v":0}]
[]
[null,null,{"$f":"IF(E3=\"First Level\",\"H. Written/ Skills Examination (12 pts.)\",\"H. Written/ Skills Examination (15 pts.)\")","v":"H. Written/ Skills Examination (15 pts.)"}]
[null,null,null,null,null,null,null,null,null,null,{"$f":"IFERROR(SUM(K59:K65)/7,0)","v":0}]
[null,null,null,"WRITTEN/SKILLS EXAMINATION"]
[]
[null,null,null,null,"Perfect/Entire Score",null,null,"="]
[null,null,null,null,"Raw Score",null,null,"="]
[]
[]
[null,null,null,"TOTAL FOR EXAMINATION",null,null,null,null,null,null,{"$f":"IFERROR(IF(E3=\"First Level\",IF(K74>K73,0,(K74*12)/K73),IF(K74>K73,0,(K74*15)/K73)),0)","v":0}]
[]
[null,null,"I. Public Service"]
[]
[null,null,null,null,"Additional Pts. in excess of Total Score"]

{"sheet":"AP3","index":10,"n_rows":81,"n_cols":33,"rows_kept":81,"cut":false,"hidden":false,"merged":[[1,2,1,29],[2,4,2,9],[2,13,2,22],[2,27,2,30],[2,32,2,33],[45,4,45,5],[45,6,45,7],[45,8,45,9],[45,10,45,11],[45,13,45,14],[10,15,10,22],[12,15,12,22],[14,15,14,22],[19,19,19,22],[35,4,37,7],[45,28,45,29],[45,24,45,25],[45,26,45,27],[6,11,6,22],[46,4,46,5],[46,6,46,7],[46,8,46,9],[46,10,46,11],[46,13,46,14],[46,17,46,18],[46,19,46,20],[46,22,46,23],[45,15,45,16],[45,17,45,18],[45,19,45,20],[45,22,45,23],[46,24,46,25],[46,26,46,27],[46,28,46,29],[47,4,47,5],[47,6,47,7],[47,8,47,9],[47,10,47,11],[47,13,47,14],[47,15,47,16],[47,17,47,18],[47,19,47,20],[47,22,47,23],[47,24,47,25],[47,26,47,27],[47,28,47,29],[46,15,46,16],[48,4,48,5],[48,6,48,7],[48,8,48,9],[48,10,48,11],[48,13,48,14],[48,28,48,29],[50,16,50,17],[48,15,48,16],[48,17,48,18],[48,19,48,20],[48,22,48,23],[48,24,48,25],[48,26,48,27]]}
[]
[null,null,"MSP CALCULATOR"]
[null,null,"Levels",":",{"$f":"IF(Vacancy!E6=\"\",\"\",Vacancy!E6)","v":""},null,null,null,null,null,null,"Name",":",null,null,null,null,null,null,null,null,null,null,null,null,null,"Employment Category:",null,null,null,null,null,{"$f":"SUM(F13,Y11,Y13,Y15,E25,Z25,J40,Q51,K67,K77,D81)","v":0}]
[null,null,null,null,null,null,null,null,null,null,null,null,null,null,null,null,null,null,null,null,null,null,null,null,null,null,null,null,null,null,null,null,"TOTAL MATRIX POINTS"]
[null,null,{"$f":"IF(E3=\"First Level\",\"A. Performance Rating (20 pts)\",IF(E3=\"Second Level\",\"A. Performance Rating (15 pts)\",\"A. Performance Rating (35 pts)\"))","v":"A. Performance Rating (35 pts)"},null,null,null,null,null,null,null,null,{"$f":"IF(E3=\"First Level\",\"B. Education (15 pts.)\",IF(E3=\"Second Level\",\"B. Education (10 pts.)\",\"B. Education (5 pts.)\"))","v":"B. Education (5 pts.)"}]
[null,null,"New Graduates (No previous work experience)",null,null,null,null,null,null,null,null,"Required:"]
[false,null,null,null,null,null,null,{"$f":"IF(F9>=2.75,1,IF(F9>=2.5,3,IF(F9>=2.25,5,IF(F9>=2,7,IF(F9>=1.75,9,IF(F9>=1.5,11,IF(F9>=1.25,13,IF(F9>=1,15))))))))","v":false},null,null,null,{"$f":"IF(Vacancy!E10=\"\",\"\",Vacancy!E10)","v":""}]
[]
[null,null,"GWA",null,null,null,{"$f":"IF(F9>=2.75,2,IF(F9>=2.5,5,IF(F9>=2.25,8,IF(F9>=2,11,IF(F9>=1.75,14,IF(F9>=1.5,16,IF(F9>=1.25,18,IF(F9>=1,20))))))))","v":false},{"$f":"IF(E3=\"First Level\",(20*F11)/5,IF(E3=\"Second Level\",(15*F11)/5,IF(E3=\"Executive/Managerial\",(35*F11)/5,\"\")))","v":""},null,null,null,"Highest Educational Attainment:",null,null,null,null,null,null,null,null,null,null,null,null,"Total Score:"]
[]
[null,null,"Last Rating Period",null,null,null,null,{"$f":"IFERROR(IF(AND(A7=TRUE,E3=\"First Level\"),G9,IF(AND(A7=TRUE,E3=\"Second Level\"),H7,H9)),\"\")","v":""},null,null,null,"First Level:",null,null,null,null,null,null,null,null,null,null,null,{"$f":"VLOOKUP(P11,Educ_2!$A$11:$B$26,2,FALSE)","v":{"$error":"#N/A"}},{"$f":"IFERROR(VLOOKUP($L$7,Educ_2!$A$1:$Q$8,X11+1,FALSE),\"\")","v":""}]
[]
[false,null,"Total Score",null,":",{"$f":"IF(H11=FALSE,0,H11)","v":""},"pts.",null,null,null,null,"Second Level:",null,null,null,null,null,null,null,null,null,null,null,{"$f":"VLOOKUP(P13,Educ_2!$A$11:$B$26,2,FALSE)","v":{"$error":"#N/A"}},{"$f":"IFERROR(VLOOKUP($L$7,Educ_2!$A$1:$Q$8,X13+1,FALSE),\"\")","v":""}]
[]
[null,null,null,null,null,null,null,null,null,null,null,"Executive/Managerial:",null,null,null,null,null,null,null,null,null,null,null,{"$f":"VLOOKUP(P15,Educ_2!$A$11:$B$26,2,FALSE)","v":{"$error":"#N/A"}},{"$f":"IFERROR(VLOOKUP($L$7,Educ_2!$A$1:$Q$8,X15+1,FALSE),\"\")","v":""}]
[]
[null,null,null,null,null,null,null,null,null,null,null,null,null,null,null,null,null,null,null,null,null,null,null,null,{"$f":"SUM(Y11,Y13,Y15)","v":0}]
[]
[null,null,"C. Training (10 pts.)",null,null,null,null,null,null,null,null,null,null,null,null,null,null,null,null,null,null,null,null,null,{"$f":"IF(E3=\"Executive/Managerial\",\"D. Experience (10 pts)\",\"D. Experience (25 pts)\")","v":"D. Experience (25 pts)"}]
[null,null,null,null,null,null,null,null,null,null,null,null,null,null,null,null,null,null,null,"Coversion to YEAR"]
[true,null,null,null,{"$f":"IF(Vacancy!$R$10=\"None required\",0,IF(Vacancy!$R$10=\"\",\"\",Vacancy!$R$10))","v":""},"Required (hrs.)",null,null,null,null,null,null,null,null,null,null,null,null,null,null,"Year",null,{"$f":"T21","v":0},null,null,{"$f":"IF(Vacancy!$AA$10=\"None required\",0,IF(Vacancy!$AA$10=\"\",\"\",Vacancy!$AA$10))","v":""},"Required Exp."]
[]
[null,null,null,{"$f":"E23-E21","v":{"$error":"#VALUE!"}},null,"Relevant training hrs. acquired",null,null,null,null,null,null,null,null,null,null,null,null,null,null,"Month",null,{"$f":"T23/12","v":0},null,{"$f":"Z23-Z21","v":{"$error":"#VALUE!"}},{"$f":"SUM(W21,W23,W25)","v":0},"Relevant years of experience"]
[]
[null,null,null,null,{"$f":"IF(N3=\"\",0,IFERROR(IF(E21=E23,5,IF(E23>=E21,((5*D23)/Trg_Exp!$D$2)+5,0)),0))","v":0},"Total",null,null,null,null,null,null,null,null,null,null,null,null,null,null,"Day",null,{"$f":"T25/365","v":0},null,{"$f":"IFERROR(IF(AND(Z21=Z23),10,IF(Vacancy!E6=\"Executive/Managerial\",((10*Y23)/Trg_Exp!$K$2),IF(Z23>=Z21,((15*Y23)/Trg_Exp!$K$2)+10,0))),0)","v":0},{"$f":"IF(N3=\"\",0,IF(Y25<0,0,Y25))","v":0},"Total Score:"]
[]
[null,null,{"$f":"IF(Vacancy!E6=\"Second Level\",\"E. Accomplishment (15 pts.)\",\"E. Accomplishment (10 pts.)\")","v":"E. Accomplishment (10 pts.)"}]
[]
[null,null,null,null,"E.1  Awards/Citations/Commendations"]
[]
[false,null,null,null,"E.1.1. Unit Level",null,null,null,null,{"$f":"IF(A31=TRUE,1,\"\")","v":""}]
[]
[false,null,null,null,"E.1.2. University Level",null,null,null,null,{"$f":"IF(A33=TRUE,3,\"\")","v":""}]
[]
[false,null,null,null,"E.1.3. National/CSC Level",null,null,null,null,{"$f":"IF(A35=TRUE,5,\"\")","v":""}]
[null,null,null,null,"E.2. Innovations/ Systems Improvement"]
[false,null,null,null,null,null,null,null,null,{"$f":"IF(A37=TRUE,IF(Vacancy!E6=\"Second Level\",4,3),\"\")","v":""}]
[null,null,null,null,null,null,null,null,null,null,{"$f":"IF(E3=\"Second Level\",((SUM(J31,J33,J35)*11)/9),((SUM(J31,J33,J35)*7)/9))","v":0}]
[]
[null,null,null,null,"C.2. Total Score:",null,null,null,null,{"$f":"IF(E3=\"Second Level\",(15*SUM(K38,J37)/15),(10*SUM(K38,J37)/10))","v":0}]
[]
[null,null,{"$f":"IF(E3=\"Executive/Managerial\",\"F. Physical Characteristics and Personality Traits (10 pts.)\",\"F. Physical Characteristics and Personality Traits (5 pts.)\")","v":"F. Physical Characteristics and Personality Traits (5 pts.)"}]
[]
[null,null,null,null,"Supervisor",null,"Co-worker 1",null,"Co-worker 2",null,"Co-worker 3",null,null,"Supervisor",null,"Co-worker 1",null,"Co-worker 2",null,"Co-worker 3",null,null,"Supervisor",null,"Co-worker 1",null,"Co-worker 2",null,"Co-worker 3"]
[null,null,null,null,"ATTITUDE",null,null,null,null,null,null,null,null,"COMMITMENT",null,null,null,null,null,null,null,null,"APPEARANCE"]
[null,null,null,"F.1.1. ",null,null,null,null,null,null,null,null,"F.2.1. ",null,null,null,null,null,null,null,null,"F.3.1. "]
[null,null,null,"F.1.2. ",null,null,null,null,null,null,null,null,"F.2.2. ",null,null,null,null,null,null,null,null,"F.3.2. "]
[null,null,null,"F.1.3. ",null,null,null,null,null,null,null,null,"F.2.3. "]
[null,null,null,null,{"$f":"IF($E$3=\"Executive/Managerial\",(4*(SUM(E46:F48)/12)),(2*(SUM(E46:F48)/12)))","v":0},null,{"$f":"IF($E$3=\"Executive/Managerial\",(4*(SUM(G46:H48)/12)),(2*(SUM(G46:H48)/12)))","v":0},null,{"$f":"IF($E$3=\"Executive/Managerial\",(4*(SUM(I46:J48)/12)),(2*(SUM(I46:J48)/12)))","v":0},null,{"$f":"IF($E$3=\"Executive/Managerial\",(4*(SUM(K46:L48)/12)),(2*(SUM(K46:L48)/12)))","v":0},null,null,{"$f":"IF($E$3=\"Executive/Managerial\",(4*(SUM(N46:O48)/12)),(2*(SUM(N46:O48)/12)))","v":0},null,{"$f":"IF($E$3=\"Executive/Managerial\",(4*(SUM(P46:Q48)/12)),(2*(SUM(P46:Q48)/12)))","v":0},null,{"$f":"IF($E$3=\"Executive/Managerial\",(4*(SUM(R46:S48)/12)),(2*(SUM(R46:S48)/12)))","v":0},null,{"$f":"IF($E$3=\"Executive/Managerial\",(4*(SUM(T46:U48)/12)),(2*(SUM(T46:U48)/12)))","v":0},null,null,{"$f":"IF($E$3=\"Executive/Managerial\",(2*(SUM(W46:X48))/8),(1*(SUM(W46:X48))/8))","v":0},null,{"$f":"IF($E$3=\"Executive/Managerial\",(2*(SUM(Y46:Z48))/8),(1*(SUM(Y46:Z48))/8))","v":0},null,{"$f":"IF($E$3=\"Executive/Managerial\",(2*(SUM(AA46:AB48))/8),(1*(SUM(AA46:AB48))/8))","v":0},null,{"$f":"IF($E$3=\"Executive/Managerial\",(2*(SUM(AC46:AD48))/8),(1*(SUM(AC46:AD48))/8))","v":0}]
[null,null,null,null,null,null,"Supervisor",null,"Co-worker"]
[null,null,null,null,"Attitude",null,{"$f":"E49","v":0},null,{"$f":"SUM(G49:L49)/3","v":0},null,null,null,null,"Total Score PCPT:",null,null,{"$f":"IF(E3=\"Executive/Managerial\",SUM(G54:J54),SUM(G54:J54))","v":0}]
[null,null,null,null,"Commitment",null,{"$f":"N49","v":0},null,{"$f":"SUM(P49:U49)/3","v":0}]
[null,null,null,null,"Appearance",null,{"$f":"W49","v":0},null,{"$f":"SUM(Y49:AD49)/3","v":0}]
[null,null,null,null,null,null,{"$f":"SUM(G51:G53)*0.6","v":0},null,{"$f":"SUM(I51:I53)*0.4","v":0}]
[null,null,{"$f":"IF(E3=\"First Level\",\"G. Potential [Assessment Form No. 2] (3 pts.)\",\"G. Potential [Assessment Form No. 2] (5 pts.)\")","v":"G. Potential [Assessment Form No. 2] (5 pts.)"}]
[]
[null,null,null,"INTERVIEW"]
[]
[null,null,null,null,"G.1.1. Sound judgement",null,null,null,null,null,null,{"$f":"IF($E$3=\"First Level\",\"Not Applicable for First Level position\",\"\")","v":""}]
[null,null,null,null,"G.1.2. Analytical mind",null,null,null,null,null,null,{"$f":"IF($E$3=\"First Level\",\"Not Applicable for First Level position\",\"\")","v":""}]
[null,null,null,null,"G.1.3. The ability to motivate co-workers",null,null,null,null,null,null,{"$f":"IF($E$3=\"First Level\",\"Not Applicable for First Level position\",\"\")","v":""}]
[null,null,null,null,"G.1.4. Unifying Factor",null,null,null,null,null,null,{"$f":"IF($E$3=\"First Level\",\"Not Applicable for First Level position\",\"\")","v":""}]
[null,null,null,null,"G.1.5. Vision/foresight",null,null,null,null,null,null,{"$f":"IF($E$3=\"First Level\",\"Not Applicable for First Level position\",\"\")","v":""}]
[null,null,null,null,"G.2. Resourcefulness"]
[null,null,null,null,"G.3. Creativity/ Ingenuity "]
[]
[null,null,null,"TOTAL POINTS FOR POTENTIAL",null,null,null,null,null,null,{"$f":"IF(E3=\"First Level\",(3*(SUM(K64:K65)/8)),(5*(SUM(K59:K65)/28)))","v":0}]
[]
[null,null,{"$f":"IF(E3=\"First Level\",\"H. Written/ Skills Examination (12 pts.)\",\"H. Written/ Skills Examination (15 pts.)\")","v":"H. Written/ Skills Examination (15 pts.)"}]
[null,null,null,null,null,null,null,null,null,null,{"$f":"IFERROR(SUM(K59:K65)/7,0)","v":0}]
[null,null,null,"WRITTEN/SKILLS EXAMINATION"]
[]
[null,null,null,null,"Perfect/Entire Score",null,null,"="]
[null,null,null,null,"Raw Score",null,null,"="]
[]
[]
[null,null,null,"TOTAL FOR EXAMINATION",null,null,null,null,null,null,{"$f":"IFERROR(IF(E3=\"First Level\",IF(K74>K73,0,(K74*12)/K73),IF(K74>K73,0,(K74*15)/K73)),0)","v":0}]
[]
[null,null,"I. Public Service"]
[]
[null,null,null,null,"Additional Pts. in excess of Total Score"]

{"sheet":"AP4","index":11,"n_rows":81,"n_cols":33,"rows_kept":81,"cut":false,"hidden":false,"merged":[[1,2,1,29],[2,4,2,9],[2,13,2,22],[2,27,2,30],[2,32,2,33],[45,4,45,5],[45,6,45,7],[45,8,45,9],[45,10,45,11],[45,13,45,14],[10,15,10,22],[12,15,12,22],[14,15,14,22],[19,19,19,22],[35,4,37,7],[45,28,45,29],[45,24,45,25],[45,26,45,27],[6,11,6,22],[46,4,46,5],[46,6,46,7],[46,8,46,9],[46,10,46,11],[46,13,46,14],[46,17,46,18],[46,19,46,20],[46,22,46,23],[45,15,45,16],[45,17,45,18],[45,19,45,20],[45,22,45,23],[46,24,46,25],[46,26,46,27],[46,28,46,29],[47,4,47,5],[47,6,47,7],[47,8,47,9],[47,10,47,11],[47,13,47,14],[47,15,47,16],[47,17,47,18],[47,19,47,20],[47,22,47,23],[47,24,47,25],[47,26,47,27],[47,28,47,29],[46,15,46,16],[48,4,48,5],[48,6,48,7],[48,8,48,9],[48,10,48,11],[48,13,48,14],[48,28,48,29],[50,16,50,17],[48,15,48,16],[48,17,48,18],[48,19,48,20],[48,22,48,23],[48,24,48,25],[48,26,48,27]]}
[]
[null,null,"MSP CALCULATOR"]
[null,null,"Levels",":",{"$f":"IF(Vacancy!E6=\"\",\"\",Vacancy!E6)","v":""},null,null,null,null,null,null,"Name",":",null,null,null,null,null,null,null,null,null,null,null,null,null,"Employment Category:",null,null,null,null,null,{"$f":"SUM(F13,Y11,Y13,Y15,E25,Z25,J40,Q51,K67,K77,D81)","v":0}]
[null,null,null,null,null,null,null,null,null,null,null,null,null,null,null,null,null,null,null,null,null,null,null,null,null,null,null,null,null,null,null,null,"TOTAL MATRIX POINTS"]
[null,null,{"$f":"IF(E3=\"First Level\",\"A. Performance Rating (20 pts)\",IF(E3=\"Second Level\",\"A. Performance Rating (15 pts)\",\"A. Performance Rating (35 pts)\"))","v":"A. Performance Rating (35 pts)"},null,null,null,null,null,null,null,null,{"$f":"IF(E3=\"First Level\",\"B. Education (15 pts.)\",IF(E3=\"Second Level\",\"B. Education (10 pts.)\",\"B. Education (5 pts.)\"))","v":"B. Education (5 pts.)"}]
[null,null,"New Graduates (No previous work experience)",null,null,null,null,null,null,null,null,"Required:"]
[false,null,null,null,null,null,null,{"$f":"IF(F9>=2.75,1,IF(F9>=2.5,3,IF(F9>=2.25,5,IF(F9>=2,7,IF(F9>=1.75,9,IF(F9>=1.5,11,IF(F9>=1.25,13,IF(F9>=1,15))))))))","v":false},null,null,null,{"$f":"IF(Vacancy!E10=\"\",\"\",Vacancy!E10)","v":""}]
[]
[null,null,"GWA",null,null,null,{"$f":"IF(F9>=2.75,2,IF(F9>=2.5,5,IF(F9>=2.25,8,IF(F9>=2,11,IF(F9>=1.75,14,IF(F9>=1.5,16,IF(F9>=1.25,18,IF(F9>=1,20))))))))","v":false},{"$f":"IF(E3=\"First Level\",(20*F11)/5,IF(E3=\"Second Level\",(15*F11)/5,IF(E3=\"Executive/Managerial\",(35*F11)/5,\"\")))","v":""},null,null,null,"Highest Educational Attainment:",null,null,null,null,null,null,null,null,null,null,null,null,"Total Score:"]
[]
[null,null,"Last Rating Period",null,null,null,null,{"$f":"IFERROR(IF(AND(A7=TRUE,E3=\"First Level\"),G9,IF(AND(A7=TRUE,E3=\"Second Level\"),H7,H9)),\"\")","v":""},null,null,null,"First Level:",null,null,null,null,null,null,null,null,null,null,null,{"$f":"VLOOKUP(P11,Educ_2!$A$11:$B$26,2,FALSE)","v":{"$error":"#N/A"}},{"$f":"IFERROR(VLOOKUP($L$7,Educ_2!$A$1:$Q$8,X11+1,FALSE),\"\")","v":""}]
[]
[false,null,"Total Score",null,":",{"$f":"IF(H11=FALSE,0,H11)","v":""},"pts.",null,null,null,null,"Second Level:",null,null,null,null,null,null,null,null,null,null,null,{"$f":"VLOOKUP(P13,Educ_2!$A$11:$B$26,2,FALSE)","v":{"$error":"#N/A"}},{"$f":"IFERROR(VLOOKUP($L$7,Educ_2!$A$1:$Q$8,X13+1,FALSE),\"\")","v":""}]
[]
[null,null,null,null,null,null,null,null,null,null,null,"Executive/Managerial:",null,null,null,null,null,null,null,null,null,null,null,{"$f":"VLOOKUP(P15,Educ_2!$A$11:$B$26,2,FALSE)","v":{"$error":"#N/A"}},{"$f":"IFERROR(VLOOKUP($L$7,Educ_2!$A$1:$Q$8,X15+1,FALSE),\"\")","v":""}]
[]
[null,null,null,null,null,null,null,null,null,null,null,null,null,null,null,null,null,null,null,null,null,null,null,null,{"$f":"SUM(Y11,Y13,Y15)","v":0}]
[]
[null,null,"C. Training (10 pts.)",null,null,null,null,null,null,null,null,null,null,null,null,null,null,null,null,null,null,null,null,null,{"$f":"IF(E3=\"Executive/Managerial\",\"D. Experience (10 pts)\",\"D. Experience (25 pts)\")","v":"D. Experience (25 pts)"}]
[null,null,null,null,null,null,null,null,null,null,null,null,null,null,null,null,null,null,null,"Coversion to YEAR"]
[true,null,null,null,{"$f":"IF(Vacancy!$R$10=\"None required\",0,IF(Vacancy!$R$10=\"\",\"\",Vacancy!$R$10))","v":""},"Required (hrs.)",null,null,null,null,null,null,null,null,null,null,null,null,null,null,"Year",null,{"$f":"T21","v":0},null,null,{"$f":"IF(Vacancy!$AA$10=\"None required\",0,IF(Vacancy!$AA$10=\"\",\"\",Vacancy!$AA$10))","v":""},"Required Exp."]
[]
[null,null,null,{"$f":"E23-E21","v":{"$error":"#VALUE!"}},null,"Relevant training hrs. acquired",null,null,null,null,null,null,null,null,null,null,null,null,null,null,"Month",null,{"$f":"T23/12","v":0},null,{"$f":"Z23-Z21","v":{"$error":"#VALUE!"}},{"$f":"SUM(W21,W23,W25)","v":0},"Relevant years of experience"]
[]
[null,null,null,null,{"$f":"IF(N3=\"\",0,IFERROR(IF(E21=E23,5,IF(E23>=E21,((5*D23)/Trg_Exp!$D$2)+5,0)),0))","v":0},"Total",null,null,null,null,null,null,null,null,null,null,null,null,null,null,"Day",null,{"$f":"T25/365","v":0},null,{"$f":"IFERROR(IF(AND(Z21=Z23),10,IF(Vacancy!E6=\"Executive/Managerial\",((10*Y23)/Trg_Exp!$K$2),IF(Z23>=Z21,((15*Y23)/Trg_Exp!$K$2)+10,0))),0)","v":0},{"$f":"IF(N3=\"\",0,IF(Y25<0,0,Y25))","v":0},"Total Score:"]
[]
[null,null,{"$f":"IF(Vacancy!E6=\"Second Level\",\"E. Accomplishment (15 pts.)\",\"E. Accomplishment (10 pts.)\")","v":"E. Accomplishment (10 pts.)"}]
[]
[null,null,null,null,"E.1  Awards/Citations/Commendations"]
[]
[false,null,null,null,"E.1.1. Unit Level",null,null,null,null,{"$f":"IF(A31=TRUE,1,\"\")","v":""}]
[]
[false,null,null,null,"E.1.2. University Level",null,null,null,null,{"$f":"IF(A33=TRUE,3,\"\")","v":""}]
[]
[false,null,null,null,"E.1.3. National/CSC Level",null,null,null,null,{"$f":"IF(A35=TRUE,5,\"\")","v":""}]
[null,null,null,null,"E.2. Innovations/ Systems Improvement"]
[false,null,null,null,null,null,null,null,null,{"$f":"IF(A37=TRUE,IF(Vacancy!E6=\"Second Level\",4,3),\"\")","v":""}]
[null,null,null,null,null,null,null,null,null,null,{"$f":"IF(E3=\"Second Level\",((SUM(J31,J33,J35)*11)/9),((SUM(J31,J33,J35)*7)/9))","v":0}]
[]
[null,null,null,null,"C.2. Total Score:",null,null,null,null,{"$f":"IF(E3=\"Second Level\",(15*SUM(K38,J37)/15),(10*SUM(K38,J37)/10))","v":0}]
[]
[null,null,{"$f":"IF(E3=\"Executive/Managerial\",\"F. Physical Characteristics and Personality Traits (10 pts.)\",\"F. Physical Characteristics and Personality Traits (5 pts.)\")","v":"F. Physical Characteristics and Personality Traits (5 pts.)"}]
[]
[null,null,null,null,"Supervisor",null,"Co-worker 1",null,"Co-worker 2",null,"Co-worker 3",null,null,"Supervisor",null,"Co-worker 1",null,"Co-worker 2",null,"Co-worker 3",null,null,"Supervisor",null,"Co-worker 1",null,"Co-worker 2",null,"Co-worker 3"]
[null,null,null,null,"ATTITUDE",null,null,null,null,null,null,null,null,"COMMITMENT",null,null,null,null,null,null,null,null,"APPEARANCE"]
[null,null,null,"F.1.1. ",null,null,null,null,null,null,null,null,"F.2.1. ",null,null,null,null,null,null,null,null,"F.3.1. "]
[null,null,null,"F.1.2. ",null,null,null,null,null,null,null,null,"F.2.2. ",null,null,null,null,null,null,null,null,"F.3.2. "]
[null,null,null,"F.1.3. ",null,null,null,null,null,null,null,null,"F.2.3. "]
[null,null,null,null,{"$f":"IF($E$3=\"Executive/Managerial\",(4*(SUM(E46:F48)/12)),(2*(SUM(E46:F48)/12)))","v":0},null,{"$f":"IF($E$3=\"Executive/Managerial\",(4*(SUM(G46:H48)/12)),(2*(SUM(G46:H48)/12)))","v":0},null,{"$f":"IF($E$3=\"Executive/Managerial\",(4*(SUM(I46:J48)/12)),(2*(SUM(I46:J48)/12)))","v":0},null,{"$f":"IF($E$3=\"Executive/Managerial\",(4*(SUM(K46:L48)/12)),(2*(SUM(K46:L48)/12)))","v":0},null,null,{"$f":"IF($E$3=\"Executive/Managerial\",(4*(SUM(N46:O48)/12)),(2*(SUM(N46:O48)/12)))","v":0},null,{"$f":"IF($E$3=\"Executive/Managerial\",(4*(SUM(P46:Q48)/12)),(2*(SUM(P46:Q48)/12)))","v":0},null,{"$f":"IF($E$3=\"Executive/Managerial\",(4*(SUM(R46:S48)/12)),(2*(SUM(R46:S48)/12)))","v":0},null,{"$f":"IF($E$3=\"Executive/Managerial\",(4*(SUM(T46:U48)/12)),(2*(SUM(T46:U48)/12)))","v":0},null,null,{"$f":"IF($E$3=\"Executive/Managerial\",(2*(SUM(W46:X48))/8),(1*(SUM(W46:X48))/8))","v":0},null,{"$f":"IF($E$3=\"Executive/Managerial\",(2*(SUM(Y46:Z48))/8),(1*(SUM(Y46:Z48))/8))","v":0},null,{"$f":"IF($E$3=\"Executive/Managerial\",(2*(SUM(AA46:AB48))/8),(1*(SUM(AA46:AB48))/8))","v":0},null,{"$f":"IF($E$3=\"Executive/Managerial\",(2*(SUM(AC46:AD48))/8),(1*(SUM(AC46:AD48))/8))","v":0}]
[null,null,null,null,null,null,"Supervisor",null,"Co-worker"]
[null,null,null,null,"Attitude",null,{"$f":"E49","v":0},null,{"$f":"SUM(G49:L49)/3","v":0},null,null,null,null,"Total Score PCPT:",null,null,{"$f":"IF(E3=\"Executive/Managerial\",SUM(G54:J54),SUM(G54:J54))","v":0}]
[null,null,null,null,"Commitment",null,{"$f":"N49","v":0},null,{"$f":"SUM(P49:U49)/3","v":0}]
[null,null,null,null,"Appearance",null,{"$f":"W49","v":0},null,{"$f":"SUM(Y49:AD49)/3","v":0}]
[null,null,null,null,null,null,{"$f":"SUM(G51:G53)*0.6","v":0},null,{"$f":"SUM(I51:I53)*0.4","v":0}]
[null,null,{"$f":"IF(E3=\"First Level\",\"G. Potential [Assessment Form No. 2] (3 pts.)\",\"G. Potential [Assessment Form No. 2] (5 pts.)\")","v":"G. Potential [Assessment Form No. 2] (5 pts.)"}]
[]
[null,null,null,"INTERVIEW"]
[]
[null,null,null,null,"G.1.1. Sound judgement",null,null,null,null,null,null,{"$f":"IF($E$3=\"First Level\",\"Not Applicable for First Level position\",\"\")","v":""}]
[null,null,null,null,"G.1.2. Analytical mind",null,null,null,null,null,null,{"$f":"IF($E$3=\"First Level\",\"Not Applicable for First Level position\",\"\")","v":""}]
[null,null,null,null,"G.1.3. The ability to motivate co-workers",null,null,null,null,null,null,{"$f":"IF($E$3=\"First Level\",\"Not Applicable for First Level position\",\"\")","v":""}]
[null,null,null,null,"G.1.4. Unifying Factor",null,null,null,null,null,null,{"$f":"IF($E$3=\"First Level\",\"Not Applicable for First Level position\",\"\")","v":""}]
[null,null,null,null,"G.1.5. Vision/foresight",null,null,null,null,null,null,{"$f":"IF($E$3=\"First Level\",\"Not Applicable for First Level position\",\"\")","v":""}]
[null,null,null,null,"G.2. Resourcefulness"]
[null,null,null,null,"G.3. Creativity/ Ingenuity "]
[]
[null,null,null,"TOTAL POINTS FOR POTENTIAL",null,null,null,null,null,null,{"$f":"IF(E3=\"First Level\",(3*(SUM(K64:K65)/8)),(5*(SUM(K59:K65)/28)))","v":0}]
[]
[null,null,{"$f":"IF(E3=\"First Level\",\"H. Written/ Skills Examination (12 pts.)\",\"H. Written/ Skills Examination (15 pts.)\")","v":"H. Written/ Skills Examination (15 pts.)"}]
[null,null,null,null,null,null,null,null,null,null,{"$f":"IFERROR(SUM(K59:K65)/7,0)","v":0}]
[null,null,null,"WRITTEN/SKILLS EXAMINATION"]
[]
[null,null,null,null,"Perfect/Entire Score",null,null,"="]
[null,null,null,null,"Raw Score",null,null,"="]
[]
[]
[null,null,null,"TOTAL FOR EXAMINATION",null,null,null,null,null,null,{"$f":"IFERROR(IF(E3=\"First Level\",IF(K74>K73,0,(K74*12)/K73),IF(K74>K73,0,(K74*15)/K73)),0)","v":0}]
[]
[null,null,"I. Public Service"]
[]
[null,null,null,null,"Additional Pts. in excess of Total Score"]

{"sheet":"AP5","index":12,"n_rows":81,"n_cols":33,"rows_kept":81,"cut":false,"hidden":false,"merged":[[1,2,1,29],[2,4,2,9],[2,13,2,22],[2,27,2,30],[2,32,2,33],[45,4,45,5],[45,6,45,7],[45,8,45,9],[45,10,45,11],[45,13,45,14],[10,15,10,22],[12,15,12,22],[14,15,14,22],[19,19,19,22],[35,4,37,7],[45,28,45,29],[45,24,45,25],[45,26,45,27],[6,11,6,22],[46,4,46,5],[46,6,46,7],[46,8,46,9],[46,10,46,11],[46,13,46,14],[46,17,46,18],[46,19,46,20],[46,22,46,23],[45,15,45,16],[45,17,45,18],[45,19,45,20],[45,22,45,23],[46,24,46,25],[46,26,46,27],[46,28,46,29],[47,4,47,5],[47,6,47,7],[47,8,47,9],[47,10,47,11],[47,13,47,14],[47,15,47,16],[47,17,47,18],[47,19,47,20],[47,22,47,23],[47,24,47,25],[47,26,47,27],[47,28,47,29],[46,15,46,16],[48,4,48,5],[48,6,48,7],[48,8,48,9],[48,10,48,11],[48,13,48,14],[48,28,48,29],[50,16,50,17],[48,15,48,16],[48,17,48,18],[48,19,48,20],[48,22,48,23],[48,24,48,25],[48,26,48,27]]}
[]
[null,null,"MSP CALCULATOR"]
[null,null,"Levels",":",{"$f":"IF(Vacancy!E6=\"\",\"\",Vacancy!E6)","v":""},null,null,null,null,null,null,"Name",":",null,null,null,null,null,null,null,null,null,null,null,null,null,"Employment Category:",null,null,null,null,null,{"$f":"SUM(F13,Y11,Y13,Y15,E25,Z25,J40,Q51,K67,K77,D81)","v":0}]
[null,null,null,null,null,null,null,null,null,null,null,null,null,null,null,null,null,null,null,null,null,null,null,null,null,null,null,null,null,null,null,null,"TOTAL MATRIX POINTS"]
[null,null,{"$f":"IF(E3=\"First Level\",\"A. Performance Rating (20 pts)\",IF(E3=\"Second Level\",\"A. Performance Rating (15 pts)\",\"A. Performance Rating (35 pts)\"))","v":"A. Performance Rating (35 pts)"},null,null,null,null,null,null,null,null,{"$f":"IF(E3=\"First Level\",\"B. Education (15 pts.)\",IF(E3=\"Second Level\",\"B. Education (10 pts.)\",\"B. Education (5 pts.)\"))","v":"B. Education (5 pts.)"}]
[null,null,"New Graduates (No previous work experience)",null,null,null,null,null,null,null,null,"Required:"]
[false,null,null,null,null,null,null,{"$f":"IF(F9>=2.75,1,IF(F9>=2.5,3,IF(F9>=2.25,5,IF(F9>=2,7,IF(F9>=1.75,9,IF(F9>=1.5,11,IF(F9>=1.25,13,IF(F9>=1,15))))))))","v":false},null,null,null,{"$f":"IF(Vacancy!E10=\"\",\"\",Vacancy!E10)","v":""}]
[]
[null,null,"GWA",null,null,null,{"$f":"IF(F9>=2.75,2,IF(F9>=2.5,5,IF(F9>=2.25,8,IF(F9>=2,11,IF(F9>=1.75,14,IF(F9>=1.5,16,IF(F9>=1.25,18,IF(F9>=1,20))))))))","v":false},{"$f":"IF(E3=\"First Level\",(20*F11)/5,IF(E3=\"Second Level\",(15*F11)/5,IF(E3=\"Executive/Managerial\",(35*F11)/5,\"\")))","v":""},null,null,null,"Highest Educational Attainment:",null,null,null,null,null,null,null,null,null,null,null,null,"Total Score:"]
[]
[null,null,"Last Rating Period",null,null,null,null,{"$f":"IFERROR(IF(AND(A7=TRUE,E3=\"First Level\"),G9,IF(AND(A7=TRUE,E3=\"Second Level\"),H7,H9)),\"\")","v":""},null,null,null,"First Level:",null,null,null,null,null,null,null,null,null,null,null,{"$f":"VLOOKUP(P11,Educ_2!$A$11:$B$26,2,FALSE)","v":{"$error":"#N/A"}},{"$f":"IFERROR(VLOOKUP($L$7,Educ_2!$A$1:$Q$8,X11+1,FALSE),\"\")","v":""}]
[]
[false,null,"Total Score",null,":",{"$f":"IF(H11=FALSE,0,H11)","v":""},"pts.",null,null,null,null,"Second Level:",null,null,null,null,null,null,null,null,null,null,null,{"$f":"VLOOKUP(P13,Educ_2!$A$11:$B$26,2,FALSE)","v":{"$error":"#N/A"}},{"$f":"IFERROR(VLOOKUP($L$7,Educ_2!$A$1:$Q$8,X13+1,FALSE),\"\")","v":""}]
[]
[null,null,null,null,null,null,null,null,null,null,null,"Executive/Managerial:",null,null,null,null,null,null,null,null,null,null,null,{"$f":"VLOOKUP(P15,Educ_2!$A$11:$B$26,2,FALSE)","v":{"$error":"#N/A"}},{"$f":"IFERROR(VLOOKUP($L$7,Educ_2!$A$1:$Q$8,X15+1,FALSE),\"\")","v":""}]
[]
[null,null,null,null,null,null,null,null,null,null,null,null,null,null,null,null,null,null,null,null,null,null,null,null,{"$f":"SUM(Y11,Y13,Y15)","v":0}]
[]
[null,null,"C. Training (10 pts.)",null,null,null,null,null,null,null,null,null,null,null,null,null,null,null,null,null,null,null,null,null,{"$f":"IF(E3=\"Executive/Managerial\",\"D. Experience (10 pts)\",\"D. Experience (25 pts)\")","v":"D. Experience (25 pts)"}]
[null,null,null,null,null,null,null,null,null,null,null,null,null,null,null,null,null,null,null,"Coversion to YEAR"]
[true,null,null,null,{"$f":"IF(Vacancy!$R$10=\"None required\",0,IF(Vacancy!$R$10=\"\",\"\",Vacancy!$R$10))","v":""},"Required (hrs.)",null,null,null,null,null,null,null,null,null,null,null,null,null,null,"Year",null,{"$f":"T21","v":0},null,null,{"$f":"IF(Vacancy!$AA$10=\"None required\",0,IF(Vacancy!$AA$10=\"\",\"\",Vacancy!$AA$10))","v":""},"Required Exp."]
[]
[null,null,null,{"$f":"E23-E21","v":{"$error":"#VALUE!"}},null,"Relevant training hrs. acquired",null,null,null,null,null,null,null,null,null,null,null,null,null,null,"Month",null,{"$f":"T23/12","v":0},null,{"$f":"Z23-Z21","v":{"$error":"#VALUE!"}},{"$f":"SUM(W21,W23,W25)","v":0},"Relevant years of experience"]
[]
[null,null,null,null,{"$f":"IF(N3=\"\",0,IFERROR(IF(E21=E23,5,IF(E23>=E21,((5*D23)/Trg_Exp!$D$2)+5,0)),0))","v":0},"Total",null,null,null,null,null,null,null,null,null,null,null,null,null,null,"Day",null,{"$f":"T25/365","v":0},null,{"$f":"IFERROR(IF(AND(Z21=Z23),10,IF(Vacancy!E6=\"Executive/Managerial\",((10*Y23)/Trg_Exp!$K$2),IF(Z23>=Z21,((15*Y23)/Trg_Exp!$K$2)+10,0))),0)","v":0},{"$f":"IF(N3=\"\",0,IF(Y25<0,0,Y25))","v":0},"Total Score:"]
[]
[null,null,{"$f":"IF(Vacancy!E6=\"Second Level\",\"E. Accomplishment (15 pts.)\",\"E. Accomplishment (10 pts.)\")","v":"E. Accomplishment (10 pts.)"}]
[]
[null,null,null,null,"E.1  Awards/Citations/Commendations"]
[]
[false,null,null,null,"E.1.1. Unit Level",null,null,null,null,{"$f":"IF(A31=TRUE,1,\"\")","v":""}]
[]
[false,null,null,null,"E.1.2. University Level",null,null,null,null,{"$f":"IF(A33=TRUE,3,\"\")","v":""}]
[]
[false,null,null,null,"E.1.3. National/CSC Level",null,null,null,null,{"$f":"IF(A35=TRUE,5,\"\")","v":""}]
[null,null,null,null,"E.2. Innovations/ Systems Improvement"]
[false,null,null,null,null,null,null,null,null,{"$f":"IF(A37=TRUE,IF(Vacancy!E6=\"Second Level\",4,3),\"\")","v":""}]
[null,null,null,null,null,null,null,null,null,null,{"$f":"IF(E3=\"Second Level\",((SUM(J31,J33,J35)*11)/9),((SUM(J31,J33,J35)*7)/9))","v":0}]
[]
[null,null,null,null,"C.2. Total Score:",null,null,null,null,{"$f":"IF(E3=\"Second Level\",(15*SUM(K38,J37)/15),(10*SUM(K38,J37)/10))","v":0}]
[]
[null,null,{"$f":"IF(E3=\"Executive/Managerial\",\"F. Physical Characteristics and Personality Traits (10 pts.)\",\"F. Physical Characteristics and Personality Traits (5 pts.)\")","v":"F. Physical Characteristics and Personality Traits (5 pts.)"}]
[]
[null,null,null,null,"Supervisor",null,"Co-worker 1",null,"Co-worker 2",null,"Co-worker 3",null,null,"Supervisor",null,"Co-worker 1",null,"Co-worker 2",null,"Co-worker 3",null,null,"Supervisor",null,"Co-worker 1",null,"Co-worker 2",null,"Co-worker 3"]
[null,null,null,null,"ATTITUDE",null,null,null,null,null,null,null,null,"COMMITMENT",null,null,null,null,null,null,null,null,"APPEARANCE"]
[null,null,null,"F.1.1. ",null,null,null,null,null,null,null,null,"F.2.1. ",null,null,null,null,null,null,null,null,"F.3.1. "]
[null,null,null,"F.1.2. ",null,null,null,null,null,null,null,null,"F.2.2. ",null,null,null,null,null,null,null,null,"F.3.2. "]
[null,null,null,"F.1.3. ",null,null,null,null,null,null,null,null,"F.2.3. "]
[null,null,null,null,{"$f":"IF($E$3=\"Executive/Managerial\",(4*(SUM(E46:F48)/12)),(2*(SUM(E46:F48)/12)))","v":0},null,{"$f":"IF($E$3=\"Executive/Managerial\",(4*(SUM(G46:H48)/12)),(2*(SUM(G46:H48)/12)))","v":0},null,{"$f":"IF($E$3=\"Executive/Managerial\",(4*(SUM(I46:J48)/12)),(2*(SUM(I46:J48)/12)))","v":0},null,{"$f":"IF($E$3=\"Executive/Managerial\",(4*(SUM(K46:L48)/12)),(2*(SUM(K46:L48)/12)))","v":0},null,null,{"$f":"IF($E$3=\"Executive/Managerial\",(4*(SUM(N46:O48)/12)),(2*(SUM(N46:O48)/12)))","v":0},null,{"$f":"IF($E$3=\"Executive/Managerial\",(4*(SUM(P46:Q48)/12)),(2*(SUM(P46:Q48)/12)))","v":0},null,{"$f":"IF($E$3=\"Executive/Managerial\",(4*(SUM(R46:S48)/12)),(2*(SUM(R46:S48)/12)))","v":0},null,{"$f":"IF($E$3=\"Executive/Managerial\",(4*(SUM(T46:U48)/12)),(2*(SUM(T46:U48)/12)))","v":0},null,null,{"$f":"IF($E$3=\"Executive/Managerial\",(2*(SUM(W46:X48))/8),(1*(SUM(W46:X48))/8))","v":0},null,{"$f":"IF($E$3=\"Executive/Managerial\",(2*(SUM(Y46:Z48))/8),(1*(SUM(Y46:Z48))/8))","v":0},null,{"$f":"IF($E$3=\"Executive/Managerial\",(2*(SUM(AA46:AB48))/8),(1*(SUM(AA46:AB48))/8))","v":0},null,{"$f":"IF($E$3=\"Executive/Managerial\",(2*(SUM(AC46:AD48))/8),(1*(SUM(AC46:AD48))/8))","v":0}]
[null,null,null,null,null,null,"Supervisor",null,"Co-worker"]
[null,null,null,null,"Attitude",null,{"$f":"E49","v":0},null,{"$f":"SUM(G49:L49)/3","v":0},null,null,null,null,"Total Score PCPT:",null,null,{"$f":"IF(E3=\"Executive/Managerial\",SUM(G54:J54),SUM(G54:J54))","v":0}]
[null,null,null,null,"Commitment",null,{"$f":"N49","v":0},null,{"$f":"SUM(P49:U49)/3","v":0}]
[null,null,null,null,"Appearance",null,{"$f":"W49","v":0},null,{"$f":"SUM(Y49:AD49)/3","v":0}]
[null,null,null,null,null,null,{"$f":"SUM(G51:G53)*0.6","v":0},null,{"$f":"SUM(I51:I53)*0.4","v":0}]
[null,null,{"$f":"IF(E3=\"First Level\",\"G. Potential [Assessment Form No. 2] (3 pts.)\",\"G. Potential [Assessment Form No. 2] (5 pts.)\")","v":"G. Potential [Assessment Form No. 2] (5 pts.)"}]
[]
[null,null,null,"INTERVIEW"]
[]
[null,null,null,null,"G.1.1. Sound judgement",null,null,null,null,null,null,{"$f":"IF($E$3=\"First Level\",\"Not Applicable for First Level position\",\"\")","v":""}]
[null,null,null,null,"G.1.2. Analytical mind",null,null,null,null,null,null,{"$f":"IF($E$3=\"First Level\",\"Not Applicable for First Level position\",\"\")","v":""}]
[null,null,null,null,"G.1.3. The ability to motivate co-workers",null,null,null,null,null,null,{"$f":"IF($E$3=\"First Level\",\"Not Applicable for First Level position\",\"\")","v":""}]
[null,null,null,null,"G.1.4. Unifying Factor",null,null,null,null,null,null,{"$f":"IF($E$3=\"First Level\",\"Not Applicable for First Level position\",\"\")","v":""}]
[null,null,null,null,"G.1.5. Vision/foresight",null,null,null,null,null,null,{"$f":"IF($E$3=\"First Level\",\"Not Applicable for First Level position\",\"\")","v":""}]
[null,null,null,null,"G.2. Resourcefulness"]
[null,null,null,null,"G.3. Creativity/ Ingenuity "]
[]
[null,null,null,"TOTAL POINTS FOR POTENTIAL",null,null,null,null,null,null,{"$f":"IF(E3=\"First Level\",(3*(SUM(K64:K65)/8)),(5*(SUM(K59:K65)/28)))","v":0}]
[]
[null,null,{"$f":"IF(E3=\"First Level\",\"H. Written/ Skills Examination (12 pts.)\",\"H. Written/ Skills Examination (15 pts.)\")","v":"H. Written/ Skills Examination (15 pts.)"}]
[null,null,null,null,null,null,null,null,null,null,{"$f":"IFERROR(SUM(K59:K65)/7,0)","v":0}]
[null,null,null,"WRITTEN/SKILLS EXAMINATION"]
[]
[null,null,null,null,"Perfect/Entire Score",null,null,"="]
[null,null,null,null,"Raw Score",null,null,"="]
[]
[]
[null,null,null,"TOTAL FOR EXAMINATION",null,null,null,null,null,null,{"$f":"IFERROR(IF(E3=\"First Level\",IF(K74>K73,0,(K74*12)/K73),IF(K74>K73,0,(K74*15)/K73)),0)","v":0}]
[]
[null,null,"I. Public Service"]
[]
[null,null,null,null,"Additional Pts. in excess of Total Score"]

{"sheet":"AP6","index":13,"n_rows":81,"n_cols":33,"rows_kept":81,"cut":false,"hidden":false,"merged":[[1,2,1,29],[2,4,2,9],[2,13,2,22],[2,27,2,30],[2,32,2,33],[45,4,45,5],[45,6,45,7],[45,8,45,9],[45,10,45,11],[45,13,45,14],[10,15,10,22],[12,15,12,22],[14,15,14,22],[19,19,19,22],[35,4,37,7],[45,28,45,29],[45,24,45,25],[45,26,45,27],[6,11,6,22],[46,4,46,5],[46,6,46,7],[46,8,46,9],[46,10,46,11],[46,13,46,14],[46,17,46,18],[46,19,46,20],[46,22,46,23],[45,15,45,16],[45,17,45,18],[45,19,45,20],[45,22,45,23],[46,24,46,25],[46,26,46,27],[46,28,46,29],[47,4,47,5],[47,6,47,7],[47,8,47,9],[47,10,47,11],[47,13,47,14],[47,15,47,16],[47,17,47,18],[47,19,47,20],[47,22,47,23],[47,24,47,25],[47,26,47,27],[47,28,47,29],[46,15,46,16],[48,4,48,5],[48,6,48,7],[48,8,48,9],[48,10,48,11],[48,13,48,14],[48,28,48,29],[50,16,50,17],[48,15,48,16],[48,17,48,18],[48,19,48,20],[48,22,48,23],[48,24,48,25],[48,26,48,27]]}
[]
[null,null,"MSP CALCULATOR"]
[null,null,"Levels",":",{"$f":"IF(Vacancy!E6=\"\",\"\",Vacancy!E6)","v":""},null,null,null,null,null,null,"Name",":",null,null,null,null,null,null,null,null,null,null,null,null,null,"Employment Category:",null,null,null,null,null,{"$f":"SUM(F13,Y11,Y13,Y15,E25,Z25,J40,Q51,K67,K77,D81)","v":0}]
[null,null,null,null,null,null,null,null,null,null,null,null,null,null,null,null,null,null,null,null,null,null,null,null,null,null,null,null,null,null,null,null,"TOTAL MATRIX POINTS"]
[null,null,{"$f":"IF(E3=\"First Level\",\"A. Performance Rating (20 pts)\",IF(E3=\"Second Level\",\"A. Performance Rating (15 pts)\",\"A. Performance Rating (35 pts)\"))","v":"A. Performance Rating (35 pts)"},null,null,null,null,null,null,null,null,{"$f":"IF(E3=\"First Level\",\"B. Education (15 pts.)\",IF(E3=\"Second Level\",\"B. Education (10 pts.)\",\"B. Education (5 pts.)\"))","v":"B. Education (5 pts.)"}]
[null,null,"New Graduates (No previous work experience)",null,null,null,null,null,null,null,null,"Required:"]
[false,null,null,null,null,null,null,{"$f":"IF(F9>=2.75,1,IF(F9>=2.5,3,IF(F9>=2.25,5,IF(F9>=2,7,IF(F9>=1.75,9,IF(F9>=1.5,11,IF(F9>=1.25,13,IF(F9>=1,15))))))))","v":false},null,null,null,{"$f":"IF(Vacancy!E10=\"\",\"\",Vacancy!E10)","v":""}]
[]
[null,null,"GWA",null,null,null,{"$f":"IF(F9>=2.75,2,IF(F9>=2.5,5,IF(F9>=2.25,8,IF(F9>=2,11,IF(F9>=1.75,14,IF(F9>=1.5,16,IF(F9>=1.25,18,IF(F9>=1,20))))))))","v":false},{"$f":"IF(E3=\"First Level\",(20*F11)/5,IF(E3=\"Second Level\",(15*F11)/5,IF(E3=\"Executive/Managerial\",(35*F11)/5,\"\")))","v":""},null,null,null,"Highest Educational Attainment:",null,null,null,null,null,null,null,null,null,null,null,null,"Total Score:"]
[]
[null,null,"Last Rating Period",null,null,null,null,{"$f":"IFERROR(IF(AND(A7=TRUE,E3=\"First Level\"),G9,IF(AND(A7=TRUE,E3=\"Second Level\"),H7,H9)),\"\")","v":""},null,null,null,"First Level:",null,null,null,null,null,null,null,null,null,null,null,{"$f":"VLOOKUP(P11,Educ_2!$A$11:$B$26,2,FALSE)","v":{"$error":"#N/A"}},{"$f":"IFERROR(VLOOKUP($L$7,Educ_2!$A$1:$Q$8,X11+1,FALSE),\"\")","v":""}]
[]
[false,null,"Total Score",null,":",{"$f":"IF(H11=FALSE,0,H11)","v":""},"pts.",null,null,null,null,"Second Level:",null,null,null,null,null,null,null,null,null,null,null,{"$f":"VLOOKUP(P13,Educ_2!$A$11:$B$26,2,FALSE)","v":{"$error":"#N/A"}},{"$f":"IFERROR(VLOOKUP($L$7,Educ_2!$A$1:$Q$8,X13+1,FALSE),\"\")","v":""}]
[]
[null,null,null,null,null,null,null,null,null,null,null,"Executive/Managerial:",null,null,null,null,null,null,null,null,null,null,null,{"$f":"VLOOKUP(P15,Educ_2!$A$11:$B$26,2,FALSE)","v":{"$error":"#N/A"}},{"$f":"IFERROR(VLOOKUP($L$7,Educ_2!$A$1:$Q$8,X15+1,FALSE),\"\")","v":""}]
[]
[null,null,null,null,null,null,null,null,null,null,null,null,null,null,null,null,null,null,null,null,null,null,null,null,{"$f":"SUM(Y11,Y13,Y15)","v":0}]
[]
[null,null,"C. Training (10 pts.)",null,null,null,null,null,null,null,null,null,null,null,null,null,null,null,null,null,null,null,null,null,{"$f":"IF(E3=\"Executive/Managerial\",\"D. Experience (10 pts)\",\"D. Experience (25 pts)\")","v":"D. Experience (25 pts)"}]
[null,null,null,null,null,null,null,null,null,null,null,null,null,null,null,null,null,null,null,"Coversion to YEAR"]
[true,null,null,null,{"$f":"IF(Vacancy!$R$10=\"None required\",0,IF(Vacancy!$R$10=\"\",\"\",Vacancy!$R$10))","v":""},"Required (hrs.)",null,null,null,null,null,null,null,null,null,null,null,null,null,null,"Year",null,{"$f":"T21","v":0},null,null,{"$f":"IF(Vacancy!$AA$10=\"None required\",0,IF(Vacancy!$AA$10=\"\",\"\",Vacancy!$AA$10))","v":""},"Required Exp."]
[]
[null,null,null,{"$f":"E23-E21","v":{"$error":"#VALUE!"}},null,"Relevant training hrs. acquired",null,null,null,null,null,null,null,null,null,null,null,null,null,null,"Month",null,{"$f":"T23/12","v":0},null,{"$f":"Z23-Z21","v":{"$error":"#VALUE!"}},{"$f":"SUM(W21,W23,W25)","v":0},"Relevant years of experience"]
[]
[null,null,null,null,{"$f":"IF(N3=\"\",0,IFERROR(IF(E21=E23,5,IF(E23>=E21,((5*D23)/Trg_Exp!$D$2)+5,0)),0))","v":0},"Total",null,null,null,null,null,null,null,null,null,null,null,null,null,null,"Day",null,{"$f":"T25/365","v":0},null,{"$f":"IFERROR(IF(AND(Z21=Z23),10,IF(Vacancy!E6=\"Executive/Managerial\",((10*Y23)/Trg_Exp!$K$2),IF(Z23>=Z21,((15*Y23)/Trg_Exp!$K$2)+10,0))),0)","v":0},{"$f":"IF(N3=\"\",0,IF(Y25<0,0,Y25))","v":0},"Total Score:"]
[]
[null,null,{"$f":"IF(Vacancy!E6=\"Second Level\",\"E. Accomplishment (15 pts.)\",\"E. Accomplishment (10 pts.)\")","v":"E. Accomplishment (10 pts.)"}]
[]
[null,null,null,null,"E.1  Awards/Citations/Commendations"]
[]
[false,null,null,null,"E.1.1. Unit Level",null,null,null,null,{"$f":"IF(A31=TRUE,1,\"\")","v":""}]
[]
[false,null,null,null,"E.1.2. University Level",null,null,null,null,{"$f":"IF(A33=TRUE,3,\"\")","v":""}]
[]
[false,null,null,null,"E.1.3. National/CSC Level",null,null,null,null,{"$f":"IF(A35=TRUE,5,\"\")","v":""}]
[null,null,null,null,"E.2. Innovations/ Systems Improvement"]
[false,null,null,null,null,null,null,null,null,{"$f":"IF(A37=TRUE,IF(Vacancy!E6=\"Second Level\",4,3),\"\")","v":""}]
[null,null,null,null,null,null,null,null,null,null,{"$f":"IF(E3=\"Second Level\",((SUM(J31,J33,J35)*11)/9),((SUM(J31,J33,J35)*7)/9))","v":0}]
[]
[null,null,null,null,"C.2. Total Score:",null,null,null,null,{"$f":"IF(E3=\"Second Level\",(15*SUM(K38,J37)/15),(10*SUM(K38,J37)/10))","v":0}]
[]
[null,null,{"$f":"IF(E3=\"Executive/Managerial\",\"F. Physical Characteristics and Personality Traits (10 pts.)\",\"F. Physical Characteristics and Personality Traits (5 pts.)\")","v":"F. Physical Characteristics and Personality Traits (5 pts.)"}]
[]
[null,null,null,null,"Supervisor",null,"Co-worker 1",null,"Co-worker 2",null,"Co-worker 3",null,null,"Supervisor",null,"Co-worker 1",null,"Co-worker 2",null,"Co-worker 3",null,null,"Supervisor",null,"Co-worker 1",null,"Co-worker 2",null,"Co-worker 3"]
[null,null,null,null,"ATTITUDE",null,null,null,null,null,null,null,null,"COMMITMENT",null,null,null,null,null,null,null,null,"APPEARANCE"]
[null,null,null,"F.1.1. ",null,null,null,null,null,null,null,null,"F.2.1. ",null,null,null,null,null,null,null,null,"F.3.1. "]
[null,null,null,"F.1.2. ",null,null,null,null,null,null,null,null,"F.2.2. ",null,null,null,null,null,null,null,null,"F.3.2. "]
[null,null,null,"F.1.3. ",null,null,null,null,null,null,null,null,"F.2.3. "]
[null,null,null,null,{"$f":"IF($E$3=\"Executive/Managerial\",(4*(SUM(E46:F48)/12)),(2*(SUM(E46:F48)/12)))","v":0},null,{"$f":"IF($E$3=\"Executive/Managerial\",(4*(SUM(G46:H48)/12)),(2*(SUM(G46:H48)/12)))","v":0},null,{"$f":"IF($E$3=\"Executive/Managerial\",(4*(SUM(I46:J48)/12)),(2*(SUM(I46:J48)/12)))","v":0},null,{"$f":"IF($E$3=\"Executive/Managerial\",(4*(SUM(K46:L48)/12)),(2*(SUM(K46:L48)/12)))","v":0},null,null,{"$f":"IF($E$3=\"Executive/Managerial\",(4*(SUM(N46:O48)/12)),(2*(SUM(N46:O48)/12)))","v":0},null,{"$f":"IF($E$3=\"Executive/Managerial\",(4*(SUM(P46:Q48)/12)),(2*(SUM(P46:Q48)/12)))","v":0},null,{"$f":"IF($E$3=\"Executive/Managerial\",(4*(SUM(R46:S48)/12)),(2*(SUM(R46:S48)/12)))","v":0},null,{"$f":"IF($E$3=\"Executive/Managerial\",(4*(SUM(T46:U48)/12)),(2*(SUM(T46:U48)/12)))","v":0},null,null,{"$f":"IF($E$3=\"Executive/Managerial\",(2*(SUM(W46:X48))/8),(1*(SUM(W46:X48))/8))","v":0},null,{"$f":"IF($E$3=\"Executive/Managerial\",(2*(SUM(Y46:Z48))/8),(1*(SUM(Y46:Z48))/8))","v":0},null,{"$f":"IF($E$3=\"Executive/Managerial\",(2*(SUM(AA46:AB48))/8),(1*(SUM(AA46:AB48))/8))","v":0},null,{"$f":"IF($E$3=\"Executive/Managerial\",(2*(SUM(AC46:AD48))/8),(1*(SUM(AC46:AD48))/8))","v":0}]
[null,null,null,null,null,null,"Supervisor",null,"Co-worker"]
[null,null,null,null,"Attitude",null,{"$f":"E49","v":0},null,{"$f":"SUM(G49:L49)/3","v":0},null,null,null,null,"Total Score PCPT:",null,null,{"$f":"IF(E3=\"Executive/Managerial\",SUM(G54:J54),SUM(G54:J54))","v":0}]
[null,null,null,null,"Commitment",null,{"$f":"N49","v":0},null,{"$f":"SUM(P49:U49)/3","v":0}]
[null,null,null,null,"Appearance",null,{"$f":"W49","v":0},null,{"$f":"SUM(Y49:AD49)/3","v":0}]
[null,null,null,null,null,null,{"$f":"SUM(G51:G53)*0.6","v":0},null,{"$f":"SUM(I51:I53)*0.4","v":0}]
[null,null,{"$f":"IF(E3=\"First Level\",\"G. Potential [Assessment Form No. 2] (3 pts.)\",\"G. Potential [Assessment Form No. 2] (5 pts.)\")","v":"G. Potential [Assessment Form No. 2] (5 pts.)"}]
[]
[null,null,null,"INTERVIEW"]
[]
[null,null,null,null,"G.1.1. Sound judgement",null,null,null,null,null,null,{"$f":"IF($E$3=\"First Level\",\"Not Applicable for First Level position\",\"\")","v":""}]
[null,null,null,null,"G.1.2. Analytical mind",null,null,null,null,null,null,{"$f":"IF($E$3=\"First Level\",\"Not Applicable for First Level position\",\"\")","v":""}]
[null,null,null,null,"G.1.3. The ability to motivate co-workers",null,null,null,null,null,null,{"$f":"IF($E$3=\"First Level\",\"Not Applicable for First Level position\",\"\")","v":""}]
[null,null,null,null,"G.1.4. Unifying Factor",null,null,null,null,null,null,{"$f":"IF($E$3=\"First Level\",\"Not Applicable for First Level position\",\"\")","v":""}]
[null,null,null,null,"G.1.5. Vision/foresight",null,null,null,null,null,null,{"$f":"IF($E$3=\"First Level\",\"Not Applicable for First Level position\",\"\")","v":""}]
[null,null,null,null,"G.2. Resourcefulness"]
[null,null,null,null,"G.3. Creativity/ Ingenuity "]
[]
[null,null,null,"TOTAL POINTS FOR POTENTIAL",null,null,null,null,null,null,{"$f":"IF(E3=\"First Level\",(3*(SUM(K64:K65)/8)),(5*(SUM(K59:K65)/28)))","v":0}]
[]
[null,null,{"$f":"IF(E3=\"First Level\",\"H. Written/ Skills Examination (12 pts.)\",\"H. Written/ Skills Examination (15 pts.)\")","v":"H. Written/ Skills Examination (15 pts.)"}]
[null,null,null,null,null,null,null,null,null,null,{"$f":"IFERROR(SUM(K59:K65)/7,0)","v":0}]
[null,null,null,"WRITTEN/SKILLS EXAMINATION"]
[]
[null,null,null,null,"Perfect/Entire Score",null,null,"="]
[null,null,null,null,"Raw Score",null,null,"="]
[]
[]
[null,null,null,"TOTAL FOR EXAMINATION",null,null,null,null,null,null,{"$f":"IFERROR(IF(E3=\"First Level\",IF(K74>K73,0,(K74*12)/K73),IF(K74>K73,0,(K74*15)/K73)),0)","v":0}]
[]
[null,null,"I. Public Service"]
[]
[null,null,null,null,"Additional Pts. in excess of Total Score"]

{"sheet":"AP7","index":14,"n_rows":81,"n_cols":33,"rows_kept":81,"cut":false,"hidden":false,"merged":[[1,2,1,29],[2,4,2,9],[2,13,2,22],[2,27,2,30],[2,32,2,33],[45,4,45,5],[45,6,45,7],[45,8,45,9],[45,10,45,11],[45,13,45,14],[10,15,10,22],[12,15,12,22],[14,15,14,22],[19,19,19,22],[35,4,37,7],[45,28,45,29],[45,24,45,25],[45,26,45,27],[6,11,6,22],[46,4,46,5],[46,6,46,7],[46,8,46,9],[46,10,46,11],[46,13,46,14],[46,17,46,18],[46,19,46,20],[46,22,46,23],[45,15,45,16],[45,17,45,18],[45,19,45,20],[45,22,45,23],[46,24,46,25],[46,26,46,27],[46,28,46,29],[47,4,47,5],[47,6,47,7],[47,8,47,9],[47,10,47,11],[47,13,47,14],[47,15,47,16],[47,17,47,18],[47,19,47,20],[47,22,47,23],[47,24,47,25],[47,26,47,27],[47,28,47,29],[46,15,46,16],[48,4,48,5],[48,6,48,7],[48,8,48,9],[48,10,48,11],[48,13,48,14],[48,28,48,29],[50,16,50,17],[48,15,48,16],[48,17,48,18],[48,19,48,20],[48,22,48,23],[48,24,48,25],[48,26,48,27]]}
[]
[null,null,"MSP CALCULATOR"]
[null,null,"Levels",":",{"$f":"IF(Vacancy!E6=\"\",\"\",Vacancy!E6)","v":""},null,null,null,null,null,null,"Name",":",null,null,null,null,null,null,null,null,null,null,null,null,null,"Employment Category:",null,null,null,null,null,{"$f":"SUM(F13,Y11,Y13,Y15,E25,Z25,J40,Q51,K67,K77,D81)","v":0}]
[null,null,null,null,null,null,null,null,null,null,null,null,null,null,null,null,null,null,null,null,null,null,null,null,null,null,null,null,null,null,null,null,"TOTAL MATRIX POINTS"]
[null,null,{"$f":"IF(E3=\"First Level\",\"A. Performance Rating (20 pts)\",IF(E3=\"Second Level\",\"A. Performance Rating (15 pts)\",\"A. Performance Rating (35 pts)\"))","v":"A. Performance Rating (35 pts)"},null,null,null,null,null,null,null,null,{"$f":"IF(E3=\"First Level\",\"B. Education (15 pts.)\",IF(E3=\"Second Level\",\"B. Education (10 pts.)\",\"B. Education (5 pts.)\"))","v":"B. Education (5 pts.)"}]
[null,null,"New Graduates (No previous work experience)",null,null,null,null,null,null,null,null,"Required:"]
[false,null,null,null,null,null,null,{"$f":"IF(F9>=2.75,1,IF(F9>=2.5,3,IF(F9>=2.25,5,IF(F9>=2,7,IF(F9>=1.75,9,IF(F9>=1.5,11,IF(F9>=1.25,13,IF(F9>=1,15))))))))","v":false},null,null,null,{"$f":"IF(Vacancy!E10=\"\",\"\",Vacancy!E10)","v":""}]
[]
[null,null,"GWA",null,null,null,{"$f":"IF(F9>=2.75,2,IF(F9>=2.5,5,IF(F9>=2.25,8,IF(F9>=2,11,IF(F9>=1.75,14,IF(F9>=1.5,16,IF(F9>=1.25,18,IF(F9>=1,20))))))))","v":false},{"$f":"IF(E3=\"First Level\",(20*F11)/5,IF(E3=\"Second Level\",(15*F11)/5,IF(E3=\"Executive/Managerial\",(35*F11)/5,\"\")))","v":""},null,null,null,"Highest Educational Attainment:",null,null,null,null,null,null,null,null,null,null,null,null,"Total Score:"]
[]
[null,null,"Last Rating Period",null,null,null,null,{"$f":"IFERROR(IF(AND(A7=TRUE,E3=\"First Level\"),G9,IF(AND(A7=TRUE,E3=\"Second Level\"),H7,H9)),\"\")","v":""},null,null,null,"First Level:",null,null,null,null,null,null,null,null,null,null,null,{"$f":"VLOOKUP(P11,Educ_2!$A$11:$B$26,2,FALSE)","v":{"$error":"#N/A"}},{"$f":"IFERROR(VLOOKUP($L$7,Educ_2!$A$1:$Q$8,X11+1,FALSE),\"\")","v":""}]
[]
[false,null,"Total Score",null,":",{"$f":"IF(H11=FALSE,0,H11)","v":""},"pts.",null,null,null,null,"Second Level:",null,null,null,null,null,null,null,null,null,null,null,{"$f":"VLOOKUP(P13,Educ_2!$A$11:$B$26,2,FALSE)","v":{"$error":"#N/A"}},{"$f":"IFERROR(VLOOKUP($L$7,Educ_2!$A$1:$Q$8,X13+1,FALSE),\"\")","v":""}]
[]
[null,null,null,null,null,null,null,null,null,null,null,"Executive/Managerial:",null,null,null,null,null,null,null,null,null,null,null,{"$f":"VLOOKUP(P15,Educ_2!$A$11:$B$26,2,FALSE)","v":{"$error":"#N/A"}},{"$f":"IFERROR(VLOOKUP($L$7,Educ_2!$A$1:$Q$8,X15+1,FALSE),\"\")","v":""}]
[]
[null,null,null,null,null,null,null,null,null,null,null,null,null,null,null,null,null,null,null,null,null,null,null,null,{"$f":"SUM(Y11,Y13,Y15)","v":0}]
[]
[null,null,"C. Training (10 pts.)",null,null,null,null,null,null,null,null,null,null,null,null,null,null,null,null,null,null,null,null,null,{"$f":"IF(E3=\"Executive/Managerial\",\"D. Experience (10 pts)\",\"D. Experience (25 pts)\")","v":"D. Experience (25 pts)"}]
[null,null,null,null,null,null,null,null,null,null,null,null,null,null,null,null,null,null,null,"Coversion to YEAR"]
[true,null,null,null,{"$f":"IF(Vacancy!$R$10=\"None required\",0,IF(Vacancy!$R$10=\"\",\"\",Vacancy!$R$10))","v":""},"Required (hrs.)",null,null,null,null,null,null,null,null,null,null,null,null,null,null,"Year",null,{"$f":"T21","v":0},null,null,{"$f":"IF(Vacancy!$AA$10=\"None required\",0,IF(Vacancy!$AA$10=\"\",\"\",Vacancy!$AA$10))","v":""},"Required Exp."]
[]
[null,null,null,{"$f":"E23-E21","v":{"$error":"#VALUE!"}},null,"Relevant training hrs. acquired",null,null,null,null,null,null,null,null,null,null,null,null,null,null,"Month",null,{"$f":"T23/12","v":0},null,{"$f":"Z23-Z21","v":{"$error":"#VALUE!"}},{"$f":"SUM(W21,W23,W25)","v":0},"Relevant years of experience"]
[]
[null,null,null,null,{"$f":"IF(N3=\"\",0,IFERROR(IF(E21=E23,5,IF(E23>=E21,((5*D23)/Trg_Exp!$D$2)+5,0)),0))","v":0},"Total",null,null,null,null,null,null,null,null,null,null,null,null,null,null,"Day",null,{"$f":"T25/365","v":0},null,{"$f":"IFERROR(IF(AND(Z21=Z23),10,IF(Vacancy!E6=\"Executive/Managerial\",((10*Y23)/Trg_Exp!$K$2),IF(Z23>=Z21,((15*Y23)/Trg_Exp!$K$2)+10,0))),0)","v":0},{"$f":"IF(N3=\"\",0,IF(Y25<0,0,Y25))","v":0},"Total Score:"]
[]
[null,null,{"$f":"IF(Vacancy!E6=\"Second Level\",\"E. Accomplishment (15 pts.)\",\"E. Accomplishment (10 pts.)\")","v":"E. Accomplishment (10 pts.)"}]
[]
[null,null,null,null,"E.1  Awards/Citations/Commendations"]
[]
[false,null,null,null,"E.1.1. Unit Level",null,null,null,null,{"$f":"IF(A31=TRUE,1,\"\")","v":""}]
[]
[false,null,null,null,"E.1.2. University Level",null,null,null,null,{"$f":"IF(A33=TRUE,3,\"\")","v":""}]
[]
[false,null,null,null,"E.1.3. National/CSC Level",null,null,null,null,{"$f":"IF(A35=TRUE,5,\"\")","v":""}]
[null,null,null,null,"E.2. Innovations/ Systems Improvement"]
[false,null,null,null,null,null,null,null,null,{"$f":"IF(A37=TRUE,IF(Vacancy!E6=\"Second Level\",4,3),\"\")","v":""}]
[null,null,null,null,null,null,null,null,null,null,{"$f":"IF(E3=\"Second Level\",((SUM(J31,J33,J35)*11)/9),((SUM(J31,J33,J35)*7)/9))","v":0}]
[]
[null,null,null,null,"C.2. Total Score:",null,null,null,null,{"$f":"IF(E3=\"Second Level\",(15*SUM(K38,J37)/15),(10*SUM(K38,J37)/10))","v":0}]
[]
[null,null,{"$f":"IF(E3=\"Executive/Managerial\",\"F. Physical Characteristics and Personality Traits (10 pts.)\",\"F. Physical Characteristics and Personality Traits (5 pts.)\")","v":"F. Physical Characteristics and Personality Traits (5 pts.)"}]
[]
[null,null,null,null,"Supervisor",null,"Co-worker 1",null,"Co-worker 2",null,"Co-worker 3",null,null,"Supervisor",null,"Co-worker 1",null,"Co-worker 2",null,"Co-worker 3",null,null,"Supervisor",null,"Co-worker 1",null,"Co-worker 2",null,"Co-worker 3"]
[null,null,null,null,"ATTITUDE",null,null,null,null,null,null,null,null,"COMMITMENT",null,null,null,null,null,null,null,null,"APPEARANCE"]
[null,null,null,"F.1.1. ",null,null,null,null,null,null,null,null,"F.2.1. ",null,null,null,null,null,null,null,null,"F.3.1. "]
[null,null,null,"F.1.2. ",null,null,null,null,null,null,null,null,"F.2.2. ",null,null,null,null,null,null,null,null,"F.3.2. "]
[null,null,null,"F.1.3. ",null,null,null,null,null,null,null,null,"F.2.3. "]
[null,null,null,null,{"$f":"IF($E$3=\"Executive/Managerial\",(4*(SUM(E46:F48)/12)),(2*(SUM(E46:F48)/12)))","v":0},null,{"$f":"IF($E$3=\"Executive/Managerial\",(4*(SUM(G46:H48)/12)),(2*(SUM(G46:H48)/12)))","v":0},null,{"$f":"IF($E$3=\"Executive/Managerial\",(4*(SUM(I46:J48)/12)),(2*(SUM(I46:J48)/12)))","v":0},null,{"$f":"IF($E$3=\"Executive/Managerial\",(4*(SUM(K46:L48)/12)),(2*(SUM(K46:L48)/12)))","v":0},null,null,{"$f":"IF($E$3=\"Executive/Managerial\",(4*(SUM(N46:O48)/12)),(2*(SUM(N46:O48)/12)))","v":0},null,{"$f":"IF($E$3=\"Executive/Managerial\",(4*(SUM(P46:Q48)/12)),(2*(SUM(P46:Q48)/12)))","v":0},null,{"$f":"IF($E$3=\"Executive/Managerial\",(4*(SUM(R46:S48)/12)),(2*(SUM(R46:S48)/12)))","v":0},null,{"$f":"IF($E$3=\"Executive/Managerial\",(4*(SUM(T46:U48)/12)),(2*(SUM(T46:U48)/12)))","v":0},null,null,{"$f":"IF($E$3=\"Executive/Managerial\",(2*(SUM(W46:X48))/8),(1*(SUM(W46:X48))/8))","v":0},null,{"$f":"IF($E$3=\"Executive/Managerial\",(2*(SUM(Y46:Z48))/8),(1*(SUM(Y46:Z48))/8))","v":0},null,{"$f":"IF($E$3=\"Executive/Managerial\",(2*(SUM(AA46:AB48))/8),(1*(SUM(AA46:AB48))/8))","v":0},null,{"$f":"IF($E$3=\"Executive/Managerial\",(2*(SUM(AC46:AD48))/8),(1*(SUM(AC46:AD48))/8))","v":0}]
[null,null,null,null,null,null,"Supervisor",null,"Co-worker"]
[null,null,null,null,"Attitude",null,{"$f":"E49","v":0},null,{"$f":"SUM(G49:L49)/3","v":0},null,null,null,null,"Total Score PCPT:",null,null,{"$f":"IF(E3=\"Executive/Managerial\",SUM(G54:J54),SUM(G54:J54))","v":0}]
[null,null,null,null,"Commitment",null,{"$f":"N49","v":0},null,{"$f":"SUM(P49:U49)/3","v":0}]
[null,null,null,null,"Appearance",null,{"$f":"W49","v":0},null,{"$f":"SUM(Y49:AD49)/3","v":0}]
[null,null,null,null,null,null,{"$f":"SUM(G51:G53)*0.6","v":0},null,{"$f":"SUM(I51:I53)*0.4","v":0}]
[null,null,{"$f":"IF(E3=\"First Level\",\"G. Potential [Assessment Form No. 2] (3 pts.)\",\"G. Potential [Assessment Form No. 2] (5 pts.)\")","v":"G. Potential [Assessment Form No. 2] (5 pts.)"}]
[]
[null,null,null,"INTERVIEW"]
[]
[null,null,null,null,"G.1.1. Sound judgement",null,null,null,null,null,null,{"$f":"IF($E$3=\"First Level\",\"Not Applicable for First Level position\",\"\")","v":""}]
[null,null,null,null,"G.1.2. Analytical mind",null,null,null,null,null,null,{"$f":"IF($E$3=\"First Level\",\"Not Applicable for First Level position\",\"\")","v":""}]
[null,null,null,null,"G.1.3. The ability to motivate co-workers",null,null,null,null,null,null,{"$f":"IF($E$3=\"First Level\",\"Not Applicable for First Level position\",\"\")","v":""}]
[null,null,null,null,"G.1.4. Unifying Factor",null,null,null,null,null,null,{"$f":"IF($E$3=\"First Level\",\"Not Applicable for First Level position\",\"\")","v":""}]
[null,null,null,null,"G.1.5. Vision/foresight",null,null,null,null,null,null,{"$f":"IF($E$3=\"First Level\",\"Not Applicable for First Level position\",\"\")","v":""}]
[null,null,null,null,"G.2. Resourcefulness"]
[null,null,null,null,"G.3. Creativity/ Ingenuity "]
[]
[null,null,null,"TOTAL POINTS FOR POTENTIAL",null,null,null,null,null,null,{"$f":"IF(E3=\"First Level\",(3*(SUM(K64:K65)/8)),(5*(SUM(K59:K65)/28)))","v":0}]
[]
[null,null,{"$f":"IF(E3=\"First Level\",\"H. Written/ Skills Examination (12 pts.)\",\"H. Written/ Skills Examination (15 pts.)\")","v":"H. Written/ Skills Examination (15 pts.)"}]
[null,null,null,null,null,null,null,null,null,null,{"$f":"IFERROR(SUM(K59:K65)/7,0)","v":0}]
[null,null,null,"WRITTEN/SKILLS EXAMINATION"]
[]
[null,null,null,null,"Perfect/Entire Score",null,null,"="]
[null,null,null,null,"Raw Score",null,null,"="]
[]
[]
[null,null,null,"TOTAL FOR EXAMINATION",null,null,null,null,null,null,{"$f":"IFERROR(IF(E3=\"First Level\",IF(K74>K73,0,(K74*12)/K73),IF(K74>K73,0,(K74*15)/K73)),0)","v":0}]
[]
[null,null,"I. Public Service"]
[]
[null,null,null,null,"Additional Pts. in excess of Total Score"]

{"sheet":"AP8","index":15,"n_rows":81,"n_cols":33,"rows_kept":81,"cut":false,"hidden":false,"merged":[[1,2,1,29],[2,4,2,9],[2,13,2,22],[2,27,2,30],[2,32,2,33],[45,4,45,5],[45,6,45,7],[45,8,45,9],[45,10,45,11],[45,13,45,14],[10,15,10,22],[12,15,12,22],[14,15,14,22],[19,19,19,22],[35,4,37,7],[45,28,45,29],[45,24,45,25],[45,26,45,27],[6,11,6,22],[46,4,46,5],[46,6,46,7],[46,8,46,9],[46,10,46,11],[46,13,46,14],[46,17,46,18],[46,19,46,20],[46,22,46,23],[45,15,45,16],[45,17,45,18],[45,19,45,20],[45,22,45,23],[46,24,46,25],[46,26,46,27],[46,28,46,29],[47,4,47,5],[47,6,47,7],[47,8,47,9],[47,10,47,11],[47,13,47,14],[47,15,47,16],[47,17,47,18],[47,19,47,20],[47,22,47,23],[47,24,47,25],[47,26,47,27],[47,28,47,29],[46,15,46,16],[48,4,48,5],[48,6,48,7],[48,8,48,9],[48,10,48,11],[48,13,48,14],[48,28,48,29],[50,16,50,17],[48,15,48,16],[48,17,48,18],[48,19,48,20],[48,22,48,23],[48,24,48,25],[48,26,48,27]]}
[]
[null,null,"MSP CALCULATOR"]
[null,null,"Levels",":",{"$f":"IF(Vacancy!E6=\"\",\"\",Vacancy!E6)","v":""},null,null,null,null,null,null,"Name",":",null,null,null,null,null,null,null,null,null,null,null,null,null,"Employment Category:",null,null,null,null,null,{"$f":"SUM(F13,Y11,Y13,Y15,E25,Z25,J40,Q51,K67,K77,D81)","v":0}]
[null,null,null,null,null,null,null,null,null,null,null,null,null,null,null,null,null,null,null,null,null,null,null,null,null,null,null,null,null,null,null,null,"TOTAL MATRIX POINTS"]
[null,null,{"$f":"IF(E3=\"First Level\",\"A. Performance Rating (20 pts)\",IF(E3=\"Second Level\",\"A. Performance Rating (15 pts)\",\"A. Performance Rating (35 pts)\"))","v":"A. Performance Rating (35 pts)"},null,null,null,null,null,null,null,null,{"$f":"IF(E3=\"First Level\",\"B. Education (15 pts.)\",IF(E3=\"Second Level\",\"B. Education (10 pts.)\",\"B. Education (5 pts.)\"))","v":"B. Education (5 pts.)"}]
[null,null,"New Graduates (No previous work experience)",null,null,null,null,null,null,null,null,"Required:"]
[false,null,null,null,null,null,null,{"$f":"IF(F9>=2.75,1,IF(F9>=2.5,3,IF(F9>=2.25,5,IF(F9>=2,7,IF(F9>=1.75,9,IF(F9>=1.5,11,IF(F9>=1.25,13,IF(F9>=1,15))))))))","v":false},null,null,null,{"$f":"IF(Vacancy!E10=\"\",\"\",Vacancy!E10)","v":""}]
[]
[null,null,"GWA",null,null,null,{"$f":"IF(F9>=2.75,2,IF(F9>=2.5,5,IF(F9>=2.25,8,IF(F9>=2,11,IF(F9>=1.75,14,IF(F9>=1.5,16,IF(F9>=1.25,18,IF(F9>=1,20))))))))","v":false},{"$f":"IF(E3=\"First Level\",(20*F11)/5,IF(E3=\"Second Level\",(15*F11)/5,IF(E3=\"Executive/Managerial\",(35*F11)/5,\"\")))","v":""},null,null,null,"Highest Educational Attainment:",null,null,null,null,null,null,null,null,null,null,null,null,"Total Score:"]
[]
[null,null,"Last Rating Period",null,null,null,null,{"$f":"IFERROR(IF(AND(A7=TRUE,E3=\"First Level\"),G9,IF(AND(A7=TRUE,E3=\"Second Level\"),H7,H9)),\"\")","v":""},null,null,null,"First Level:",null,null,null,null,null,null,null,null,null,null,null,{"$f":"VLOOKUP(P11,Educ_2!$A$11:$B$26,2,FALSE)","v":{"$error":"#N/A"}},{"$f":"IFERROR(VLOOKUP($L$7,Educ_2!$A$1:$Q$8,X11+1,FALSE),\"\")","v":""}]
[]
[false,null,"Total Score",null,":",{"$f":"IF(H11=FALSE,0,H11)","v":""},"pts.",null,null,null,null,"Second Level:",null,null,null,null,null,null,null,null,null,null,null,{"$f":"VLOOKUP(P13,Educ_2!$A$11:$B$26,2,FALSE)","v":{"$error":"#N/A"}},{"$f":"IFERROR(VLOOKUP($L$7,Educ_2!$A$1:$Q$8,X13+1,FALSE),\"\")","v":""}]
[]
[null,null,null,null,null,null,null,null,null,null,null,"Executive/Managerial:",null,null,null,null,null,null,null,null,null,null,null,{"$f":"VLOOKUP(P15,Educ_2!$A$11:$B$26,2,FALSE)","v":{"$error":"#N/A"}},{"$f":"IFERROR(VLOOKUP($L$7,Educ_2!$A$1:$Q$8,X15+1,FALSE),\"\")","v":""}]
[]
[null,null,null,null,null,null,null,null,null,null,null,null,null,null,null,null,null,null,null,null,null,null,null,null,{"$f":"SUM(Y11,Y13,Y15)","v":0}]
[]
[null,null,"C. Training (10 pts.)",null,null,null,null,null,null,null,null,null,null,null,null,null,null,null,null,null,null,null,null,null,{"$f":"IF(E3=\"Executive/Managerial\",\"D. Experience (10 pts)\",\"D. Experience (25 pts)\")","v":"D. Experience (25 pts)"}]
[null,null,null,null,null,null,null,null,null,null,null,null,null,null,null,null,null,null,null,"Coversion to YEAR"]
[true,null,null,null,{"$f":"IF(Vacancy!$R$10=\"None required\",0,IF(Vacancy!$R$10=\"\",\"\",Vacancy!$R$10))","v":""},"Required (hrs.)",null,null,null,null,null,null,null,null,null,null,null,null,null,null,"Year",null,{"$f":"T21","v":0},null,null,{"$f":"IF(Vacancy!$AA$10=\"None required\",0,IF(Vacancy!$AA$10=\"\",\"\",Vacancy!$AA$10))","v":""},"Required Exp."]
[]
[null,null,null,{"$f":"E23-E21","v":{"$error":"#VALUE!"}},null,"Relevant training hrs. acquired",null,null,null,null,null,null,null,null,null,null,null,null,null,null,"Month",null,{"$f":"T23/12","v":0},null,{"$f":"Z23-Z21","v":{"$error":"#VALUE!"}},{"$f":"SUM(W21,W23,W25)","v":0},"Relevant years of experience"]
[]
[null,null,null,null,{"$f":"IF(N3=\"\",0,IFERROR(IF(E21=E23,5,IF(E23>=E21,((5*D23)/Trg_Exp!$D$2)+5,0)),0))","v":0},"Total",null,null,null,null,null,null,null,null,null,null,null,null,null,null,"Day",null,{"$f":"T25/365","v":0},null,{"$f":"IFERROR(IF(AND(Z21=Z23),10,IF(Vacancy!E6=\"Executive/Managerial\",((10*Y23)/Trg_Exp!$K$2),IF(Z23>=Z21,((15*Y23)/Trg_Exp!$K$2)+10,0))),0)","v":0},{"$f":"IF(N3=\"\",0,IF(Y25<0,0,Y25))","v":0},"Total Score:"]
[]
[null,null,{"$f":"IF(Vacancy!E6=\"Second Level\",\"E. Accomplishment (15 pts.)\",\"E. Accomplishment (10 pts.)\")","v":"E. Accomplishment (10 pts.)"}]
[]
[null,null,null,null,"E.1  Awards/Citations/Commendations"]
[]
[false,null,null,null,"E.1.1. Unit Level",null,null,null,null,{"$f":"IF(A31=TRUE,1,\"\")","v":""}]
[]
[false,null,null,null,"E.1.2. University Level",null,null,null,null,{"$f":"IF(A33=TRUE,3,\"\")","v":""}]
[]
[false,null,null,null,"E.1.3. National/CSC Level",null,null,null,null,{"$f":"IF(A35=TRUE,5,\"\")","v":""}]
[null,null,null,null,"E.2. Innovations/ Systems Improvement"]
[false,null,null,null,null,null,null,null,null,{"$f":"IF(A37=TRUE,IF(Vacancy!E6=\"Second Level\",4,3),\"\")","v":""}]
[null,null,null,null,null,null,null,null,null,null,{"$f":"IF(E3=\"Second Level\",((SUM(J31,J33,J35)*11)/9),((SUM(J31,J33,J35)*7)/9))","v":0}]
[]
[null,null,null,null,"C.2. Total Score:",null,null,null,null,{"$f":"IF(E3=\"Second Level\",(15*SUM(K38,J37)/15),(10*SUM(K38,J37)/10))","v":0}]
[]
[null,null,{"$f":"IF(E3=\"Executive/Managerial\",\"F. Physical Characteristics and Personality Traits (10 pts.)\",\"F. Physical Characteristics and Personality Traits (5 pts.)\")","v":"F. Physical Characteristics and Personality Traits (5 pts.)"}]
[]
[null,null,null,null,"Supervisor",null,"Co-worker 1",null,"Co-worker 2",null,"Co-worker 3",null,null,"Supervisor",null,"Co-worker 1",null,"Co-worker 2",null,"Co-worker 3",null,null,"Supervisor",null,"Co-worker 1",null,"Co-worker 2",null,"Co-worker 3"]
[null,null,null,null,"ATTITUDE",null,null,null,null,null,null,null,null,"COMMITMENT",null,null,null,null,null,null,null,null,"APPEARANCE"]
[null,null,null,"F.1.1. ",null,null,null,null,null,null,null,null,"F.2.1. ",null,null,null,null,null,null,null,null,"F.3.1. "]
[null,null,null,"F.1.2. ",null,null,null,null,null,null,null,null,"F.2.2. ",null,null,null,null,null,null,null,null,"F.3.2. "]
[null,null,null,"F.1.3. ",null,null,null,null,null,null,null,null,"F.2.3. "]
[null,null,null,null,{"$f":"IF($E$3=\"Executive/Managerial\",(4*(SUM(E46:F48)/12)),(2*(SUM(E46:F48)/12)))","v":0},null,{"$f":"IF($E$3=\"Executive/Managerial\",(4*(SUM(G46:H48)/12)),(2*(SUM(G46:H48)/12)))","v":0},null,{"$f":"IF($E$3=\"Executive/Managerial\",(4*(SUM(I46:J48)/12)),(2*(SUM(I46:J48)/12)))","v":0},null,{"$f":"IF($E$3=\"Executive/Managerial\",(4*(SUM(K46:L48)/12)),(2*(SUM(K46:L48)/12)))","v":0},null,null,{"$f":"IF($E$3=\"Executive/Managerial\",(4*(SUM(N46:O48)/12)),(2*(SUM(N46:O48)/12)))","v":0},null,{"$f":"IF($E$3=\"Executive/Managerial\",(4*(SUM(P46:Q48)/12)),(2*(SUM(P46:Q48)/12)))","v":0},null,{"$f":"IF($E$3=\"Executive/Managerial\",(4*(SUM(R46:S48)/12)),(2*(SUM(R46:S48)/12)))","v":0},null,{"$f":"IF($E$3=\"Executive/Managerial\",(4*(SUM(T46:U48)/12)),(2*(SUM(T46:U48)/12)))","v":0},null,null,{"$f":"IF($E$3=\"Executive/Managerial\",(2*(SUM(W46:X48))/8),(1*(SUM(W46:X48))/8))","v":0},null,{"$f":"IF($E$3=\"Executive/Managerial\",(2*(SUM(Y46:Z48))/8),(1*(SUM(Y46:Z48))/8))","v":0},null,{"$f":"IF($E$3=\"Executive/Managerial\",(2*(SUM(AA46:AB48))/8),(1*(SUM(AA46:AB48))/8))","v":0},null,{"$f":"IF($E$3=\"Executive/Managerial\",(2*(SUM(AC46:AD48))/8),(1*(SUM(AC46:AD48))/8))","v":0}]
[null,null,null,null,null,null,"Supervisor",null,"Co-worker"]
[null,null,null,null,"Attitude",null,{"$f":"E49","v":0},null,{"$f":"SUM(G49:L49)/3","v":0},null,null,null,null,"Total Score PCPT:",null,null,{"$f":"IF(E3=\"Executive/Managerial\",SUM(G54:J54),SUM(G54:J54))","v":0}]
[null,null,null,null,"Commitment",null,{"$f":"N49","v":0},null,{"$f":"SUM(P49:U49)/3","v":0}]
[null,null,null,null,"Appearance",null,{"$f":"W49","v":0},null,{"$f":"SUM(Y49:AD49)/3","v":0}]
[null,null,null,null,null,null,{"$f":"SUM(G51:G53)*0.6","v":0},null,{"$f":"SUM(I51:I53)*0.4","v":0}]
[null,null,{"$f":"IF(E3=\"First Level\",\"G. Potential [Assessment Form No. 2] (3 pts.)\",\"G. Potential [Assessment Form No. 2] (5 pts.)\")","v":"G. Potential [Assessment Form No. 2] (5 pts.)"}]
[]
[null,null,null,"INTERVIEW"]
[]
[null,null,null,null,"G.1.1. Sound judgement",null,null,null,null,null,null,{"$f":"IF($E$3=\"First Level\",\"Not Applicable for First Level position\",\"\")","v":""}]
[null,null,null,null,"G.1.2. Analytical mind",null,null,null,null,null,null,{"$f":"IF($E$3=\"First Level\",\"Not Applicable for First Level position\",\"\")","v":""}]
[null,null,null,null,"G.1.3. The ability to motivate co-workers",null,null,null,null,null,null,{"$f":"IF($E$3=\"First Level\",\"Not Applicable for First Level position\",\"\")","v":""}]
[null,null,null,null,"G.1.4. Unifying Factor",null,null,null,null,null,null,{"$f":"IF($E$3=\"First Level\",\"Not Applicable for First Level position\",\"\")","v":""}]
[null,null,null,null,"G.1.5. Vision/foresight",null,null,null,null,null,null,{"$f":"IF($E$3=\"First Level\",\"Not Applicable for First Level position\",\"\")","v":""}]
[null,null,null,null,"G.2. Resourcefulness"]
[null,null,null,null,"G.3. Creativity/ Ingenuity "]
[]
[null,null,null,"TOTAL POINTS FOR POTENTIAL",null,null,null,null,null,null,{"$f":"IF(E3=\"First Level\",(3*(SUM(K64:K65)/8)),(5*(SUM(K59:K65)/28)))","v":0}]
[]
[null,null,{"$f":"IF(E3=\"First Level\",\"H. Written/ Skills Examination (12 pts.)\",\"H. Written/ Skills Examination (15 pts.)\")","v":"H. Written/ Skills Examination (15 pts.)"}]
[null,null,null,null,null,null,null,null,null,null,{"$f":"IFERROR(SUM(K59:K65)/7,0)","v":0}]
[null,null,null,"WRITTEN/SKILLS EXAMINATION"]
[]
[null,null,null,null,"Perfect/Entire Score",null,null,"="]
[null,null,null,null,"Raw Score",null,null,"="]
[]
[]
[null,null,null,"TOTAL FOR EXAMINATION",null,null,null,null,null,null,{"$f":"IFERROR(IF(E3=\"First Level\",IF(K74>K73,0,(K74*12)/K73),IF(K74>K73,0,(K74*15)/K73)),0)","v":0}]
[]
[null,null,"I. Public Service"]
[]
[null,null,null,null,"Additional Pts. in excess of Total Score"]

{"sheet":"AP9","index":16,"n_rows":81,"n_cols":33,"rows_kept":81,"cut":false,"hidden":false,"merged":[[1,2,1,29],[2,4,2,9],[2,13,2,22],[2,27,2,30],[2,32,2,33],[45,4,45,5],[45,6,45,7],[45,8,45,9],[45,10,45,11],[45,13,45,14],[10,15,10,22],[12,15,12,22],[14,15,14,22],[19,19,19,22],[35,4,37,7],[45,28,45,29],[45,24,45,25],[45,26,45,27],[6,11,6,22],[46,4,46,5],[46,6,46,7],[46,8,46,9],[46,10,46,11],[46,13,46,14],[46,17,46,18],[46,19,46,20],[46,22,46,23],[45,15,45,16],[45,17,45,18],[45,19,45,20],[45,22,45,23],[46,24,46,25],[46,26,46,27],[46,28,46,29],[47,4,47,5],[47,6,47,7],[47,8,47,9],[47,10,47,11],[47,13,47,14],[47,15,47,16],[47,17,47,18],[47,19,47,20],[47,22,47,23],[47,24,47,25],[47,26,47,27],[47,28,47,29],[46,15,46,16],[48,4,48,5],[48,6,48,7],[48,8,48,9],[48,10,48,11],[48,13,48,14],[48,28,48,29],[50,16,50,17],[48,15,48,16],[48,17,48,18],[48,19,48,20],[48,22,48,23],[48,24,48,25],[48,26,48,27]]}
[]
[null,null,"MSP CALCULATOR"]
[null,null,"Levels",":",{"$f":"IF(Vacancy!E6=\"\",\"\",Vacancy!E6)","v":""},null,null,null,null,null,null,"Name",":",null,null,null,null,null,null,null,null,null,null,null,null,null,"Employment Category:",null,null,null,null,null,{"$f":"SUM(F13,Y11,Y13,Y15,E25,Z25,J40,Q51,K67,K77,D81)","v":0}]
[null,null,null,null,null,null,null,null,null,null,null,null,null,null,null,null,null,null,null,null,null,null,null,null,null,null,null,null,null,null,null,null,"TOTAL MATRIX POINTS"]
[null,null,{"$f":"IF(E3=\"First Level\",\"A. Performance Rating (20 pts)\",IF(E3=\"Second Level\",\"A. Performance Rating (15 pts)\",\"A. Performance Rating (35 pts)\"))","v":"A. Performance Rating (35 pts)"},null,null,null,null,null,null,null,null,{"$f":"IF(E3=\"First Level\",\"B. Education (15 pts.)\",IF(E3=\"Second Level\",\"B. Education (10 pts.)\",\"B. Education (5 pts.)\"))","v":"B. Education (5 pts.)"}]
[null,null,"New Graduates (No previous work experience)",null,null,null,null,null,null,null,null,"Required:"]
[false,null,null,null,null,null,null,{"$f":"IF(F9>=2.75,1,IF(F9>=2.5,3,IF(F9>=2.25,5,IF(F9>=2,7,IF(F9>=1.75,9,IF(F9>=1.5,11,IF(F9>=1.25,13,IF(F9>=1,15))))))))","v":false},null,null,null,{"$f":"IF(Vacancy!E10=\"\",\"\",Vacancy!E10)","v":""}]
[]
[null,null,"GWA",null,null,null,{"$f":"IF(F9>=2.75,2,IF(F9>=2.5,5,IF(F9>=2.25,8,IF(F9>=2,11,IF(F9>=1.75,14,IF(F9>=1.5,16,IF(F9>=1.25,18,IF(F9>=1,20))))))))","v":false},{"$f":"IF(E3=\"First Level\",(20*F11)/5,IF(E3=\"Second Level\",(15*F11)/5,IF(E3=\"Executive/Managerial\",(35*F11)/5,\"\")))","v":""},null,null,null,"Highest Educational Attainment:",null,null,null,null,null,null,null,null,null,null,null,null,"Total Score:"]
[]
[null,null,"Last Rating Period",null,null,null,null,{"$f":"IFERROR(IF(AND(A7=TRUE,E3=\"First Level\"),G9,IF(AND(A7=TRUE,E3=\"Second Level\"),H7,H9)),\"\")","v":""},null,null,null,"First Level:",null,null,null,null,null,null,null,null,null,null,null,{"$f":"VLOOKUP(P11,Educ_2!$A$11:$B$26,2,FALSE)","v":{"$error":"#N/A"}},{"$f":"IFERROR(VLOOKUP($L$7,Educ_2!$A$1:$Q$8,X11+1,FALSE),\"\")","v":""}]
[]
[false,null,"Total Score",null,":",{"$f":"IF(H11=FALSE,0,H11)","v":""},"pts.",null,null,null,null,"Second Level:",null,null,null,null,null,null,null,null,null,null,null,{"$f":"VLOOKUP(P13,Educ_2!$A$11:$B$26,2,FALSE)","v":{"$error":"#N/A"}},{"$f":"IFERROR(VLOOKUP($L$7,Educ_2!$A$1:$Q$8,X13+1,FALSE),\"\")","v":""}]
[]
[null,null,null,null,null,null,null,null,null,null,null,"Executive/Managerial:",null,null,null,null,null,null,null,null,null,null,null,{"$f":"VLOOKUP(P15,Educ_2!$A$11:$B$26,2,FALSE)","v":{"$error":"#N/A"}},{"$f":"IFERROR(VLOOKUP($L$7,Educ_2!$A$1:$Q$8,X15+1,FALSE),\"\")","v":""}]
[]
[null,null,null,null,null,null,null,null,null,null,null,null,null,null,null,null,null,null,null,null,null,null,null,null,{"$f":"SUM(Y11,Y13,Y15)","v":0}]
[]
[null,null,"C. Training (10 pts.)",null,null,null,null,null,null,null,null,null,null,null,null,null,null,null,null,null,null,null,null,null,{"$f":"IF(E3=\"Executive/Managerial\",\"D. Experience (10 pts)\",\"D. Experience (25 pts)\")","v":"D. Experience (25 pts)"}]
[null,null,null,null,null,null,null,null,null,null,null,null,null,null,null,null,null,null,null,"Coversion to YEAR"]
[true,null,null,null,{"$f":"IF(Vacancy!$R$10=\"None required\",0,IF(Vacancy!$R$10=\"\",\"\",Vacancy!$R$10))","v":""},"Required (hrs.)",null,null,null,null,null,null,null,null,null,null,null,null,null,null,"Year",null,{"$f":"T21","v":0},null,null,{"$f":"IF(Vacancy!$AA$10=\"None required\",0,IF(Vacancy!$AA$10=\"\",\"\",Vacancy!$AA$10))","v":""},"Required Exp."]
[]
[null,null,null,{"$f":"E23-E21","v":{"$error":"#VALUE!"}},null,"Relevant training hrs. acquired",null,null,null,null,null,null,null,null,null,null,null,null,null,null,"Month",null,{"$f":"T23/12","v":0},null,{"$f":"Z23-Z21","v":{"$error":"#VALUE!"}},{"$f":"SUM(W21,W23,W25)","v":0},"Relevant years of experience"]
[]
[null,null,null,null,{"$f":"IF(N3=\"\",0,IFERROR(IF(E21=E23,5,IF(E23>=E21,((5*D23)/Trg_Exp!$D$2)+5,0)),0))","v":0},"Total",null,null,null,null,null,null,null,null,null,null,null,null,null,null,"Day",null,{"$f":"T25/365","v":0},null,{"$f":"IFERROR(IF(AND(Z21=Z23),10,IF(Vacancy!E6=\"Executive/Managerial\",((10*Y23)/Trg_Exp!$K$2),IF(Z23>=Z21,((15*Y23)/Trg_Exp!$K$2)+10,0))),0)","v":0},{"$f":"IF(N3=\"\",0,IF(Y25<0,0,Y25))","v":0},"Total Score:"]
[]
[null,null,{"$f":"IF(Vacancy!E6=\"Second Level\",\"E. Accomplishment (15 pts.)\",\"E. Accomplishment (10 pts.)\")","v":"E. Accomplishment (10 pts.)"}]
[]
[null,null,null,null,"E.1  Awards/Citations/Commendations"]
[]
[false,null,null,null,"E.1.1. Unit Level",null,null,null,null,{"$f":"IF(A31=TRUE,1,\"\")","v":""}]
[]
[false,null,null,null,"E.1.2. University Level",null,null,null,null,{"$f":"IF(A33=TRUE,3,\"\")","v":""}]
[]
[false,null,null,null,"E.1.3. National/CSC Level",null,null,null,null,{"$f":"IF(A35=TRUE,5,\"\")","v":""}]
[null,null,null,null,"E.2. Innovations/ Systems Improvement"]
[false,null,null,null,null,null,null,null,null,{"$f":"IF(A37=TRUE,IF(Vacancy!E6=\"Second Level\",4,3),\"\")","v":""}]
[null,null,null,null,null,null,null,null,null,null,{"$f":"IF(E3=\"Second Level\",((SUM(J31,J33,J35)*11)/9),((SUM(J31,J33,J35)*7)/9))","v":0}]
[]
[null,null,null,null,"C.2. Total Score:",null,null,null,null,{"$f":"IF(E3=\"Second Level\",(15*SUM(K38,J37)/15),(10*SUM(K38,J37)/10))","v":0}]
[]
[null,null,{"$f":"IF(E3=\"Executive/Managerial\",\"F. Physical Characteristics and Personality Traits (10 pts.)\",\"F. Physical Characteristics and Personality Traits (5 pts.)\")","v":"F. Physical Characteristics and Personality Traits (5 pts.)"}]
[]
[null,null,null,null,"Supervisor",null,"Co-worker 1",null,"Co-worker 2",null,"Co-worker 3",null,null,"Supervisor",null,"Co-worker 1",null,"Co-worker 2",null,"Co-worker 3",null,null,"Supervisor",null,"Co-worker 1",null,"Co-worker 2",null,"Co-worker 3"]
[null,null,null,null,"ATTITUDE",null,null,null,null,null,null,null,null,"COMMITMENT",null,null,null,null,null,null,null,null,"APPEARANCE"]
[null,null,null,"F.1.1. ",null,null,null,null,null,null,null,null,"F.2.1. ",null,null,null,null,null,null,null,null,"F.3.1. "]
[null,null,null,"F.1.2. ",null,null,null,null,null,null,null,null,"F.2.2. ",null,null,null,null,null,null,null,null,"F.3.2. "]
[null,null,null,"F.1.3. ",null,null,null,null,null,null,null,null,"F.2.3. "]
[null,null,null,null,{"$f":"IF($E$3=\"Executive/Managerial\",(4*(SUM(E46:F48)/12)),(2*(SUM(E46:F48)/12)))","v":0},null,{"$f":"IF($E$3=\"Executive/Managerial\",(4*(SUM(G46:H48)/12)),(2*(SUM(G46:H48)/12)))","v":0},null,{"$f":"IF($E$3=\"Executive/Managerial\",(4*(SUM(I46:J48)/12)),(2*(SUM(I46:J48)/12)))","v":0},null,{"$f":"IF($E$3=\"Executive/Managerial\",(4*(SUM(K46:L48)/12)),(2*(SUM(K46:L48)/12)))","v":0},null,null,{"$f":"IF($E$3=\"Executive/Managerial\",(4*(SUM(N46:O48)/12)),(2*(SUM(N46:O48)/12)))","v":0},null,{"$f":"IF($E$3=\"Executive/Managerial\",(4*(SUM(P46:Q48)/12)),(2*(SUM(P46:Q48)/12)))","v":0},null,{"$f":"IF($E$3=\"Executive/Managerial\",(4*(SUM(R46:S48)/12)),(2*(SUM(R46:S48)/12)))","v":0},null,{"$f":"IF($E$3=\"Executive/Managerial\",(4*(SUM(T46:U48)/12)),(2*(SUM(T46:U48)/12)))","v":0},null,null,{"$f":"IF($E$3=\"Executive/Managerial\",(2*(SUM(W46:X48))/8),(1*(SUM(W46:X48))/8))","v":0},null,{"$f":"IF($E$3=\"Executive/Managerial\",(2*(SUM(Y46:Z48))/8),(1*(SUM(Y46:Z48))/8))","v":0},null,{"$f":"IF($E$3=\"Executive/Managerial\",(2*(SUM(AA46:AB48))/8),(1*(SUM(AA46:AB48))/8))","v":0},null,{"$f":"IF($E$3=\"Executive/Managerial\",(2*(SUM(AC46:AD48))/8),(1*(SUM(AC46:AD48))/8))","v":0}]
[null,null,null,null,null,null,"Supervisor",null,"Co-worker"]
[null,null,null,null,"Attitude",null,{"$f":"E49","v":0},null,{"$f":"SUM(G49:L49)/3","v":0},null,null,null,null,"Total Score PCPT:",null,null,{"$f":"IF(E3=\"Executive/Managerial\",SUM(G54:J54),SUM(G54:J54))","v":0}]
[null,null,null,null,"Commitment",null,{"$f":"N49","v":0},null,{"$f":"SUM(P49:U49)/3","v":0}]
[null,null,null,null,"Appearance",null,{"$f":"W49","v":0},null,{"$f":"SUM(Y49:AD49)/3","v":0}]
[null,null,null,null,null,null,{"$f":"SUM(G51:G53)*0.6","v":0},null,{"$f":"SUM(I51:I53)*0.4","v":0}]
[null,null,{"$f":"IF(E3=\"First Level\",\"G. Potential [Assessment Form No. 2] (3 pts.)\",\"G. Potential [Assessment Form No. 2] (5 pts.)\")","v":"G. Potential [Assessment Form No. 2] (5 pts.)"}]
[]
[null,null,null,"INTERVIEW"]
[]
[null,null,null,null,"G.1.1. Sound judgement",null,null,null,null,null,null,{"$f":"IF($E$3=\"First Level\",\"Not Applicable for First Level position\",\"\")","v":""}]
[null,null,null,null,"G.1.2. Analytical mind",null,null,null,null,null,null,{"$f":"IF($E$3=\"First Level\",\"Not Applicable for First Level position\",\"\")","v":""}]
[null,null,null,null,"G.1.3. The ability to motivate co-workers",null,null,null,null,null,null,{"$f":"IF($E$3=\"First Level\",\"Not Applicable for First Level position\",\"\")","v":""}]
[null,null,null,null,"G.1.4. Unifying Factor",null,null,null,null,null,null,{"$f":"IF($E$3=\"First Level\",\"Not Applicable for First Level position\",\"\")","v":""}]
[null,null,null,null,"G.1.5. Vision/foresight",null,null,null,null,null,null,{"$f":"IF($E$3=\"First Level\",\"Not Applicable for First Level position\",\"\")","v":""}]
[null,null,null,null,"G.2. Resourcefulness"]
[null,null,null,null,"G.3. Creativity/ Ingenuity "]
[]
[null,null,null,"TOTAL POINTS FOR POTENTIAL",null,null,null,null,null,null,{"$f":"IF(E3=\"First Level\",(3*(SUM(K64:K65)/8)),(5*(SUM(K59:K65)/28)))","v":0}]
[]
[null,null,{"$f":"IF(E3=\"First Level\",\"H. Written/ Skills Examination (12 pts.)\",\"H. Written/ Skills Examination (15 pts.)\")","v":"H. Written/ Skills Examination (15 pts.)"}]
[null,null,null,null,null,null,null,null,null,null,{"$f":"IFERROR(SUM(K59:K65)/7,0)","v":0}]
[null,null,null,"WRITTEN/SKILLS EXAMINATION"]
[]
[null,null,null,null,"Perfect/Entire Score",null,null,"="]
[null,null,null,null,"Raw Score",null,null,"="]
[]
[]
[null,null,null,"TOTAL FOR EXAMINATION",null,null,null,null,null,null,{"$f":"IFERROR(IF(E3=\"First Level\",IF(K74>K73,0,(K74*12)/K73),IF(K74>K73,0,(K74*15)/K73)),0)","v":0}]
[]
[null,null,"I. Public Service"]
[]
[null,null,null,null,"Additional Pts. in excess of Total Score"]

{"sheet":"AP10","index":17,"n_rows":81,"n_cols":33,"rows_kept":81,"cut":false,"hidden":false,"merged":[[1,2,1,29],[2,4,2,9],[2,13,2,22],[2,27,2,30],[2,32,2,33],[45,4,45,5],[45,6,45,7],[45,8,45,9],[45,10,45,11],[45,13,45,14],[10,15,10,22],[12,15,12,22],[14,15,14,22],[19,19,19,22],[35,4,37,7],[45,28,45,29],[45,24,45,25],[45,26,45,27],[6,11,6,22],[46,4,46,5],[46,6,46,7],[46,8,46,9],[46,10,46,11],[46,13,46,14],[46,17,46,18],[46,19,46,20],[46,22,46,23],[45,15,45,16],[45,17,45,18],[45,19,45,20],[45,22,45,23],[46,24,46,25],[46,26,46,27],[46,28,46,29],[47,4,47,5],[47,6,47,7],[47,8,47,9],[47,10,47,11],[47,13,47,14],[47,15,47,16],[47,17,47,18],[47,19,47,20],[47,22,47,23],[47,24,47,25],[47,26,47,27],[47,28,47,29],[46,15,46,16],[48,4,48,5],[48,6,48,7],[48,8,48,9],[48,10,48,11],[48,13,48,14],[48,28,48,29],[50,16,50,17],[48,15,48,16],[48,17,48,18],[48,19,48,20],[48,22,48,23],[48,24,48,25],[48,26,48,27]]}
[]
[null,null,"MSP CALCULATOR"]
[null,null,"Levels",":",{"$f":"IF(Vacancy!E6=\"\",\"\",Vacancy!E6)","v":""},null,null,null,null,null,null,"Name",":",null,null,null,null,null,null,null,null,null,null,null,null,null,"Employment Category:",null,null,null,null,null,{"$f":"SUM(F13,Y11,Y13,Y15,E25,Z25,J40,Q51,K67,K77,D81)","v":0}]
[null,null,null,null,null,null,null,null,null,null,null,null,null,null,null,null,null,null,null,null,null,null,null,null,null,null,null,null,null,null,null,null,"TOTAL MATRIX POINTS"]
[null,null,{"$f":"IF(E3=\"First Level\",\"A. Performance Rating (20 pts)\",IF(E3=\"Second Level\",\"A. Performance Rating (15 pts)\",\"A. Performance Rating (35 pts)\"))","v":"A. Performance Rating (35 pts)"},null,null,null,null,null,null,null,null,{"$f":"IF(E3=\"First Level\",\"B. Education (15 pts.)\",IF(E3=\"Second Level\",\"B. Education (10 pts.)\",\"B. Education (5 pts.)\"))","v":"B. Education (5 pts.)"}]
[null,null,"New Graduates (No previous work experience)",null,null,null,null,null,null,null,null,"Required:"]
[false,null,null,null,null,null,null,{"$f":"IF(F9>=2.75,1,IF(F9>=2.5,3,IF(F9>=2.25,5,IF(F9>=2,7,IF(F9>=1.75,9,IF(F9>=1.5,11,IF(F9>=1.25,13,IF(F9>=1,15))))))))","v":false},null,null,null,{"$f":"IF(Vacancy!E10=\"\",\"\",Vacancy!E10)","v":""}]
[]
[null,null,"GWA",null,null,null,{"$f":"IF(F9>=2.75,2,IF(F9>=2.5,5,IF(F9>=2.25,8,IF(F9>=2,11,IF(F9>=1.75,14,IF(F9>=1.5,16,IF(F9>=1.25,18,IF(F9>=1,20))))))))","v":false},{"$f":"IF(E3=\"First Level\",(20*F11)/5,IF(E3=\"Second Level\",(15*F11)/5,IF(E3=\"Executive/Managerial\",(35*F11)/5,\"\")))","v":""},null,null,null,"Highest Educational Attainment:",null,null,null,null,null,null,null,null,null,null,null,null,"Total Score:"]
[]
[null,null,"Last Rating Period",null,null,null,null,{"$f":"IFERROR(IF(AND(A7=TRUE,E3=\"First Level\"),G9,IF(AND(A7=TRUE,E3=\"Second Level\"),H7,H9)),\"\")","v":""},null,null,null,"First Level:",null,null,null,null,null,null,null,null,null,null,null,{"$f":"VLOOKUP(P11,Educ_2!$A$11:$B$26,2,FALSE)","v":{"$error":"#N/A"}},{"$f":"IFERROR(VLOOKUP($L$7,Educ_2!$A$1:$Q$8,X11+1,FALSE),\"\")","v":""}]
[]
[false,null,"Total Score",null,":",{"$f":"IF(H11=FALSE,0,H11)","v":""},"pts.",null,null,null,null,"Second Level:",null,null,null,null,null,null,null,null,null,null,null,{"$f":"VLOOKUP(P13,Educ_2!$A$11:$B$26,2,FALSE)","v":{"$error":"#N/A"}},{"$f":"IFERROR(VLOOKUP($L$7,Educ_2!$A$1:$Q$8,X13+1,FALSE),\"\")","v":""}]
[]
[null,null,null,null,null,null,null,null,null,null,null,"Executive/Managerial:",null,null,null,null,null,null,null,null,null,null,null,{"$f":"VLOOKUP(P15,Educ_2!$A$11:$B$26,2,FALSE)","v":{"$error":"#N/A"}},{"$f":"IFERROR(VLOOKUP($L$7,Educ_2!$A$1:$Q$8,X15+1,FALSE),\"\")","v":""}]
[]
[null,null,null,null,null,null,null,null,null,null,null,null,null,null,null,null,null,null,null,null,null,null,null,null,{"$f":"SUM(Y11,Y13,Y15)","v":0}]
[]
[null,null,"C. Training (10 pts.)",null,null,null,null,null,null,null,null,null,null,null,null,null,null,null,null,null,null,null,null,null,{"$f":"IF(E3=\"Executive/Managerial\",\"D. Experience (10 pts)\",\"D. Experience (25 pts)\")","v":"D. Experience (25 pts)"}]
[null,null,null,null,null,null,null,null,null,null,null,null,null,null,null,null,null,null,null,"Coversion to YEAR"]
[true,null,null,null,{"$f":"IF(Vacancy!$R$10=\"None required\",0,IF(Vacancy!$R$10=\"\",\"\",Vacancy!$R$10))","v":""},"Required (hrs.)",null,null,null,null,null,null,null,null,null,null,null,null,null,null,"Year",null,{"$f":"T21","v":0},null,null,{"$f":"IF(Vacancy!$AA$10=\"None required\",0,IF(Vacancy!$AA$10=\"\",\"\",Vacancy!$AA$10))","v":""},"Required Exp."]
[]
[null,null,null,{"$f":"E23-E21","v":{"$error":"#VALUE!"}},null,"Relevant training hrs. acquired",null,null,null,null,null,null,null,null,null,null,null,null,null,null,"Month",null,{"$f":"T23/12","v":0},null,{"$f":"Z23-Z21","v":{"$error":"#VALUE!"}},{"$f":"SUM(W21,W23,W25)","v":0},"Relevant years of experience"]
[]
[null,null,null,null,{"$f":"IF(N3=\"\",0,IFERROR(IF(E21=E23,5,IF(E23>=E21,((5*D23)/Trg_Exp!$D$2)+5,0)),0))","v":0},"Total",null,null,null,null,null,null,null,null,null,null,null,null,null,null,"Day",null,{"$f":"T25/365","v":0},null,{"$f":"IFERROR(IF(AND(Z21=Z23),10,IF(Vacancy!E6=\"Executive/Managerial\",((10*Y23)/Trg_Exp!$K$2),IF(Z23>=Z21,((15*Y23)/Trg_Exp!$K$2)+10,0))),0)","v":0},{"$f":"IF(N3=\"\",0,IF(Y25<0,0,Y25))","v":0},"Total Score:"]
[]
[null,null,{"$f":"IF(Vacancy!E6=\"Second Level\",\"E. Accomplishment (15 pts.)\",\"E. Accomplishment (10 pts.)\")","v":"E. Accomplishment (10 pts.)"}]
[]
[null,null,null,null,"E.1  Awards/Citations/Commendations"]
[]
[false,null,null,null,"E.1.1. Unit Level",null,null,null,null,{"$f":"IF(A31=TRUE,1,\"\")","v":""}]
[]
[false,null,null,null,"E.1.2. University Level",null,null,null,null,{"$f":"IF(A33=TRUE,3,\"\")","v":""}]
[]
[false,null,null,null,"E.1.3. National/CSC Level",null,null,null,null,{"$f":"IF(A35=TRUE,5,\"\")","v":""}]
[null,null,null,null,"E.2. Innovations/ Systems Improvement"]
[false,null,null,null,null,null,null,null,null,{"$f":"IF(A37=TRUE,IF(Vacancy!E6=\"Second Level\",4,3),\"\")","v":""}]
[null,null,null,null,null,null,null,null,null,null,{"$f":"IF(E3=\"Second Level\",((SUM(J31,J33,J35)*11)/9),((SUM(J31,J33,J35)*7)/9))","v":0}]
[]
[null,null,null,null,"C.2. Total Score:",null,null,null,null,{"$f":"IF(E3=\"Second Level\",(15*SUM(K38,J37)/15),(10*SUM(K38,J37)/10))","v":0}]
[]
[null,null,{"$f":"IF(E3=\"Executive/Managerial\",\"F. Physical Characteristics and Personality Traits (10 pts.)\",\"F. Physical Characteristics and Personality Traits (5 pts.)\")","v":"F. Physical Characteristics and Personality Traits (5 pts.)"}]
[]
[null,null,null,null,"Supervisor",null,"Co-worker 1",null,"Co-worker 2",null,"Co-worker 3",null,null,"Supervisor",null,"Co-worker 1",null,"Co-worker 2",null,"Co-worker 3",null,null,"Supervisor",null,"Co-worker 1",null,"Co-worker 2",null,"Co-worker 3"]
[null,null,null,null,"ATTITUDE",null,null,null,null,null,null,null,null,"COMMITMENT",null,null,null,null,null,null,null,null,"APPEARANCE"]
[null,null,null,"F.1.1. ",null,null,null,null,null,null,null,null,"F.2.1. ",null,null,null,null,null,null,null,null,"F.3.1. "]
[null,null,null,"F.1.2. ",null,null,null,null,null,null,null,null,"F.2.2. ",null,null,null,null,null,null,null,null,"F.3.2. "]
[null,null,null,"F.1.3. ",null,null,null,null,null,null,null,null,"F.2.3. "]
[null,null,null,null,{"$f":"IF($E$3=\"Executive/Managerial\",(4*(SUM(E46:F48)/12)),(2*(SUM(E46:F48)/12)))","v":0},null,{"$f":"IF($E$3=\"Executive/Managerial\",(4*(SUM(G46:H48)/12)),(2*(SUM(G46:H48)/12)))","v":0},null,{"$f":"IF($E$3=\"Executive/Managerial\",(4*(SUM(I46:J48)/12)),(2*(SUM(I46:J48)/12)))","v":0},null,{"$f":"IF($E$3=\"Executive/Managerial\",(4*(SUM(K46:L48)/12)),(2*(SUM(K46:L48)/12)))","v":0},null,null,{"$f":"IF($E$3=\"Executive/Managerial\",(4*(SUM(N46:O48)/12)),(2*(SUM(N46:O48)/12)))","v":0},null,{"$f":"IF($E$3=\"Executive/Managerial\",(4*(SUM(P46:Q48)/12)),(2*(SUM(P46:Q48)/12)))","v":0},null,{"$f":"IF($E$3=\"Executive/Managerial\",(4*(SUM(R46:S48)/12)),(2*(SUM(R46:S48)/12)))","v":0},null,{"$f":"IF($E$3=\"Executive/Managerial\",(4*(SUM(T46:U48)/12)),(2*(SUM(T46:U48)/12)))","v":0},null,null,{"$f":"IF($E$3=\"Executive/Managerial\",(2*(SUM(W46:X48))/8),(1*(SUM(W46:X48))/8))","v":0},null,{"$f":"IF($E$3=\"Executive/Managerial\",(2*(SUM(Y46:Z48))/8),(1*(SUM(Y46:Z48))/8))","v":0},null,{"$f":"IF($E$3=\"Executive/Managerial\",(2*(SUM(AA46:AB48))/8),(1*(SUM(AA46:AB48))/8))","v":0},null,{"$f":"IF($E$3=\"Executive/Managerial\",(2*(SUM(AC46:AD48))/8),(1*(SUM(AC46:AD48))/8))","v":0}]
[null,null,null,null,null,null,"Supervisor",null,"Co-worker"]
[null,null,null,null,"Attitude",null,{"$f":"E49","v":0},null,{"$f":"SUM(G49:L49)/3","v":0},null,null,null,null,"Total Score PCPT:",null,null,{"$f":"IF(E3=\"Executive/Managerial\",SUM(G54:J54),SUM(G54:J54))","v":0}]
[null,null,null,null,"Commitment",null,{"$f":"N49","v":0},null,{"$f":"SUM(P49:U49)/3","v":0}]
[null,null,null,null,"Appearance",null,{"$f":"W49","v":0},null,{"$f":"SUM(Y49:AD49)/3","v":0}]
[null,null,null,null,null,null,{"$f":"SUM(G51:G53)*0.6","v":0},null,{"$f":"SUM(I51:I53)*0.4","v":0}]
[null,null,{"$f":"IF(E3=\"First Level\",\"G. Potential [Assessment Form No. 2] (3 pts.)\",\"G. Potential [Assessment Form No. 2] (5 pts.)\")","v":"G. Potential [Assessment Form No. 2] (5 pts.)"}]
[]
[null,null,null,"INTERVIEW"]
[]
[null,null,null,null,"G.1.1. Sound judgement",null,null,null,null,null,null,{"$f":"IF($E$3=\"First Level\",\"Not Applicable for First Level position\",\"\")","v":""}]
[null,null,null,null,"G.1.2. Analytical mind",null,null,null,null,null,null,{"$f":"IF($E$3=\"First Level\",\"Not Applicable for First Level position\",\"\")","v":""}]
[null,null,null,null,"G.1.3. The ability to motivate co-workers",null,null,null,null,null,null,{"$f":"IF($E$3=\"First Level\",\"Not Applicable for First Level position\",\"\")","v":""}]
[null,null,null,null,"G.1.4. Unifying Factor",null,null,null,null,null,null,{"$f":"IF($E$3=\"First Level\",\"Not Applicable for First Level position\",\"\")","v":""}]
[null,null,null,null,"G.1.5. Vision/foresight",null,null,null,null,null,null,{"$f":"IF($E$3=\"First Level\",\"Not Applicable for First Level position\",\"\")","v":""}]
[null,null,null,null,"G.2. Resourcefulness"]
[null,null,null,null,"G.3. Creativity/ Ingenuity "]
[]
[null,null,null,"TOTAL POINTS FOR POTENTIAL",null,null,null,null,null,null,{"$f":"IF(E3=\"First Level\",(3*(SUM(K64:K65)/8)),(5*(SUM(K59:K65)/28)))","v":0}]
[]
[null,null,{"$f":"IF(E3=\"First Level\",\"H. Written/ Skills Examination (12 pts.)\",\"H. Written/ Skills Examination (15 pts.)\")","v":"H. Written/ Skills Examination (15 pts.)"}]
[null,null,null,null,null,null,null,null,null,null,{"$f":"IFERROR(SUM(K59:K65)/7,0)","v":0}]
[null,null,null,"WRITTEN/SKILLS EXAMINATION"]
[]
[null,null,null,null,"Perfect/Entire Score",null,null,"="]
[null,null,null,null,"Raw Score",null,null,"="]
[]
[]
[null,null,null,"TOTAL FOR EXAMINATION",null,null,null,null,null,null,{"$f":"IFERROR(IF(E3=\"First Level\",IF(K74>K73,0,(K74*12)/K73),IF(K74>K73,0,(K74*15)/K73)),0)","v":0}]
[]
[null,null,"I. Public Service"]
[]
[null,null,null,null,"Additional Pts. in excess of Total Score"]

{"sheet":"AP11","index":18,"n_rows":81,"n_cols":33,"rows_kept":81,"cut":false,"hidden":false,"merged":[[1,2,1,29],[2,4,2,9],[2,13,2,22],[2,27,2,30],[2,32,2,33],[45,4,45,5],[45,6,45,7],[45,8,45,9],[45,10,45,11],[45,13,45,14],[10,15,10,22],[12,15,12,22],[14,15,14,22],[19,19,19,22],[35,4,37,7],[45,28,45,29],[45,24,45,25],[45,26,45,27],[6,11,6,22],[46,4,46,5],[46,6,46,7],[46,8,46,9],[46,10,46,11],[46,13,46,14],[46,17,46,18],[46,19,46,20],[46,22,46,23],[45,15,45,16],[45,17,45,18],[45,19,45,20],[45,22,45,23],[46,24,46,25],[46,26,46,27],[46,28,46,29],[47,4,47,5],[47,6,47,7],[47,8,47,9],[47,10,47,11],[47,13,47,14],[47,15,47,16],[47,17,47,18],[47,19,47,20],[47,22,47,23],[47,24,47,25],[47,26,47,27],[47,28,47,29],[46,15,46,16],[48,4,48,5],[48,6,48,7],[48,8,48,9],[48,10,48,11],[48,13,48,14],[48,28,48,29],[50,16,50,17],[48,15,48,16],[48,17,48,18],[48,19,48,20],[48,22,48,23],[48,24,48,25],[48,26,48,27]]}
[]
[null,null,"MSP CALCULATOR"]
[null,null,"Levels",":",{"$f":"IF(Vacancy!E6=\"\",\"\",Vacancy!E6)","v":""},null,null,null,null,null,null,"Name",":",null,null,null,null,null,null,null,null,null,null,null,null,null,"Employment Category:",null,null,null,null,null,{"$f":"SUM(F13,Y11,Y13,Y15,E25,Z25,J40,Q51,K67,K77,D81)","v":0}]
[null,null,null,null,null,null,null,null,null,null,null,null,null,null,null,null,null,null,null,null,null,null,null,null,null,null,null,null,null,null,null,null,"TOTAL MATRIX POINTS"]
[null,null,{"$f":"IF(E3=\"First Level\",\"A. Performance Rating (20 pts)\",IF(E3=\"Second Level\",\"A. Performance Rating (15 pts)\",\"A. Performance Rating (35 pts)\"))","v":"A. Performance Rating (35 pts)"},null,null,null,null,null,null,null,null,{"$f":"IF(E3=\"First Level\",\"B. Education (15 pts.)\",IF(E3=\"Second Level\",\"B. Education (10 pts.)\",\"B. Education (5 pts.)\"))","v":"B. Education (5 pts.)"}]
[null,null,"New Graduates (No previous work experience)",null,null,null,null,null,null,null,null,"Required:"]
[false,null,null,null,null,null,null,{"$f":"IF(F9>=2.75,1,IF(F9>=2.5,3,IF(F9>=2.25,5,IF(F9>=2,7,IF(F9>=1.75,9,IF(F9>=1.5,11,IF(F9>=1.25,13,IF(F9>=1,15))))))))","v":false},null,null,null,{"$f":"IF(Vacancy!E10=\"\",\"\",Vacancy!E10)","v":""}]
[]
[null,null,"GWA",null,null,null,{"$f":"IF(F9>=2.75,2,IF(F9>=2.5,5,IF(F9>=2.25,8,IF(F9>=2,11,IF(F9>=1.75,14,IF(F9>=1.5,16,IF(F9>=1.25,18,IF(F9>=1,20))))))))","v":false},{"$f":"IF(E3=\"First Level\",(20*F11)/5,IF(E3=\"Second Level\",(15*F11)/5,IF(E3=\"Executive/Managerial\",(35*F11)/5,\"\")))","v":""},null,null,null,"Highest Educational Attainment:",null,null,null,null,null,null,null,null,null,null,null,null,"Total Score:"]
[]
[null,null,"Last Rating Period",null,null,null,null,{"$f":"IFERROR(IF(AND(A7=TRUE,E3=\"First Level\"),G9,IF(AND(A7=TRUE,E3=\"Second Level\"),H7,H9)),\"\")","v":""},null,null,null,"First Level:",null,null,null,null,null,null,null,null,null,null,null,{"$f":"VLOOKUP(P11,Educ_2!$A$11:$B$26,2,FALSE)","v":{"$error":"#N/A"}},{"$f":"IFERROR(VLOOKUP($L$7,Educ_2!$A$1:$Q$8,X11+1,FALSE),\"\")","v":""}]
[]
[false,null,"Total Score",null,":",{"$f":"IF(H11=FALSE,0,H11)","v":""},"pts.",null,null,null,null,"Second Level:",null,null,null,null,null,null,null,null,null,null,null,{"$f":"VLOOKUP(P13,Educ_2!$A$11:$B$26,2,FALSE)","v":{"$error":"#N/A"}},{"$f":"IFERROR(VLOOKUP($L$7,Educ_2!$A$1:$Q$8,X13+1,FALSE),\"\")","v":""}]
[]
[null,null,null,null,null,null,null,null,null,null,null,"Executive/Managerial:",null,null,null,null,null,null,null,null,null,null,null,{"$f":"VLOOKUP(P15,Educ_2!$A$11:$B$26,2,FALSE)","v":{"$error":"#N/A"}},{"$f":"IFERROR(VLOOKUP($L$7,Educ_2!$A$1:$Q$8,X15+1,FALSE),\"\")","v":""}]
[]
[null,null,null,null,null,null,null,null,null,null,null,null,null,null,null,null,null,null,null,null,null,null,null,null,{"$f":"SUM(Y11,Y13,Y15)","v":0}]
[]
[null,null,"C. Training (10 pts.)",null,null,null,null,null,null,null,null,null,null,null,null,null,null,null,null,null,null,null,null,null,{"$f":"IF(E3=\"Executive/Managerial\",\"D. Experience (10 pts)\",\"D. Experience (25 pts)\")","v":"D. Experience (25 pts)"}]
[null,null,null,null,null,null,null,null,null,null,null,null,null,null,null,null,null,null,null,"Coversion to YEAR"]
[true,null,null,null,{"$f":"IF(Vacancy!$R$10=\"None required\",0,IF(Vacancy!$R$10=\"\",\"\",Vacancy!$R$10))","v":""},"Required (hrs.)",null,null,null,null,null,null,null,null,null,null,null,null,null,null,"Year",null,{"$f":"T21","v":0},null,null,{"$f":"IF(Vacancy!$AA$10=\"None required\",0,IF(Vacancy!$AA$10=\"\",\"\",Vacancy!$AA$10))","v":""},"Required Exp."]
[]
[null,null,null,{"$f":"E23-E21","v":{"$error":"#VALUE!"}},null,"Relevant training hrs. acquired",null,null,null,null,null,null,null,null,null,null,null,null,null,null,"Month",null,{"$f":"T23/12","v":0},null,{"$f":"Z23-Z21","v":{"$error":"#VALUE!"}},{"$f":"SUM(W21,W23,W25)","v":0},"Relevant years of experience"]
[]
[null,null,null,null,{"$f":"IF(N3=\"\",0,IFERROR(IF(E21=E23,5,IF(E23>=E21,((5*D23)/Trg_Exp!$D$2)+5,0)),0))","v":0},"Total",null,null,null,null,null,null,null,null,null,null,null,null,null,null,"Day",null,{"$f":"T25/365","v":0},null,{"$f":"IFERROR(IF(AND(Z21=Z23),10,IF(Vacancy!E6=\"Executive/Managerial\",((10*Y23)/Trg_Exp!$K$2),IF(Z23>=Z21,((15*Y23)/Trg_Exp!$K$2)+10,0))),0)","v":0},{"$f":"IF(N3=\"\",0,IF(Y25<0,0,Y25))","v":0},"Total Score:"]
[]
[null,null,{"$f":"IF(Vacancy!E6=\"Second Level\",\"E. Accomplishment (15 pts.)\",\"E. Accomplishment (10 pts.)\")","v":"E. Accomplishment (10 pts.)"}]
[]
[null,null,null,null,"E.1  Awards/Citations/Commendations"]
[]
[false,null,null,null,"E.1.1. Unit Level",null,null,null,null,{"$f":"IF(A31=TRUE,1,\"\")","v":""}]
[]
[false,null,null,null,"E.1.2. University Level",null,null,null,null,{"$f":"IF(A33=TRUE,3,\"\")","v":""}]
[]
[false,null,null,null,"E.1.3. National/CSC Level",null,null,null,null,{"$f":"IF(A35=TRUE,5,\"\")","v":""}]
[null,null,null,null,"E.2. Innovations/ Systems Improvement"]
[false,null,null,null,null,null,null,null,null,{"$f":"IF(A37=TRUE,IF(Vacancy!E6=\"Second Level\",4,3),\"\")","v":""}]
[null,null,null,null,null,null,null,null,null,null,{"$f":"IF(E3=\"Second Level\",((SUM(J31,J33,J35)*11)/9),((SUM(J31,J33,J35)*7)/9))","v":0}]
[]
[null,null,null,null,"C.2. Total Score:",null,null,null,null,{"$f":"IF(E3=\"Second Level\",(15*SUM(K38,J37)/15),(10*SUM(K38,J37)/10))","v":0}]
[]
[null,null,{"$f":"IF(E3=\"Executive/Managerial\",\"F. Physical Characteristics and Personality Traits (10 pts.)\",\"F. Physical Characteristics and Personality Traits (5 pts.)\")","v":"F. Physical Characteristics and Personality Traits (5 pts.)"}]
[]
[null,null,null,null,"Supervisor",null,"Co-worker 1",null,"Co-worker 2",null,"Co-worker 3",null,null,"Supervisor",null,"Co-worker 1",null,"Co-worker 2",null,"Co-worker 3",null,null,"Supervisor",null,"Co-worker 1",null,"Co-worker 2",null,"Co-worker 3"]
[null,null,null,null,"ATTITUDE",null,null,null,null,null,null,null,null,"COMMITMENT",null,null,null,null,null,null,null,null,"APPEARANCE"]
[null,null,null,"F.1.1. ",null,null,null,null,null,null,null,null,"F.2.1. ",null,null,null,null,null,null,null,null,"F.3.1. "]
[null,null,null,"F.1.2. ",null,null,null,null,null,null,null,null,"F.2.2. ",null,null,null,null,null,null,null,null,"F.3.2. "]
[null,null,null,"F.1.3. ",null,null,null,null,null,null,null,null,"F.2.3. "]
[null,null,null,null,{"$f":"IF($E$3=\"Executive/Managerial\",(4*(SUM(E46:F48)/12)),(2*(SUM(E46:F48)/12)))","v":0},null,{"$f":"IF($E$3=\"Executive/Managerial\",(4*(SUM(G46:H48)/12)),(2*(SUM(G46:H48)/12)))","v":0},null,{"$f":"IF($E$3=\"Executive/Managerial\",(4*(SUM(I46:J48)/12)),(2*(SUM(I46:J48)/12)))","v":0},null,{"$f":"IF($E$3=\"Executive/Managerial\",(4*(SUM(K46:L48)/12)),(2*(SUM(K46:L48)/12)))","v":0},null,null,{"$f":"IF($E$3=\"Executive/Managerial\",(4*(SUM(N46:O48)/12)),(2*(SUM(N46:O48)/12)))","v":0},null,{"$f":"IF($E$3=\"Executive/Managerial\",(4*(SUM(P46:Q48)/12)),(2*(SUM(P46:Q48)/12)))","v":0},null,{"$f":"IF($E$3=\"Executive/Managerial\",(4*(SUM(R46:S48)/12)),(2*(SUM(R46:S48)/12)))","v":0},null,{"$f":"IF($E$3=\"Executive/Managerial\",(4*(SUM(T46:U48)/12)),(2*(SUM(T46:U48)/12)))","v":0},null,null,{"$f":"IF($E$3=\"Executive/Managerial\",(2*(SUM(W46:X48))/8),(1*(SUM(W46:X48))/8))","v":0},null,{"$f":"IF($E$3=\"Executive/Managerial\",(2*(SUM(Y46:Z48))/8),(1*(SUM(Y46:Z48))/8))","v":0},null,{"$f":"IF($E$3=\"Executive/Managerial\",(2*(SUM(AA46:AB48))/8),(1*(SUM(AA46:AB48))/8))","v":0},null,{"$f":"IF($E$3=\"Executive/Managerial\",(2*(SUM(AC46:AD48))/8),(1*(SUM(AC46:AD48))/8))","v":0}]
[null,null,null,null,null,null,"Supervisor",null,"Co-worker"]
[null,null,null,null,"Attitude",null,{"$f":"E49","v":0},null,{"$f":"SUM(G49:L49)/3","v":0},null,null,null,null,"Total Score PCPT:",null,null,{"$f":"IF(E3=\"Executive/Managerial\",SUM(G54:J54),SUM(G54:J54))","v":0}]
[null,null,null,null,"Commitment",null,{"$f":"N49","v":0},null,{"$f":"SUM(P49:U49)/3","v":0}]
[null,null,null,null,"Appearance",null,{"$f":"W49","v":0},null,{"$f":"SUM(Y49:AD49)/3","v":0}]
[null,null,null,null,null,null,{"$f":"SUM(G51:G53)*0.6","v":0},null,{"$f":"SUM(I51:I53)*0.4","v":0}]
[null,null,{"$f":"IF(E3=\"First Level\",\"G. Potential [Assessment Form No. 2] (3 pts.)\",\"G. Potential [Assessment Form No. 2] (5 pts.)\")","v":"G. Potential [Assessment Form No. 2] (5 pts.)"}]
[]
[null,null,null,"INTERVIEW"]
[]
[null,null,null,null,"G.1.1. Sound judgement",null,null,null,null,null,null,{"$f":"IF($E$3=\"First Level\",\"Not Applicable for First Level position\",\"\")","v":""}]
[null,null,null,null,"G.1.2. Analytical mind",null,null,null,null,null,null,{"$f":"IF($E$3=\"First Level\",\"Not Applicable for First Level position\",\"\")","v":""}]
[null,null,null,null,"G.1.3. The ability to motivate co-workers",null,null,null,null,null,null,{"$f":"IF($E$3=\"First Level\",\"Not Applicable for First Level position\",\"\")","v":""}]
[null,null,null,null,"G.1.4. Unifying Factor",null,null,null,null,null,null,{"$f":"IF($E$3=\"First Level\",\"Not Applicable for First Level position\",\"\")","v":""}]
[null,null,null,null,"G.1.5. Vision/foresight",null,null,null,null,null,null,{"$f":"IF($E$3=\"First Level\",\"Not Applicable for First Level position\",\"\")","v":""}]
[null,null,null,null,"G.2. Resourcefulness"]
[null,null,null,null,"G.3. Creativity/ Ingenuity "]
[]
[null,null,null,"TOTAL POINTS FOR POTENTIAL",null,null,null,null,null,null,{"$f":"IF(E3=\"First Level\",(3*(SUM(K64:K65)/8)),(5*(SUM(K59:K65)/28)))","v":0}]
[]
[null,null,{"$f":"IF(E3=\"First Level\",\"H. Written/ Skills Examination (12 pts.)\",\"H. Written/ Skills Examination (15 pts.)\")","v":"H. Written/ Skills Examination (15 pts.)"}]
[null,null,null,null,null,null,null,null,null,null,{"$f":"IFERROR(SUM(K59:K65)/7,0)","v":0}]
[null,null,null,"WRITTEN/SKILLS EXAMINATION"]
[]
[null,null,null,null,"Perfect/Entire Score",null,null,"="]
[null,null,null,null,"Raw Score",null,null,"="]
[]
[]
[null,null,null,"TOTAL FOR EXAMINATION",null,null,null,null,null,null,{"$f":"IFERROR(IF(E3=\"First Level\",IF(K74>K73,0,(K74*12)/K73),IF(K74>K73,0,(K74*15)/K73)),0)","v":0}]
[]
[null,null,"I. Public Service"]
[]
[null,null,null,null,"Additional Pts. in excess of Total Score"]

{"sheet":"AP12","index":19,"n_rows":81,"n_cols":33,"rows_kept":81,"cut":false,"hidden":false,"merged":[[1,2,1,29],[2,4,2,9],[2,13,2,22],[2,27,2,30],[2,32,2,33],[45,4,45,5],[45,6,45,7],[45,8,45,9],[45,10,45,11],[45,13,45,14],[10,15,10,22],[12,15,12,22],[14,15,14,22],[19,19,19,22],[35,4,37,7],[45,28,45,29],[45,24,45,25],[45,26,45,27],[6,11,6,22],[46,4,46,5],[46,6,46,7],[46,8,46,9],[46,10,46,11],[46,13,46,14],[46,17,46,18],[46,19,46,20],[46,22,46,23],[45,15,45,16],[45,17,45,18],[45,19,45,20],[45,22,45,23],[46,24,46,25],[46,26,46,27],[46,28,46,29],[47,4,47,5],[47,6,47,7],[47,8,47,9],[47,10,47,11],[47,13,47,14],[47,15,47,16],[47,17,47,18],[47,19,47,20],[47,22,47,23],[47,24,47,25],[47,26,47,27],[47,28,47,29],[46,15,46,16],[48,4,48,5],[48,6,48,7],[48,8,48,9],[48,10,48,11],[48,13,48,14],[48,28,48,29],[50,16,50,17],[48,15,48,16],[48,17,48,18],[48,19,48,20],[48,22,48,23],[48,24,48,25],[48,26,48,27]]}
[]
[null,null,"MSP CALCULATOR"]
[null,null,"Levels",":",{"$f":"IF(Vacancy!E6=\"\",\"\",Vacancy!E6)","v":""},null,null,null,null,null,null,"Name",":",null,null,null,null,null,null,null,null,null,null,null,null,null,"Employment Category:",null,null,null,null,null,{"$f":"SUM(F13,Y11,Y13,Y15,E25,Z25,J40,Q51,K67,K77,D81)","v":0}]
[null,null,null,null,null,null,null,null,null,null,null,null,null,null,null,null,null,null,null,null,null,null,null,null,null,null,null,null,null,null,null,null,"TOTAL MATRIX POINTS"]
[null,null,{"$f":"IF(E3=\"First Level\",\"A. Performance Rating (20 pts)\",IF(E3=\"Second Level\",\"A. Performance Rating (15 pts)\",\"A. Performance Rating (35 pts)\"))","v":"A. Performance Rating (35 pts)"},null,null,null,null,null,null,null,null,{"$f":"IF(E3=\"First Level\",\"B. Education (15 pts.)\",IF(E3=\"Second Level\",\"B. Education (10 pts.)\",\"B. Education (5 pts.)\"))","v":"B. Education (5 pts.)"}]
[null,null,"New Graduates (No previous work experience)",null,null,null,null,null,null,null,null,"Required:"]
[false,null,null,null,null,null,null,{"$f":"IF(F9>=2.75,1,IF(F9>=2.5,3,IF(F9>=2.25,5,IF(F9>=2,7,IF(F9>=1.75,9,IF(F9>=1.5,11,IF(F9>=1.25,13,IF(F9>=1,15))))))))","v":false},null,null,null,{"$f":"IF(Vacancy!E10=\"\",\"\",Vacancy!E10)","v":""}]
[]
[null,null,"GWA",null,null,null,{"$f":"IF(F9>=2.75,2,IF(F9>=2.5,5,IF(F9>=2.25,8,IF(F9>=2,11,IF(F9>=1.75,14,IF(F9>=1.5,16,IF(F9>=1.25,18,IF(F9>=1,20))))))))","v":false},{"$f":"IF(E3=\"First Level\",(20*F11)/5,IF(E3=\"Second Level\",(15*F11)/5,IF(E3=\"Executive/Managerial\",(35*F11)/5,\"\")))","v":""},null,null,null,"Highest Educational Attainment:",null,null,null,null,null,null,null,null,null,null,null,null,"Total Score:"]
[]
[null,null,"Last Rating Period",null,null,null,null,{"$f":"IFERROR(IF(AND(A7=TRUE,E3=\"First Level\"),G9,IF(AND(A7=TRUE,E3=\"Second Level\"),H7,H9)),\"\")","v":""},null,null,null,"First Level:",null,null,null,null,null,null,null,null,null,null,null,{"$f":"VLOOKUP(P11,Educ_2!$A$11:$B$26,2,FALSE)","v":{"$error":"#N/A"}},{"$f":"IFERROR(VLOOKUP($L$7,Educ_2!$A$1:$Q$8,X11+1,FALSE),\"\")","v":""}]
[]
[false,null,"Total Score",null,":",{"$f":"IF(H11=FALSE,0,H11)","v":""},"pts.",null,null,null,null,"Second Level:",null,null,null,null,null,null,null,null,null,null,null,{"$f":"VLOOKUP(P13,Educ_2!$A$11:$B$26,2,FALSE)","v":{"$error":"#N/A"}},{"$f":"IFERROR(VLOOKUP($L$7,Educ_2!$A$1:$Q$8,X13+1,FALSE),\"\")","v":""}]
[]
[null,null,null,null,null,null,null,null,null,null,null,"Executive/Managerial:",null,null,null,null,null,null,null,null,null,null,null,{"$f":"VLOOKUP(P15,Educ_2!$A$11:$B$26,2,FALSE)","v":{"$error":"#N/A"}},{"$f":"IFERROR(VLOOKUP($L$7,Educ_2!$A$1:$Q$8,X15+1,FALSE),\"\")","v":""}]
[]
[null,null,null,null,null,null,null,null,null,null,null,null,null,null,null,null,null,null,null,null,null,null,null,null,{"$f":"SUM(Y11,Y13,Y15)","v":0}]
[]
[null,null,"C. Training (10 pts.)",null,null,null,null,null,null,null,null,null,null,null,null,null,null,null,null,null,null,null,null,null,{"$f":"IF(E3=\"Executive/Managerial\",\"D. Experience (10 pts)\",\"D. Experience (25 pts)\")","v":"D. Experience (25 pts)"}]
[null,null,null,null,null,null,null,null,null,null,null,null,null,null,null,null,null,null,null,"Coversion to YEAR"]
[true,null,null,null,{"$f":"IF(Vacancy!$R$10=\"None required\",0,IF(Vacancy!$R$10=\"\",\"\",Vacancy!$R$10))","v":""},"Required (hrs.)",null,null,null,null,null,null,null,null,null,null,null,null,null,null,"Year",null,{"$f":"T21","v":0},null,null,{"$f":"IF(Vacancy!$AA$10=\"None required\",0,IF(Vacancy!$AA$10=\"\",\"\",Vacancy!$AA$10))","v":""},"Required Exp."]
[]
[null,null,null,{"$f":"E23-E21","v":{"$error":"#VALUE!"}},null,"Relevant training hrs. acquired",null,null,null,null,null,null,null,null,null,null,null,null,null,null,"Month",null,{"$f":"T23/12","v":0},null,{"$f":"Z23-Z21","v":{"$error":"#VALUE!"}},{"$f":"SUM(W21,W23,W25)","v":0},"Relevant years of experience"]
[]
[null,null,null,null,{"$f":"IF(N3=\"\",0,IFERROR(IF(E21=E23,5,IF(E23>=E21,((5*D23)/Trg_Exp!$D$2)+5,0)),0))","v":0},"Total",null,null,null,null,null,null,null,null,null,null,null,null,null,null,"Day",null,{"$f":"T25/365","v":0},null,{"$f":"IFERROR(IF(AND(Z21=Z23),10,IF(Vacancy!E6=\"Executive/Managerial\",((10*Y23)/Trg_Exp!$K$2),IF(Z23>=Z21,((15*Y23)/Trg_Exp!$K$2)+10,0))),0)","v":0},{"$f":"IF(N3=\"\",0,IF(Y25<0,0,Y25))","v":0},"Total Score:"]
[]
[null,null,{"$f":"IF(Vacancy!E6=\"Second Level\",\"E. Accomplishment (15 pts.)\",\"E. Accomplishment (10 pts.)\")","v":"E. Accomplishment (10 pts.)"}]
[]
[null,null,null,null,"E.1  Awards/Citations/Commendations"]
[]
[false,null,null,null,"E.1.1. Unit Level",null,null,null,null,{"$f":"IF(A31=TRUE,1,\"\")","v":""}]
[]
[false,null,null,null,"E.1.2. University Level",null,null,null,null,{"$f":"IF(A33=TRUE,3,\"\")","v":""}]
[]
[false,null,null,null,"E.1.3. National/CSC Level",null,null,null,null,{"$f":"IF(A35=TRUE,5,\"\")","v":""}]
[null,null,null,null,"E.2. Innovations/ Systems Improvement"]
[false,null,null,null,null,null,null,null,null,{"$f":"IF(A37=TRUE,IF(Vacancy!E6=\"Second Level\",4,3),\"\")","v":""}]
[null,null,null,null,null,null,null,null,null,null,{"$f":"IF(E3=\"Second Level\",((SUM(J31,J33,J35)*11)/9),((SUM(J31,J33,J35)*7)/9))","v":0}]
[]
[null,null,null,null,"C.2. Total Score:",null,null,null,null,{"$f":"IF(E3=\"Second Level\",(15*SUM(K38,J37)/15),(10*SUM(K38,J37)/10))","v":0}]
[]
[null,null,{"$f":"IF(E3=\"Executive/Managerial\",\"F. Physical Characteristics and Personality Traits (10 pts.)\",\"F. Physical Characteristics and Personality Traits (5 pts.)\")","v":"F. Physical Characteristics and Personality Traits (5 pts.)"}]
[]
[null,null,null,null,"Supervisor",null,"Co-worker 1",null,"Co-worker 2",null,"Co-worker 3",null,null,"Supervisor",null,"Co-worker 1",null,"Co-worker 2",null,"Co-worker 3",null,null,"Supervisor",null,"Co-worker 1",null,"Co-worker 2",null,"Co-worker 3"]
[null,null,null,null,"ATTITUDE",null,null,null,null,null,null,null,null,"COMMITMENT",null,null,null,null,null,null,null,null,"APPEARANCE"]
[null,null,null,"F.1.1. ",null,null,null,null,null,null,null,null,"F.2.1. ",null,null,null,null,null,null,null,null,"F.3.1. "]
[null,null,null,"F.1.2. ",null,null,null,null,null,null,null,null,"F.2.2. ",null,null,null,null,null,null,null,null,"F.3.2. "]
[null,null,null,"F.1.3. ",null,null,null,null,null,null,null,null,"F.2.3. "]
[null,null,null,null,{"$f":"IF($E$3=\"Executive/Managerial\",(4*(SUM(E46:F48)/12)),(2*(SUM(E46:F48)/12)))","v":0},null,{"$f":"IF($E$3=\"Executive/Managerial\",(4*(SUM(G46:H48)/12)),(2*(SUM(G46:H48)/12)))","v":0},null,{"$f":"IF($E$3=\"Executive/Managerial\",(4*(SUM(I46:J48)/12)),(2*(SUM(I46:J48)/12)))","v":0},null,{"$f":"IF($E$3=\"Executive/Managerial\",(4*(SUM(K46:L48)/12)),(2*(SUM(K46:L48)/12)))","v":0},null,null,{"$f":"IF($E$3=\"Executive/Managerial\",(4*(SUM(N46:O48)/12)),(2*(SUM(N46:O48)/12)))","v":0},null,{"$f":"IF($E$3=\"Executive/Managerial\",(4*(SUM(P46:Q48)/12)),(2*(SUM(P46:Q48)/12)))","v":0},null,{"$f":"IF($E$3=\"Executive/Managerial\",(4*(SUM(R46:S48)/12)),(2*(SUM(R46:S48)/12)))","v":0},null,{"$f":"IF($E$3=\"Executive/Managerial\",(4*(SUM(T46:U48)/12)),(2*(SUM(T46:U48)/12)))","v":0},null,null,{"$f":"IF($E$3=\"Executive/Managerial\",(2*(SUM(W46:X48))/8),(1*(SUM(W46:X48))/8))","v":0},null,{"$f":"IF($E$3=\"Executive/Managerial\",(2*(SUM(Y46:Z48))/8),(1*(SUM(Y46:Z48))/8))","v":0},null,{"$f":"IF($E$3=\"Executive/Managerial\",(2*(SUM(AA46:AB48))/8),(1*(SUM(AA46:AB48))/8))","v":0},null,{"$f":"IF($E$3=\"Executive/Managerial\",(2*(SUM(AC46:AD48))/8),(1*(SUM(AC46:AD48))/8))","v":0}]
[null,null,null,null,null,null,"Supervisor",null,"Co-worker"]
[null,null,null,null,"Attitude",null,{"$f":"E49","v":0},null,{"$f":"SUM(G49:L49)/3","v":0},null,null,null,null,"Total Score PCPT:",null,null,{"$f":"IF(E3=\"Executive/Managerial\",SUM(G54:J54),SUM(G54:J54))","v":0}]
[null,null,null,null,"Commitment",null,{"$f":"N49","v":0},null,{"$f":"SUM(P49:U49)/3","v":0}]
[null,null,null,null,"Appearance",null,{"$f":"W49","v":0},null,{"$f":"SUM(Y49:AD49)/3","v":0}]
[null,null,null,null,null,null,{"$f":"SUM(G51:G53)*0.6","v":0},null,{"$f":"SUM(I51:I53)*0.4","v":0}]
[null,null,{"$f":"IF(E3=\"First Level\",\"G. Potential [Assessment Form No. 2] (3 pts.)\",\"G. Potential [Assessment Form No. 2] (5 pts.)\")","v":"G. Potential [Assessment Form No. 2] (5 pts.)"}]
[]
[null,null,null,"INTERVIEW"]
[]
[null,null,null,null,"G.1.1. Sound judgement",null,null,null,null,null,null,{"$f":"IF($E$3=\"First Level\",\"Not Applicable for First Level position\",\"\")","v":""}]
[null,null,null,null,"G.1.2. Analytical mind",null,null,null,null,null,null,{"$f":"IF($E$3=\"First Level\",\"Not Applicable for First Level position\",\"\")","v":""}]
[null,null,null,null,"G.1.3. The ability to motivate co-workers",null,null,null,null,null,null,{"$f":"IF($E$3=\"First Level\",\"Not Applicable for First Level position\",\"\")","v":""}]
[null,null,null,null,"G.1.4. Unifying Factor",null,null,null,null,null,null,{"$f":"IF($E$3=\"First Level\",\"Not Applicable for First Level position\",\"\")","v":""}]
[null,null,null,null,"G.1.5. Vision/foresight",null,null,null,null,null,null,{"$f":"IF($E$3=\"First Level\",\"Not Applicable for First Level position\",\"\")","v":""}]
[null,null,null,null,"G.2. Resourcefulness"]
[null,null,null,null,"G.3. Creativity/ Ingenuity "]
[]
[null,null,null,"TOTAL POINTS FOR POTENTIAL",null,null,null,null,null,null,{"$f":"IF(E3=\"First Level\",(3*(SUM(K64:K65)/8)),(5*(SUM(K59:K65)/28)))","v":0}]
[]
[null,null,{"$f":"IF(E3=\"First Level\",\"H. Written/ Skills Examination (12 pts.)\",\"H. Written/ Skills Examination (15 pts.)\")","v":"H. Written/ Skills Examination (15 pts.)"}]
[null,null,null,null,null,null,null,null,null,null,{"$f":"IFERROR(SUM(K59:K65)/7,0)","v":0}]
[null,null,null,"WRITTEN/SKILLS EXAMINATION"]
[]
[null,null,null,null,"Perfect/Entire Score",null,null,"="]
[null,null,null,null,"Raw Score",null,null,"="]
[]
[]
[null,null,null,"TOTAL FOR EXAMINATION",null,null,null,null,null,null,{"$f":"IFERROR(IF(E3=\"First Level\",IF(K74>K73,0,(K74*12)/K73),IF(K74>K73,0,(K74*15)/K73)),0)","v":0}]
[]
[null,null,"I. Public Service"]
[]
[null,null,null,null,"Additional Pts. in excess of Total Score"]

{"sheet":"AP13","index":20,"n_rows":81,"n_cols":33,"rows_kept":81,"cut":false,"hidden":false,"merged":[[1,2,1,29],[2,4,2,9],[2,13,2,22],[2,27,2,30],[2,32,2,33],[45,4,45,5],[45,6,45,7],[45,8,45,9],[45,10,45,11],[45,13,45,14],[10,15,10,22],[12,15,12,22],[14,15,14,22],[19,19,19,22],[35,4,37,7],[45,28,45,29],[45,24,45,25],[45,26,45,27],[6,11,6,22],[46,4,46,5],[46,6,46,7],[46,8,46,9],[46,10,46,11],[46,13,46,14],[46,17,46,18],[46,19,46,20],[46,22,46,23],[45,15,45,16],[45,17,45,18],[45,19,45,20],[45,22,45,23],[46,24,46,25],[46,26,46,27],[46,28,46,29],[47,4,47,5],[47,6,47,7],[47,8,47,9],[47,10,47,11],[47,13,47,14],[47,15,47,16],[47,17,47,18],[47,19,47,20],[47,22,47,23],[47,24,47,25],[47,26,47,27],[47,28,47,29],[46,15,46,16],[48,4,48,5],[48,6,48,7],[48,8,48,9],[48,10,48,11],[48,13,48,14],[48,28,48,29],[50,16,50,17],[48,15,48,16],[48,17,48,18],[48,19,48,20],[48,22,48,23],[48,24,48,25],[48,26,48,27]]}
[]
[null,null,"MSP CALCULATOR"]
[null,null,"Levels",":",{"$f":"IF(Vacancy!E6=\"\",\"\",Vacancy!E6)","v":""},null,null,null,null,null,null,"Name",":",null,null,null,null,null,null,null,null,null,null,null,null,null,"Employment Category:",null,null,null,null,null,{"$f":"SUM(F13,Y11,Y13,Y15,E25,Z25,J40,Q51,K67,K77,D81)","v":0}]
[null,null,null,null,null,null,null,null,null,null,null,null,null,null,null,null,null,null,null,null,null,null,null,null,null,null,null,null,null,null,null,null,"TOTAL MATRIX POINTS"]
[null,null,{"$f":"IF(E3=\"First Level\",\"A. Performance Rating (20 pts)\",IF(E3=\"Second Level\",\"A. Performance Rating (15 pts)\",\"A. Performance Rating (35 pts)\"))","v":"A. Performance Rating (35 pts)"},null,null,null,null,null,null,null,null,{"$f":"IF(E3=\"First Level\",\"B. Education (15 pts.)\",IF(E3=\"Second Level\",\"B. Education (10 pts.)\",\"B. Education (5 pts.)\"))","v":"B. Education (5 pts.)"}]
[null,null,"New Graduates (No previous work experience)",null,null,null,null,null,null,null,null,"Required:"]
[false,null,null,null,null,null,null,{"$f":"IF(F9>=2.75,1,IF(F9>=2.5,3,IF(F9>=2.25,5,IF(F9>=2,7,IF(F9>=1.75,9,IF(F9>=1.5,11,IF(F9>=1.25,13,IF(F9>=1,15))))))))","v":false},null,null,null,{"$f":"IF(Vacancy!E10=\"\",\"\",Vacancy!E10)","v":""}]
[]
[null,null,"GWA",null,null,null,{"$f":"IF(F9>=2.75,2,IF(F9>=2.5,5,IF(F9>=2.25,8,IF(F9>=2,11,IF(F9>=1.75,14,IF(F9>=1.5,16,IF(F9>=1.25,18,IF(F9>=1,20))))))))","v":false},{"$f":"IF(E3=\"First Level\",(20*F11)/5,IF(E3=\"Second Level\",(15*F11)/5,IF(E3=\"Executive/Managerial\",(35*F11)/5,\"\")))","v":""},null,null,null,"Highest Educational Attainment:",null,null,null,null,null,null,null,null,null,null,null,null,"Total Score:"]
[]
[null,null,"Last Rating Period",null,null,null,null,{"$f":"IFERROR(IF(AND(A7=TRUE,E3=\"First Level\"),G9,IF(AND(A7=TRUE,E3=\"Second Level\"),H7,H9)),\"\")","v":""},null,null,null,"First Level:",null,null,null,null,null,null,null,null,null,null,null,{"$f":"VLOOKUP(P11,Educ_2!$A$11:$B$26,2,FALSE)","v":{"$error":"#N/A"}},{"$f":"IFERROR(VLOOKUP($L$7,Educ_2!$A$1:$Q$8,X11+1,FALSE),\"\")","v":""}]
[]
[false,null,"Total Score",null,":",{"$f":"IF(H11=FALSE,0,H11)","v":""},"pts.",null,null,null,null,"Second Level:",null,null,null,null,null,null,null,null,null,null,null,{"$f":"VLOOKUP(P13,Educ_2!$A$11:$B$26,2,FALSE)","v":{"$error":"#N/A"}},{"$f":"IFERROR(VLOOKUP($L$7,Educ_2!$A$1:$Q$8,X13+1,FALSE),\"\")","v":""}]
[]
[null,null,null,null,null,null,null,null,null,null,null,"Executive/Managerial:",null,null,null,null,null,null,null,null,null,null,null,{"$f":"VLOOKUP(P15,Educ_2!$A$11:$B$26,2,FALSE)","v":{"$error":"#N/A"}},{"$f":"IFERROR(VLOOKUP($L$7,Educ_2!$A$1:$Q$8,X15+1,FALSE),\"\")","v":""}]
[]
[null,null,null,null,null,null,null,null,null,null,null,null,null,null,null,null,null,null,null,null,null,null,null,null,{"$f":"SUM(Y11,Y13,Y15)","v":0}]
[]
[null,null,"C. Training (10 pts.)",null,null,null,null,null,null,null,null,null,null,null,null,null,null,null,null,null,null,null,null,null,{"$f":"IF(E3=\"Executive/Managerial\",\"D. Experience (10 pts)\",\"D. Experience (25 pts)\")","v":"D. Experience (25 pts)"}]
[null,null,null,null,null,null,null,null,null,null,null,null,null,null,null,null,null,null,null,"Coversion to YEAR"]
[true,null,null,null,{"$f":"IF(Vacancy!$R$10=\"None required\",0,IF(Vacancy!$R$10=\"\",\"\",Vacancy!$R$10))","v":""},"Required (hrs.)",null,null,null,null,null,null,null,null,null,null,null,null,null,null,"Year",null,{"$f":"T21","v":0},null,null,{"$f":"IF(Vacancy!$AA$10=\"None required\",0,IF(Vacancy!$AA$10=\"\",\"\",Vacancy!$AA$10))","v":""},"Required Exp."]
[]
[null,null,null,{"$f":"E23-E21","v":{"$error":"#VALUE!"}},null,"Relevant training hrs. acquired",null,null,null,null,null,null,null,null,null,null,null,null,null,null,"Month",null,{"$f":"T23/12","v":0},null,{"$f":"Z23-Z21","v":{"$error":"#VALUE!"}},{"$f":"SUM(W21,W23,W25)","v":0},"Relevant years of experience"]
[]
[null,null,null,null,{"$f":"IF(N3=\"\",0,IFERROR(IF(E21=E23,5,IF(E23>=E21,((5*D23)/Trg_Exp!$D$2)+5,0)),0))","v":0},"Total",null,null,null,null,null,null,null,null,null,null,null,null,null,null,"Day",null,{"$f":"T25/365","v":0},null,{"$f":"IFERROR(IF(AND(Z21=Z23),10,IF(Vacancy!E6=\"Executive/Managerial\",((10*Y23)/Trg_Exp!$K$2),IF(Z23>=Z21,((15*Y23)/Trg_Exp!$K$2)+10,0))),0)","v":0},{"$f":"IF(N3=\"\",0,IF(Y25<0,0,Y25))","v":0},"Total Score:"]
[]
[null,null,{"$f":"IF(Vacancy!E6=\"Second Level\",\"E. Accomplishment (15 pts.)\",\"E. Accomplishment (10 pts.)\")","v":"E. Accomplishment (10 pts.)"}]
[]
[null,null,null,null,"E.1  Awards/Citations/Commendations"]
[]
[false,null,null,null,"E.1.1. Unit Level",null,null,null,null,{"$f":"IF(A31=TRUE,1,\"\")","v":""}]
[]
[false,null,null,null,"E.1.2. University Level",null,null,null,null,{"$f":"IF(A33=TRUE,3,\"\")","v":""}]
[]
[false,null,null,null,"E.1.3. National/CSC Level",null,null,null,null,{"$f":"IF(A35=TRUE,5,\"\")","v":""}]
[null,null,null,null,"E.2. Innovations/ Systems Improvement"]
[false,null,null,null,null,null,null,null,null,{"$f":"IF(A37=TRUE,IF(Vacancy!E6=\"Second Level\",4,3),\"\")","v":""}]
[null,null,null,null,null,null,null,null,null,null,{"$f":"IF(E3=\"Second Level\",((SUM(J31,J33,J35)*11)/9),((SUM(J31,J33,J35)*7)/9))","v":0}]
[]
[null,null,null,null,"C.2. Total Score:",null,null,null,null,{"$f":"IF(E3=\"Second Level\",(15*SUM(K38,J37)/15),(10*SUM(K38,J37)/10))","v":0}]
[]
[null,null,{"$f":"IF(E3=\"Executive/Managerial\",\"F. Physical Characteristics and Personality Traits (10 pts.)\",\"F. Physical Characteristics and Personality Traits (5 pts.)\")","v":"F. Physical Characteristics and Personality Traits (5 pts.)"}]
[]
[null,null,null,null,"Supervisor",null,"Co-worker 1",null,"Co-worker 2",null,"Co-worker 3",null,null,"Supervisor",null,"Co-worker 1",null,"Co-worker 2",null,"Co-worker 3",null,null,"Supervisor",null,"Co-worker 1",null,"Co-worker 2",null,"Co-worker 3"]
[null,null,null,null,"ATTITUDE",null,null,null,null,null,null,null,null,"COMMITMENT",null,null,null,null,null,null,null,null,"APPEARANCE"]
[null,null,null,"F.1.1. ",null,null,null,null,null,null,null,null,"F.2.1. ",null,null,null,null,null,null,null,null,"F.3.1. "]
[null,null,null,"F.1.2. ",null,null,null,null,null,null,null,null,"F.2.2. ",null,null,null,null,null,null,null,null,"F.3.2. "]
[null,null,null,"F.1.3. ",null,null,null,null,null,null,null,null,"F.2.3. "]
[null,null,null,null,{"$f":"IF($E$3=\"Executive/Managerial\",(4*(SUM(E46:F48)/12)),(2*(SUM(E46:F48)/12)))","v":0},null,{"$f":"IF($E$3=\"Executive/Managerial\",(4*(SUM(G46:H48)/12)),(2*(SUM(G46:H48)/12)))","v":0},null,{"$f":"IF($E$3=\"Executive/Managerial\",(4*(SUM(I46:J48)/12)),(2*(SUM(I46:J48)/12)))","v":0},null,{"$f":"IF($E$3=\"Executive/Managerial\",(4*(SUM(K46:L48)/12)),(2*(SUM(K46:L48)/12)))","v":0},null,null,{"$f":"IF($E$3=\"Executive/Managerial\",(4*(SUM(N46:O48)/12)),(2*(SUM(N46:O48)/12)))","v":0},null,{"$f":"IF($E$3=\"Executive/Managerial\",(4*(SUM(P46:Q48)/12)),(2*(SUM(P46:Q48)/12)))","v":0},null,{"$f":"IF($E$3=\"Executive/Managerial\",(4*(SUM(R46:S48)/12)),(2*(SUM(R46:S48)/12)))","v":0},null,{"$f":"IF($E$3=\"Executive/Managerial\",(4*(SUM(T46:U48)/12)),(2*(SUM(T46:U48)/12)))","v":0},null,null,{"$f":"IF($E$3=\"Executive/Managerial\",(2*(SUM(W46:X48))/8),(1*(SUM(W46:X48))/8))","v":0},null,{"$f":"IF($E$3=\"Executive/Managerial\",(2*(SUM(Y46:Z48))/8),(1*(SUM(Y46:Z48))/8))","v":0},null,{"$f":"IF($E$3=\"Executive/Managerial\",(2*(SUM(AA46:AB48))/8),(1*(SUM(AA46:AB48))/8))","v":0},null,{"$f":"IF($E$3=\"Executive/Managerial\",(2*(SUM(AC46:AD48))/8),(1*(SUM(AC46:AD48))/8))","v":0}]
[null,null,null,null,null,null,"Supervisor",null,"Co-worker"]
[null,null,null,null,"Attitude",null,{"$f":"E49","v":0},null,{"$f":"SUM(G49:L49)/3","v":0},null,null,null,null,"Total Score PCPT:",null,null,{"$f":"IF(E3=\"Executive/Managerial\",SUM(G54:J54),SUM(G54:J54))","v":0}]
[null,null,null,null,"Commitment",null,{"$f":"N49","v":0},null,{"$f":"SUM(P49:U49)/3","v":0}]
[null,null,null,null,"Appearance",null,{"$f":"W49","v":0},null,{"$f":"SUM(Y49:AD49)/3","v":0}]
[null,null,null,null,null,null,{"$f":"SUM(G51:G53)*0.6","v":0},null,{"$f":"SUM(I51:I53)*0.4","v":0}]
[null,null,{"$f":"IF(E3=\"First Level\",\"G. Potential [Assessment Form No. 2] (3 pts.)\",\"G. Potential [Assessment Form No. 2] (5 pts.)\")","v":"G. Potential [Assessment Form No. 2] (5 pts.)"}]
[]
[null,null,null,"INTERVIEW"]
[]
[null,null,null,null,"G.1.1. Sound judgement",null,null,null,null,null,null,{"$f":"IF($E$3=\"First Level\",\"Not Applicable for First Level position\",\"\")","v":""}]
[null,null,null,null,"G.1.2. Analytical mind",null,null,null,null,null,null,{"$f":"IF($E$3=\"First Level\",\"Not Applicable for First Level position\",\"\")","v":""}]
[null,null,null,null,"G.1.3. The ability to motivate co-workers",null,null,null,null,null,null,{"$f":"IF($E$3=\"First Level\",\"Not Applicable for First Level position\",\"\")","v":""}]
[null,null,null,null,"G.1.4. Unifying Factor",null,null,null,null,null,null,{"$f":"IF($E$3=\"First Level\",\"Not Applicable for First Level position\",\"\")","v":""}]
[null,null,null,null,"G.1.5. Vision/foresight",null,null,null,null,null,null,{"$f":"IF($E$3=\"First Level\",\"Not Applicable for First Level position\",\"\")","v":""}]
[null,null,null,null,"G.2. Resourcefulness"]
[null,null,null,null,"G.3. Creativity/ Ingenuity "]
[]
[null,null,null,"TOTAL POINTS FOR POTENTIAL",null,null,null,null,null,null,{"$f":"IF(E3=\"First Level\",(3*(SUM(K64:K65)/8)),(5*(SUM(K59:K65)/28)))","v":0}]
[]
[null,null,{"$f":"IF(E3=\"First Level\",\"H. Written/ Skills Examination (12 pts.)\",\"H. Written/ Skills Examination (15 pts.)\")","v":"H. Written/ Skills Examination (15 pts.)"}]
[null,null,null,null,null,null,null,null,null,null,{"$f":"IFERROR(SUM(K59:K65)/7,0)","v":0}]
[null,null,null,"WRITTEN/SKILLS EXAMINATION"]
[]
[null,null,null,null,"Perfect/Entire Score",null,null,"="]
[null,null,null,null,"Raw Score",null,null,"="]
[]
[]
[null,null,null,"TOTAL FOR EXAMINATION",null,null,null,null,null,null,{"$f":"IFERROR(IF(E3=\"First Level\",IF(K74>K73,0,(K74*12)/K73),IF(K74>K73,0,(K74*15)/K73)),0)","v":0}]
[]
[null,null,"I. Public Service"]
[]
[null,null,null,null,"Additional Pts. in excess of Total Score"]

{"sheet":"AP14","index":21,"n_rows":81,"n_cols":33,"rows_kept":81,"cut":false,"hidden":false,"merged":[[1,2,1,29],[2,4,2,9],[2,13,2,22],[2,27,2,30],[2,32,2,33],[45,4,45,5],[45,6,45,7],[45,8,45,9],[45,10,45,11],[45,13,45,14],[10,15,10,22],[12,15,12,22],[14,15,14,22],[19,19,19,22],[35,4,37,7],[45,28,45,29],[45,24,45,25],[45,26,45,27],[6,11,6,22],[46,4,46,5],[46,6,46,7],[46,8,46,9],[46,10,46,11],[46,13,46,14],[46,17,46,18],[46,19,46,20],[46,22,46,23],[45,15,45,16],[45,17,45,18],[45,19,45,20],[45,22,45,23],[46,24,46,25],[46,26,46,27],[46,28,46,29],[47,4,47,5],[47,6,47,7],[47,8,47,9],[47,10,47,11],[47,13,47,14],[47,15,47,16],[47,17,47,18],[47,19,47,20],[47,22,47,23],[47,24,47,25],[47,26,47,27],[47,28,47,29],[46,15,46,16],[48,4,48,5],[48,6,48,7],[48,8,48,9],[48,10,48,11],[48,13,48,14],[48,28,48,29],[50,16,50,17],[48,15,48,16],[48,17,48,18],[48,19,48,20],[48,22,48,23],[48,24,48,25],[48,26,48,27]]}
[]
[null,null,"MSP CALCULATOR"]
[null,null,"Levels",":",{"$f":"IF(Vacancy!E6=\"\",\"\",Vacancy!E6)","v":""},null,null,null,null,null,null,"Name",":",null,null,null,null,null,null,null,null,null,null,null,null,null,"Employment Category:",null,null,null,null,null,{"$f":"SUM(F13,Y11,Y13,Y15,E25,Z25,J40,Q51,K67,K77,D81)","v":0}]
[null,null,null,null,null,null,null,null,null,null,null,null,null,null,null,null,null,null,null,null,null,null,null,null,null,null,null,null,null,null,null,null,"TOTAL MATRIX POINTS"]
[null,null,{"$f":"IF(E3=\"First Level\",\"A. Performance Rating (20 pts)\",IF(E3=\"Second Level\",\"A. Performance Rating (15 pts)\",\"A. Performance Rating (35 pts)\"))","v":"A. Performance Rating (35 pts)"},null,null,null,null,null,null,null,null,{"$f":"IF(E3=\"First Level\",\"B. Education (15 pts.)\",IF(E3=\"Second Level\",\"B. Education (10 pts.)\",\"B. Education (5 pts.)\"))","v":"B. Education (5 pts.)"}]
[null,null,"New Graduates (No previous work experience)",null,null,null,null,null,null,null,null,"Required:"]
[false,null,null,null,null,null,null,{"$f":"IF(F9>=2.75,1,IF(F9>=2.5,3,IF(F9>=2.25,5,IF(F9>=2,7,IF(F9>=1.75,9,IF(F9>=1.5,11,IF(F9>=1.25,13,IF(F9>=1,15))))))))","v":false},null,null,null,{"$f":"IF(Vacancy!E10=\"\",\"\",Vacancy!E10)","v":""}]
[]
[null,null,"GWA",null,null,null,{"$f":"IF(F9>=2.75,2,IF(F9>=2.5,5,IF(F9>=2.25,8,IF(F9>=2,11,IF(F9>=1.75,14,IF(F9>=1.5,16,IF(F9>=1.25,18,IF(F9>=1,20))))))))","v":false},{"$f":"IF(E3=\"First Level\",(20*F11)/5,IF(E3=\"Second Level\",(15*F11)/5,IF(E3=\"Executive/Managerial\",(35*F11)/5,\"\")))","v":""},null,null,null,"Highest Educational Attainment:",null,null,null,null,null,null,null,null,null,null,null,null,"Total Score:"]
[]
[null,null,"Last Rating Period",null,null,null,null,{"$f":"IFERROR(IF(AND(A7=TRUE,E3=\"First Level\"),G9,IF(AND(A7=TRUE,E3=\"Second Level\"),H7,H9)),\"\")","v":""},null,null,null,"First Level:",null,null,null,null,null,null,null,null,null,null,null,{"$f":"VLOOKUP(P11,Educ_2!$A$11:$B$26,2,FALSE)","v":{"$error":"#N/A"}},{"$f":"IFERROR(VLOOKUP($L$7,Educ_2!$A$1:$Q$8,X11+1,FALSE),\"\")","v":""}]
[]
[false,null,"Total Score",null,":",{"$f":"IF(H11=FALSE,0,H11)","v":""},"pts.",null,null,null,null,"Second Level:",null,null,null,null,null,null,null,null,null,null,null,{"$f":"VLOOKUP(P13,Educ_2!$A$11:$B$26,2,FALSE)","v":{"$error":"#N/A"}},{"$f":"IFERROR(VLOOKUP($L$7,Educ_2!$A$1:$Q$8,X13+1,FALSE),\"\")","v":""}]
[]
[null,null,null,null,null,null,null,null,null,null,null,"Executive/Managerial:",null,null,null,null,null,null,null,null,null,null,null,{"$f":"VLOOKUP(P15,Educ_2!$A$11:$B$26,2,FALSE)","v":{"$error":"#N/A"}},{"$f":"IFERROR(VLOOKUP($L$7,Educ_2!$A$1:$Q$8,X15+1,FALSE),\"\")","v":""}]
[]
[null,null,null,null,null,null,null,null,null,null,null,null,null,null,null,null,null,null,null,null,null,null,null,null,{"$f":"SUM(Y11,Y13,Y15)","v":0}]
[]
[null,null,"C. Training (10 pts.)",null,null,null,null,null,null,null,null,null,null,null,null,null,null,null,null,null,null,null,null,null,{"$f":"IF(E3=\"Executive/Managerial\",\"D. Experience (10 pts)\",\"D. Experience (25 pts)\")","v":"D. Experience (25 pts)"}]
[null,null,null,null,null,null,null,null,null,null,null,null,null,null,null,null,null,null,null,"Coversion to YEAR"]
[true,null,null,null,{"$f":"IF(Vacancy!$R$10=\"None required\",0,IF(Vacancy!$R$10=\"\",\"\",Vacancy!$R$10))","v":""},"Required (hrs.)",null,null,null,null,null,null,null,null,null,null,null,null,null,null,"Year",null,{"$f":"T21","v":0},null,null,{"$f":"IF(Vacancy!$AA$10=\"None required\",0,IF(Vacancy!$AA$10=\"\",\"\",Vacancy!$AA$10))","v":""},"Required Exp."]
[]
[null,null,null,{"$f":"E23-E21","v":{"$error":"#VALUE!"}},null,"Relevant training hrs. acquired",null,null,null,null,null,null,null,null,null,null,null,null,null,null,"Month",null,{"$f":"T23/12","v":0},null,{"$f":"Z23-Z21","v":{"$error":"#VALUE!"}},{"$f":"SUM(W21,W23,W25)","v":0},"Relevant years of experience"]
[]
[null,null,null,null,{"$f":"IF(N3=\"\",0,IFERROR(IF(E21=E23,5,IF(E23>=E21,((5*D23)/Trg_Exp!$D$2)+5,0)),0))","v":0},"Total",null,null,null,null,null,null,null,null,null,null,null,null,null,null,"Day",null,{"$f":"T25/365","v":0},null,{"$f":"IFERROR(IF(AND(Z21=Z23),10,IF(Vacancy!E6=\"Executive/Managerial\",((10*Y23)/Trg_Exp!$K$2),IF(Z23>=Z21,((15*Y23)/Trg_Exp!$K$2)+10,0))),0)","v":0},{"$f":"IF(N3=\"\",0,IF(Y25<0,0,Y25))","v":0},"Total Score:"]
[]
[null,null,{"$f":"IF(Vacancy!E6=\"Second Level\",\"E. Accomplishment (15 pts.)\",\"E. Accomplishment (10 pts.)\")","v":"E. Accomplishment (10 pts.)"}]
[]
[null,null,null,null,"E.1  Awards/Citations/Commendations"]
[]
[false,null,null,null,"E.1.1. Unit Level",null,null,null,null,{"$f":"IF(A31=TRUE,1,\"\")","v":""}]
[]
[false,null,null,null,"E.1.2. University Level",null,null,null,null,{"$f":"IF(A33=TRUE,3,\"\")","v":""}]
[]
[false,null,null,null,"E.1.3. National/CSC Level",null,null,null,null,{"$f":"IF(A35=TRUE,5,\"\")","v":""}]
[null,null,null,null,"E.2. Innovations/ Systems Improvement"]
[false,null,null,null,null,null,null,null,null,{"$f":"IF(A37=TRUE,IF(Vacancy!E6=\"Second Level\",4,3),\"\")","v":""}]
[null,null,null,null,null,null,null,null,null,null,{"$f":"IF(E3=\"Second Level\",((SUM(J31,J33,J35)*11)/9),((SUM(J31,J33,J35)*7)/9))","v":0}]
[]
[null,null,null,null,"C.2. Total Score:",null,null,null,null,{"$f":"IF(E3=\"Second Level\",(15*SUM(K38,J37)/15),(10*SUM(K38,J37)/10))","v":0}]
[]
[null,null,{"$f":"IF(E3=\"Executive/Managerial\",\"F. Physical Characteristics and Personality Traits (10 pts.)\",\"F. Physical Characteristics and Personality Traits (5 pts.)\")","v":"F. Physical Characteristics and Personality Traits (5 pts.)"}]
[]
[null,null,null,null,"Supervisor",null,"Co-worker 1",null,"Co-worker 2",null,"Co-worker 3",null,null,"Supervisor",null,"Co-worker 1",null,"Co-worker 2",null,"Co-worker 3",null,null,"Supervisor",null,"Co-worker 1",null,"Co-worker 2",null,"Co-worker 3"]
[null,null,null,null,"ATTITUDE",null,null,null,null,null,null,null,null,"COMMITMENT",null,null,null,null,null,null,null,null,"APPEARANCE"]
[null,null,null,"F.1.1. ",null,null,null,null,null,null,null,null,"F.2.1. ",null,null,null,null,null,null,null,null,"F.3.1. "]
[null,null,null,"F.1.2. ",null,null,null,null,null,null,null,null,"F.2.2. ",null,null,null,null,null,null,null,null,"F.3.2. "]
[null,null,null,"F.1.3. ",null,null,null,null,null,null,null,null,"F.2.3. "]
[null,null,null,null,{"$f":"IF($E$3=\"Executive/Managerial\",(4*(SUM(E46:F48)/12)),(2*(SUM(E46:F48)/12)))","v":0},null,{"$f":"IF($E$3=\"Executive/Managerial\",(4*(SUM(G46:H48)/12)),(2*(SUM(G46:H48)/12)))","v":0},null,{"$f":"IF($E$3=\"Executive/Managerial\",(4*(SUM(I46:J48)/12)),(2*(SUM(I46:J48)/12)))","v":0},null,{"$f":"IF($E$3=\"Executive/Managerial\",(4*(SUM(K46:L48)/12)),(2*(SUM(K46:L48)/12)))","v":0},null,null,{"$f":"IF($E$3=\"Executive/Managerial\",(4*(SUM(N46:O48)/12)),(2*(SUM(N46:O48)/12)))","v":0},null,{"$f":"IF($E$3=\"Executive/Managerial\",(4*(SUM(P46:Q48)/12)),(2*(SUM(P46:Q48)/12)))","v":0},null,{"$f":"IF($E$3=\"Executive/Managerial\",(4*(SUM(R46:S48)/12)),(2*(SUM(R46:S48)/12)))","v":0},null,{"$f":"IF($E$3=\"Executive/Managerial\",(4*(SUM(T46:U48)/12)),(2*(SUM(T46:U48)/12)))","v":0},null,null,{"$f":"IF($E$3=\"Executive/Managerial\",(2*(SUM(W46:X48))/8),(1*(SUM(W46:X48))/8))","v":0},null,{"$f":"IF($E$3=\"Executive/Managerial\",(2*(SUM(Y46:Z48))/8),(1*(SUM(Y46:Z48))/8))","v":0},null,{"$f":"IF($E$3=\"Executive/Managerial\",(2*(SUM(AA46:AB48))/8),(1*(SUM(AA46:AB48))/8))","v":0},null,{"$f":"IF($E$3=\"Executive/Managerial\",(2*(SUM(AC46:AD48))/8),(1*(SUM(AC46:AD48))/8))","v":0}]
[null,null,null,null,null,null,"Supervisor",null,"Co-worker"]
[null,null,null,null,"Attitude",null,{"$f":"E49","v":0},null,{"$f":"SUM(G49:L49)/3","v":0},null,null,null,null,"Total Score PCPT:",null,null,{"$f":"IF(E3=\"Executive/Managerial\",SUM(G54:J54),SUM(G54:J54))","v":0}]
[null,null,null,null,"Commitment",null,{"$f":"N49","v":0},null,{"$f":"SUM(P49:U49)/3","v":0}]
[null,null,null,null,"Appearance",null,{"$f":"W49","v":0},null,{"$f":"SUM(Y49:AD49)/3","v":0}]
[null,null,null,null,null,null,{"$f":"SUM(G51:G53)*0.6","v":0},null,{"$f":"SUM(I51:I53)*0.4","v":0}]
[null,null,{"$f":"IF(E3=\"First Level\",\"G. Potential [Assessment Form No. 2] (3 pts.)\",\"G. Potential [Assessment Form No. 2] (5 pts.)\")","v":"G. Potential [Assessment Form No. 2] (5 pts.)"}]
[]
[null,null,null,"INTERVIEW"]
[]
[null,null,null,null,"G.1.1. Sound judgement",null,null,null,null,null,null,{"$f":"IF($E$3=\"First Level\",\"Not Applicable for First Level position\",\"\")","v":""}]
[null,null,null,null,"G.1.2. Analytical mind",null,null,null,null,null,null,{"$f":"IF($E$3=\"First Level\",\"Not Applicable for First Level position\",\"\")","v":""}]
[null,null,null,null,"G.1.3. The ability to motivate co-workers",null,null,null,null,null,null,{"$f":"IF($E$3=\"First Level\",\"Not Applicable for First Level position\",\"\")","v":""}]
[null,null,null,null,"G.1.4. Unifying Factor",null,null,null,null,null,null,{"$f":"IF($E$3=\"First Level\",\"Not Applicable for First Level position\",\"\")","v":""}]
[null,null,null,null,"G.1.5. Vision/foresight",null,null,null,null,null,null,{"$f":"IF($E$3=\"First Level\",\"Not Applicable for First Level position\",\"\")","v":""}]
[null,null,null,null,"G.2. Resourcefulness"]
[null,null,null,null,"G.3. Creativity/ Ingenuity "]
[]
[null,null,null,"TOTAL POINTS FOR POTENTIAL",null,null,null,null,null,null,{"$f":"IF(E3=\"First Level\",(3*(SUM(K64:K65)/8)),(5*(SUM(K59:K65)/28)))","v":0}]
[]
[null,null,{"$f":"IF(E3=\"First Level\",\"H. Written/ Skills Examination (12 pts.)\",\"H. Written/ Skills Examination (15 pts.)\")","v":"H. Written/ Skills Examination (15 pts.)"}]
[null,null,null,null,null,null,null,null,null,null,{"$f":"IFERROR(SUM(K59:K65)/7,0)","v":0}]
[null,null,null,"WRITTEN/SKILLS EXAMINATION"]
[]
[null,null,null,null,"Perfect/Entire Score",null,null,"="]
[null,null,null,null,"Raw Score",null,null,"="]
[]
[]
[null,null,null,"TOTAL FOR EXAMINATION",null,null,null,null,null,null,{"$f":"IFERROR(IF(E3=\"First Level\",IF(K74>K73,0,(K74*12)/K73),IF(K74>K73,0,(K74*15)/K73)),0)","v":0}]
[]
[null,null,"I. Public Service"]
[]
[null,null,null,null,"Additional Pts. in excess of Total Score"]

{"sheet":"AP15","index":22,"n_rows":81,"n_cols":33,"rows_kept":81,"cut":false,"hidden":false,"merged":[[1,2,1,29],[2,4,2,9],[2,13,2,22],[2,27,2,30],[2,32,2,33],[45,4,45,5],[45,6,45,7],[45,8,45,9],[45,10,45,11],[45,13,45,14],[10,15,10,22],[12,15,12,22],[14,15,14,22],[19,19,19,22],[35,4,37,7],[45,28,45,29],[45,24,45,25],[45,26,45,27],[6,11,6,22],[46,4,46,5],[46,6,46,7],[46,8,46,9],[46,10,46,11],[46,13,46,14],[46,17,46,18],[46,19,46,20],[46,22,46,23],[45,15,45,16],[45,17,45,18],[45,19,45,20],[45,22,45,23],[46,24,46,25],[46,26,46,27],[46,28,46,29],[47,4,47,5],[47,6,47,7],[47,8,47,9],[47,10,47,11],[47,13,47,14],[47,15,47,16],[47,17,47,18],[47,19,47,20],[47,22,47,23],[47,24,47,25],[47,26,47,27],[47,28,47,29],[46,15,46,16],[48,4,48,5],[48,6,48,7],[48,8,48,9],[48,10,48,11],[48,13,48,14],[48,28,48,29],[50,16,50,17],[48,15,48,16],[48,17,48,18],[48,19,48,20],[48,22,48,23],[48,24,48,25],[48,26,48,27]]}
[]
[null,null,"MSP CALCULATOR"]
[null,null,"Levels",":",{"$f":"IF(Vacancy!E6=\"\",\"\",Vacancy!E6)","v":""},null,null,null,null,null,null,"Name",":",null,null,null,null,null,null,null,null,null,null,null,null,null,"Employment Category:",null,null,null,null,null,{"$f":"SUM(F13,Y11,Y13,Y15,E25,Z25,J40,Q51,K67,K77,D81)","v":0}]
[null,null,null,null,null,null,null,null,null,null,null,null,null,null,null,null,null,null,null,null,null,null,null,null,null,null,null,null,null,null,null,null,"TOTAL MATRIX POINTS"]
[null,null,{"$f":"IF(E3=\"First Level\",\"A. Performance Rating (20 pts)\",IF(E3=\"Second Level\",\"A. Performance Rating (15 pts)\",\"A. Performance Rating (35 pts)\"))","v":"A. Performance Rating (35 pts)"},null,null,null,null,null,null,null,null,{"$f":"IF(E3=\"First Level\",\"B. Education (15 pts.)\",IF(E3=\"Second Level\",\"B. Education (10 pts.)\",\"B. Education (5 pts.)\"))","v":"B. Education (5 pts.)"}]
[null,null,"New Graduates (No previous work experience)",null,null,null,null,null,null,null,null,"Required:"]
[false,null,null,null,null,null,null,{"$f":"IF(F9>=2.75,1,IF(F9>=2.5,3,IF(F9>=2.25,5,IF(F9>=2,7,IF(F9>=1.75,9,IF(F9>=1.5,11,IF(F9>=1.25,13,IF(F9>=1,15))))))))","v":false},null,null,null,{"$f":"IF(Vacancy!E10=\"\",\"\",Vacancy!E10)","v":""}]
[]
[null,null,"GWA",null,null,null,{"$f":"IF(F9>=2.75,2,IF(F9>=2.5,5,IF(F9>=2.25,8,IF(F9>=2,11,IF(F9>=1.75,14,IF(F9>=1.5,16,IF(F9>=1.25,18,IF(F9>=1,20))))))))","v":false},{"$f":"IF(E3=\"First Level\",(20*F11)/5,IF(E3=\"Second Level\",(15*F11)/5,IF(E3=\"Executive/Managerial\",(35*F11)/5,\"\")))","v":""},null,null,null,"Highest Educational Attainment:",null,null,null,null,null,null,null,null,null,null,null,null,"Total Score:"]
[]
[null,null,"Last Rating Period",null,null,null,null,{"$f":"IFERROR(IF(AND(A7=TRUE,E3=\"First Level\"),G9,IF(AND(A7=TRUE,E3=\"Second Level\"),H7,H9)),\"\")","v":""},null,null,null,"First Level:",null,null,null,null,null,null,null,null,null,null,null,{"$f":"VLOOKUP(P11,Educ_2!$A$11:$B$26,2,FALSE)","v":{"$error":"#N/A"}},{"$f":"IFERROR(VLOOKUP($L$7,Educ_2!$A$1:$Q$8,X11+1,FALSE),\"\")","v":""}]
[]
[false,null,"Total Score",null,":",{"$f":"IF(H11=FALSE,0,H11)","v":""},"pts.",null,null,null,null,"Second Level:",null,null,null,null,null,null,null,null,null,null,null,{"$f":"VLOOKUP(P13,Educ_2!$A$11:$B$26,2,FALSE)","v":{"$error":"#N/A"}},{"$f":"IFERROR(VLOOKUP($L$7,Educ_2!$A$1:$Q$8,X13+1,FALSE),\"\")","v":""}]
[]
[null,null,null,null,null,null,null,null,null,null,null,"Executive/Managerial:",null,null,null,null,null,null,null,null,null,null,null,{"$f":"VLOOKUP(P15,Educ_2!$A$11:$B$26,2,FALSE)","v":{"$error":"#N/A"}},{"$f":"IFERROR(VLOOKUP($L$7,Educ_2!$A$1:$Q$8,X15+1,FALSE),\"\")","v":""}]
[]
[null,null,null,null,null,null,null,null,null,null,null,null,null,null,null,null,null,null,null,null,null,null,null,null,{"$f":"SUM(Y11,Y13,Y15)","v":0}]
[]
[null,null,"C. Training (10 pts.)",null,null,null,null,null,null,null,null,null,null,null,null,null,null,null,null,null,null,null,null,null,{"$f":"IF(E3=\"Executive/Managerial\",\"D. Experience (10 pts)\",\"D. Experience (25 pts)\")","v":"D. Experience (25 pts)"}]
[null,null,null,null,null,null,null,null,null,null,null,null,null,null,null,null,null,null,null,"Coversion to YEAR"]
[true,null,null,null,{"$f":"IF(Vacancy!$R$10=\"None required\",0,IF(Vacancy!$R$10=\"\",\"\",Vacancy!$R$10))","v":""},"Required (hrs.)",null,null,null,null,null,null,null,null,null,null,null,null,null,null,"Year",null,{"$f":"T21","v":0},null,null,{"$f":"IF(Vacancy!$AA$10=\"None required\",0,IF(Vacancy!$AA$10=\"\",\"\",Vacancy!$AA$10))","v":""},"Required Exp."]
[]
[null,null,null,{"$f":"E23-E21","v":{"$error":"#VALUE!"}},null,"Relevant training hrs. acquired",null,null,null,null,null,null,null,null,null,null,null,null,null,null,"Month",null,{"$f":"T23/12","v":0},null,{"$f":"Z23-Z21","v":{"$error":"#VALUE!"}},{"$f":"SUM(W21,W23,W25)","v":0},"Relevant years of experience"]
[]
[null,null,null,null,{"$f":"IF(N3=\"\",0,IFERROR(IF(E21=E23,5,IF(E23>=E21,((5*D23)/Trg_Exp!$D$2)+5,0)),0))","v":0},"Total",null,null,null,null,null,null,null,null,null,null,null,null,null,null,"Day",null,{"$f":"T25/365","v":0},null,{"$f":"IFERROR(IF(AND(Z21=Z23),10,IF(Vacancy!E6=\"Executive/Managerial\",((10*Y23)/Trg_Exp!$K$2),IF(Z23>=Z21,((15*Y23)/Trg_Exp!$K$2)+10,0))),0)","v":0},{"$f":"IF(N3=\"\",0,IF(Y25<0,0,Y25))","v":0},"Total Score:"]
[]
[null,null,{"$f":"IF(Vacancy!E6=\"Second Level\",\"E. Accomplishment (15 pts.)\",\"E. Accomplishment (10 pts.)\")","v":"E. Accomplishment (10 pts.)"}]
[]
[null,null,null,null,"E.1  Awards/Citations/Commendations"]
[]
[false,null,null,null,"E.1.1. Unit Level",null,null,null,null,{"$f":"IF(A31=TRUE,1,\"\")","v":""}]
[]
[false,null,null,null,"E.1.2. University Level",null,null,null,null,{"$f":"IF(A33=TRUE,3,\"\")","v":""}]
[]
[false,null,null,null,"E.1.3. National/CSC Level",null,null,null,null,{"$f":"IF(A35=TRUE,5,\"\")","v":""}]
[null,null,null,null,"E.2. Innovations/ Systems Improvement"]
[false,null,null,null,null,null,null,null,null,{"$f":"IF(A37=TRUE,IF(Vacancy!E6=\"Second Level\",4,3),\"\")","v":""}]
[null,null,null,null,null,null,null,null,null,null,{"$f":"IF(E3=\"Second Level\",((SUM(J31,J33,J35)*11)/9),((SUM(J31,J33,J35)*7)/9))","v":0}]
[]
[null,null,null,null,"C.2. Total Score:",null,null,null,null,{"$f":"IF(E3=\"Second Level\",(15*SUM(K38,J37)/15),(10*SUM(K38,J37)/10))","v":0}]
[]
[null,null,{"$f":"IF(E3=\"Executive/Managerial\",\"F. Physical Characteristics and Personality Traits (10 pts.)\",\"F. Physical Characteristics and Personality Traits (5 pts.)\")","v":"F. Physical Characteristics and Personality Traits (5 pts.)"}]
[]
[null,null,null,null,"Supervisor",null,"Co-worker 1",null,"Co-worker 2",null,"Co-worker 3",null,null,"Supervisor",null,"Co-worker 1",null,"Co-worker 2",null,"Co-worker 3",null,null,"Supervisor",null,"Co-worker 1",null,"Co-worker 2",null,"Co-worker 3"]
[null,null,null,null,"ATTITUDE",null,null,null,null,null,null,null,null,"COMMITMENT",null,null,null,null,null,null,null,null,"APPEARANCE"]
[null,null,null,"F.1.1. ",null,null,null,null,null,null,null,null,"F.2.1. ",null,null,null,null,null,null,null,null,"F.3.1. "]
[null,null,null,"F.1.2. ",null,null,null,null,null,null,null,null,"F.2.2. ",null,null,null,null,null,null,null,null,"F.3.2. "]
[null,null,null,"F.1.3. ",null,null,null,null,null,null,null,null,"F.2.3. "]
[null,null,null,null,{"$f":"IF($E$3=\"Executive/Managerial\",(4*(SUM(E46:F48)/12)),(2*(SUM(E46:F48)/12)))","v":0},null,{"$f":"IF($E$3=\"Executive/Managerial\",(4*(SUM(G46:H48)/12)),(2*(SUM(G46:H48)/12)))","v":0},null,{"$f":"IF($E$3=\"Executive/Managerial\",(4*(SUM(I46:J48)/12)),(2*(SUM(I46:J48)/12)))","v":0},null,{"$f":"IF($E$3=\"Executive/Managerial\",(4*(SUM(K46:L48)/12)),(2*(SUM(K46:L48)/12)))","v":0},null,null,{"$f":"IF($E$3=\"Executive/Managerial\",(4*(SUM(N46:O48)/12)),(2*(SUM(N46:O48)/12)))","v":0},null,{"$f":"IF($E$3=\"Executive/Managerial\",(4*(SUM(P46:Q48)/12)),(2*(SUM(P46:Q48)/12)))","v":0},null,{"$f":"IF($E$3=\"Executive/Managerial\",(4*(SUM(R46:S48)/12)),(2*(SUM(R46:S48)/12)))","v":0},null,{"$f":"IF($E$3=\"Executive/Managerial\",(4*(SUM(T46:U48)/12)),(2*(SUM(T46:U48)/12)))","v":0},null,null,{"$f":"IF($E$3=\"Executive/Managerial\",(2*(SUM(W46:X48))/8),(1*(SUM(W46:X48))/8))","v":0},null,{"$f":"IF($E$3=\"Executive/Managerial\",(2*(SUM(Y46:Z48))/8),(1*(SUM(Y46:Z48))/8))","v":0},null,{"$f":"IF($E$3=\"Executive/Managerial\",(2*(SUM(AA46:AB48))/8),(1*(SUM(AA46:AB48))/8))","v":0},null,{"$f":"IF($E$3=\"Executive/Managerial\",(2*(SUM(AC46:AD48))/8),(1*(SUM(AC46:AD48))/8))","v":0}]
[null,null,null,null,null,null,"Supervisor",null,"Co-worker"]
[null,null,null,null,"Attitude",null,{"$f":"E49","v":0},null,{"$f":"SUM(G49:L49)/3","v":0},null,null,null,null,"Total Score PCPT:",null,null,{"$f":"IF(E3=\"Executive/Managerial\",SUM(G54:J54),SUM(G54:J54))","v":0}]
[null,null,null,null,"Commitment",null,{"$f":"N49","v":0},null,{"$f":"SUM(P49:U49)/3","v":0}]
[null,null,null,null,"Appearance",null,{"$f":"W49","v":0},null,{"$f":"SUM(Y49:AD49)/3","v":0}]
[null,null,null,null,null,null,{"$f":"SUM(G51:G53)*0.6","v":0},null,{"$f":"SUM(I51:I53)*0.4","v":0}]
[null,null,{"$f":"IF(E3=\"First Level\",\"G. Potential [Assessment Form No. 2] (3 pts.)\",\"G. Potential [Assessment Form No. 2] (5 pts.)\")","v":"G. Potential [Assessment Form No. 2] (5 pts.)"}]
[]
[null,null,null,"INTERVIEW"]
[]
[null,null,null,null,"G.1.1. Sound judgement",null,null,null,null,null,null,{"$f":"IF($E$3=\"First Level\",\"Not Applicable for First Level position\",\"\")","v":""}]
[null,null,null,null,"G.1.2. Analytical mind",null,null,null,null,null,null,{"$f":"IF($E$3=\"First Level\",\"Not Applicable for First Level position\",\"\")","v":""}]
[null,null,null,null,"G.1.3. The ability to motivate co-workers",null,null,null,null,null,null,{"$f":"IF($E$3=\"First Level\",\"Not Applicable for First Level position\",\"\")","v":""}]
[null,null,null,null,"G.1.4. Unifying Factor",null,null,null,null,null,null,{"$f":"IF($E$3=\"First Level\",\"Not Applicable for First Level position\",\"\")","v":""}]
[null,null,null,null,"G.1.5. Vision/foresight",null,null,null,null,null,null,{"$f":"IF($E$3=\"First Level\",\"Not Applicable for First Level position\",\"\")","v":""}]
[null,null,null,null,"G.2. Resourcefulness"]
[null,null,null,null,"G.3. Creativity/ Ingenuity "]
[]
[null,null,null,"TOTAL POINTS FOR POTENTIAL",null,null,null,null,null,null,{"$f":"IF(E3=\"First Level\",(3*(SUM(K64:K65)/8)),(5*(SUM(K59:K65)/28)))","v":0}]
[]
[null,null,{"$f":"IF(E3=\"First Level\",\"H. Written/ Skills Examination (12 pts.)\",\"H. Written/ Skills Examination (15 pts.)\")","v":"H. Written/ Skills Examination (15 pts.)"}]
[null,null,null,null,null,null,null,null,null,null,{"$f":"IFERROR(SUM(K59:K65)/7,0)","v":0}]
[null,null,null,"WRITTEN/SKILLS EXAMINATION"]
[]
[null,null,null,null,"Perfect/Entire Score",null,null,"="]
[null,null,null,null,"Raw Score",null,null,"="]
[]
[]
[null,null,null,"TOTAL FOR EXAMINATION",null,null,null,null,null,null,{"$f":"IFERROR(IF(E3=\"First Level\",IF(K74>K73,0,(K74*12)/K73),IF(K74>K73,0,(K74*15)/K73)),0)","v":0}]
[]
[null,null,"I. Public Service"]
[]
[null,null,null,null,"Additional Pts. in excess of Total Score"]

{"sheet":"AP16","index":23,"n_rows":81,"n_cols":33,"rows_kept":81,"cut":false,"hidden":false,"merged":[[1,2,1,29],[2,4,2,9],[2,13,2,22],[2,27,2,30],[2,32,2,33],[45,4,45,5],[45,6,45,7],[45,8,45,9],[45,10,45,11],[45,13,45,14],[10,15,10,22],[12,15,12,22],[14,15,14,22],[19,19,19,22],[35,4,37,7],[45,28,45,29],[45,24,45,25],[45,26,45,27],[6,11,6,22],[46,4,46,5],[46,6,46,7],[46,8,46,9],[46,10,46,11],[46,13,46,14],[46,17,46,18],[46,19,46,20],[46,22,46,23],[45,15,45,16],[45,17,45,18],[45,19,45,20],[45,22,45,23],[46,24,46,25],[46,26,46,27],[46,28,46,29],[47,4,47,5],[47,6,47,7],[47,8,47,9],[47,10,47,11],[47,13,47,14],[47,15,47,16],[47,17,47,18],[47,19,47,20],[47,22,47,23],[47,24,47,25],[47,26,47,27],[47,28,47,29],[46,15,46,16],[48,4,48,5],[48,6,48,7],[48,8,48,9],[48,10,48,11],[48,13,48,14],[48,28,48,29],[50,16,50,17],[48,15,48,16],[48,17,48,18],[48,19,48,20],[48,22,48,23],[48,24,48,25],[48,26,48,27]]}
[]
[null,null,"MSP CALCULATOR"]
[null,null,"Levels",":",{"$f":"IF(Vacancy!E6=\"\",\"\",Vacancy!E6)","v":""},null,null,null,null,null,null,"Name",":",null,null,null,null,null,null,null,null,null,null,null,null,null,"Employment Category:",null,null,null,null,null,{"$f":"SUM(F13,Y11,Y13,Y15,E25,Z25,J40,Q51,K67,K77,D81)","v":0}]
[null,null,null,null,null,null,null,null,null,null,null,null,null,null,null,null,null,null,null,null,null,null,null,null,null,null,null,null,null,null,null,null,"TOTAL MATRIX POINTS"]
[null,null,{"$f":"IF(E3=\"First Level\",\"A. Performance Rating (20 pts)\",IF(E3=\"Second Level\",\"A. Performance Rating (15 pts)\",\"A. Performance Rating (35 pts)\"))","v":"A. Performance Rating (35 pts)"},null,null,null,null,null,null,null,null,{"$f":"IF(E3=\"First Level\",\"B. Education (15 pts.)\",IF(E3=\"Second Level\",\"B. Education (10 pts.)\",\"B. Education (5 pts.)\"))","v":"B. Education (5 pts.)"}]
[null,null,"New Graduates (No previous work experience)",null,null,null,null,null,null,null,null,"Required:"]
[false,null,null,null,null,null,null,{"$f":"IF(F9>=2.75,1,IF(F9>=2.5,3,IF(F9>=2.25,5,IF(F9>=2,7,IF(F9>=1.75,9,IF(F9>=1.5,11,IF(F9>=1.25,13,IF(F9>=1,15))))))))","v":false},null,null,null,{"$f":"IF(Vacancy!E10=\"\",\"\",Vacancy!E10)","v":""}]
[]
[null,null,"GWA",null,null,null,{"$f":"IF(F9>=2.75,2,IF(F9>=2.5,5,IF(F9>=2.25,8,IF(F9>=2,11,IF(F9>=1.75,14,IF(F9>=1.5,16,IF(F9>=1.25,18,IF(F9>=1,20))))))))","v":false},{"$f":"IF(E3=\"First Level\",(20*F11)/5,IF(E3=\"Second Level\",(15*F11)/5,IF(E3=\"Executive/Managerial\",(35*F11)/5,\"\")))","v":""},null,null,null,"Highest Educational Attainment:",null,null,null,null,null,null,null,null,null,null,null,null,"Total Score:"]
[]
[null,null,"Last Rating Period",null,null,null,null,{"$f":"IFERROR(IF(AND(A7=TRUE,E3=\"First Level\"),G9,IF(AND(A7=TRUE,E3=\"Second Level\"),H7,H9)),\"\")","v":""},null,null,null,"First Level:",null,null,null,null,null,null,null,null,null,null,null,{"$f":"VLOOKUP(P11,Educ_2!$A$11:$B$26,2,FALSE)","v":{"$error":"#N/A"}},{"$f":"IFERROR(VLOOKUP($L$7,Educ_2!$A$1:$Q$8,X11+1,FALSE),\"\")","v":""}]
[]
[false,null,"Total Score",null,":",{"$f":"IF(H11=FALSE,0,H11)","v":""},"pts.",null,null,null,null,"Second Level:",null,null,null,null,null,null,null,null,null,null,null,{"$f":"VLOOKUP(P13,Educ_2!$A$11:$B$26,2,FALSE)","v":{"$error":"#N/A"}},{"$f":"IFERROR(VLOOKUP($L$7,Educ_2!$A$1:$Q$8,X13+1,FALSE),\"\")","v":""}]
[]
[null,null,null,null,null,null,null,null,null,null,null,"Executive/Managerial:",null,null,null,null,null,null,null,null,null,null,null,{"$f":"VLOOKUP(P15,Educ_2!$A$11:$B$26,2,FALSE)","v":{"$error":"#N/A"}},{"$f":"IFERROR(VLOOKUP($L$7,Educ_2!$A$1:$Q$8,X15+1,FALSE),\"\")","v":""}]
[]
[null,null,null,null,null,null,null,null,null,null,null,null,null,null,null,null,null,null,null,null,null,null,null,null,{"$f":"SUM(Y11,Y13,Y15)","v":0}]
[]
[null,null,"C. Training (10 pts.)",null,null,null,null,null,null,null,null,null,null,null,null,null,null,null,null,null,null,null,null,null,{"$f":"IF(E3=\"Executive/Managerial\",\"D. Experience (10 pts)\",\"D. Experience (25 pts)\")","v":"D. Experience (25 pts)"}]
[null,null,null,null,null,null,null,null,null,null,null,null,null,null,null,null,null,null,null,"Coversion to YEAR"]
[true,null,null,null,{"$f":"IF(Vacancy!$R$10=\"None required\",0,IF(Vacancy!$R$10=\"\",\"\",Vacancy!$R$10))","v":""},"Required (hrs.)",null,null,null,null,null,null,null,null,null,null,null,null,null,null,"Year",null,{"$f":"T21","v":0},null,null,{"$f":"IF(Vacancy!$AA$10=\"None required\",0,IF(Vacancy!$AA$10=\"\",\"\",Vacancy!$AA$10))","v":""},"Required Exp."]
[]
[null,null,null,{"$f":"E23-E21","v":{"$error":"#VALUE!"}},null,"Relevant training hrs. acquired",null,null,null,null,null,null,null,null,null,null,null,null,null,null,"Month",null,{"$f":"T23/12","v":0},null,{"$f":"Z23-Z21","v":{"$error":"#VALUE!"}},{"$f":"SUM(W21,W23,W25)","v":0},"Relevant years of experience"]
[]
[null,null,null,null,{"$f":"IF(N3=\"\",0,IFERROR(IF(E21=E23,5,IF(E23>=E21,((5*D23)/Trg_Exp!$D$2)+5,0)),0))","v":0},"Total",null,null,null,null,null,null,null,null,null,null,null,null,null,null,"Day",null,{"$f":"T25/365","v":0},null,{"$f":"IFERROR(IF(AND(Z21=Z23),10,IF(Vacancy!E6=\"Executive/Managerial\",((10*Y23)/Trg_Exp!$K$2),IF(Z23>=Z21,((15*Y23)/Trg_Exp!$K$2)+10,0))),0)","v":0},{"$f":"IF(N3=\"\",0,IF(Y25<0,0,Y25))","v":0},"Total Score:"]
[]
[null,null,{"$f":"IF(Vacancy!E6=\"Second Level\",\"E. Accomplishment (15 pts.)\",\"E. Accomplishment (10 pts.)\")","v":"E. Accomplishment (10 pts.)"}]
[]
[null,null,null,null,"E.1  Awards/Citations/Commendations"]
[]
[false,null,null,null,"E.1.1. Unit Level",null,null,null,null,{"$f":"IF(A31=TRUE,1,\"\")","v":""}]
[]
[false,null,null,null,"E.1.2. University Level",null,null,null,null,{"$f":"IF(A33=TRUE,3,\"\")","v":""}]
[]
[false,null,null,null,"E.1.3. National/CSC Level",null,null,null,null,{"$f":"IF(A35=TRUE,5,\"\")","v":""}]
[null,null,null,null,"E.2. Innovations/ Systems Improvement"]
[false,null,null,null,null,null,null,null,null,{"$f":"IF(A37=TRUE,IF(Vacancy!E6=\"Second Level\",4,3),\"\")","v":""}]
[null,null,null,null,null,null,null,null,null,null,{"$f":"IF(E3=\"Second Level\",((SUM(J31,J33,J35)*11)/9),((SUM(J31,J33,J35)*7)/9))","v":0}]
[]
[null,null,null,null,"C.2. Total Score:",null,null,null,null,{"$f":"IF(E3=\"Second Level\",(15*SUM(K38,J37)/15),(10*SUM(K38,J37)/10))","v":0}]
[]
[null,null,{"$f":"IF(E3=\"Executive/Managerial\",\"F. Physical Characteristics and Personality Traits (10 pts.)\",\"F. Physical Characteristics and Personality Traits (5 pts.)\")","v":"F. Physical Characteristics and Personality Traits (5 pts.)"}]
[]
[null,null,null,null,"Supervisor",null,"Co-worker 1",null,"Co-worker 2",null,"Co-worker 3",null,null,"Supervisor",null,"Co-worker 1",null,"Co-worker 2",null,"Co-worker 3",null,null,"Supervisor",null,"Co-worker 1",null,"Co-worker 2",null,"Co-worker 3"]
[null,null,null,null,"ATTITUDE",null,null,null,null,null,null,null,null,"COMMITMENT",null,null,null,null,null,null,null,null,"APPEARANCE"]
[null,null,null,"F.1.1. ",null,null,null,null,null,null,null,null,"F.2.1. ",null,null,null,null,null,null,null,null,"F.3.1. "]
[null,null,null,"F.1.2. ",null,null,null,null,null,null,null,null,"F.2.2. ",null,null,null,null,null,null,null,null,"F.3.2. "]
[null,null,null,"F.1.3. ",null,null,null,null,null,null,null,null,"F.2.3. "]
[null,null,null,null,{"$f":"IF($E$3=\"Executive/Managerial\",(4*(SUM(E46:F48)/12)),(2*(SUM(E46:F48)/12)))","v":0},null,{"$f":"IF($E$3=\"Executive/Managerial\",(4*(SUM(G46:H48)/12)),(2*(SUM(G46:H48)/12)))","v":0},null,{"$f":"IF($E$3=\"Executive/Managerial\",(4*(SUM(I46:J48)/12)),(2*(SUM(I46:J48)/12)))","v":0},null,{"$f":"IF($E$3=\"Executive/Managerial\",(4*(SUM(K46:L48)/12)),(2*(SUM(K46:L48)/12)))","v":0},null,null,{"$f":"IF($E$3=\"Executive/Managerial\",(4*(SUM(N46:O48)/12)),(2*(SUM(N46:O48)/12)))","v":0},null,{"$f":"IF($E$3=\"Executive/Managerial\",(4*(SUM(P46:Q48)/12)),(2*(SUM(P46:Q48)/12)))","v":0},null,{"$f":"IF($E$3=\"Executive/Managerial\",(4*(SUM(R46:S48)/12)),(2*(SUM(R46:S48)/12)))","v":0},null,{"$f":"IF($E$3=\"Executive/Managerial\",(4*(SUM(T46:U48)/12)),(2*(SUM(T46:U48)/12)))","v":0},null,null,{"$f":"IF($E$3=\"Executive/Managerial\",(2*(SUM(W46:X48))/8),(1*(SUM(W46:X48))/8))","v":0},null,{"$f":"IF($E$3=\"Executive/Managerial\",(2*(SUM(Y46:Z48))/8),(1*(SUM(Y46:Z48))/8))","v":0},null,{"$f":"IF($E$3=\"Executive/Managerial\",(2*(SUM(AA46:AB48))/8),(1*(SUM(AA46:AB48))/8))","v":0},null,{"$f":"IF($E$3=\"Executive/Managerial\",(2*(SUM(AC46:AD48))/8),(1*(SUM(AC46:AD48))/8))","v":0}]
[null,null,null,null,null,null,"Supervisor",null,"Co-worker"]
[null,null,null,null,"Attitude",null,{"$f":"E49","v":0},null,{"$f":"SUM(G49:L49)/3","v":0},null,null,null,null,"Total Score PCPT:",null,null,{"$f":"IF(E3=\"Executive/Managerial\",SUM(G54:J54),SUM(G54:J54))","v":0}]
[null,null,null,null,"Commitment",null,{"$f":"N49","v":0},null,{"$f":"SUM(P49:U49)/3","v":0}]
[null,null,null,null,"Appearance",null,{"$f":"W49","v":0},null,{"$f":"SUM(Y49:AD49)/3","v":0}]
[null,null,null,null,null,null,{"$f":"SUM(G51:G53)*0.6","v":0},null,{"$f":"SUM(I51:I53)*0.4","v":0}]
[null,null,{"$f":"IF(E3=\"First Level\",\"G. Potential [Assessment Form No. 2] (3 pts.)\",\"G. Potential [Assessment Form No. 2] (5 pts.)\")","v":"G. Potential [Assessment Form No. 2] (5 pts.)"}]
[]
[null,null,null,"INTERVIEW"]
[]
[null,null,null,null,"G.1.1. Sound judgement",null,null,null,null,null,null,{"$f":"IF($E$3=\"First Level\",\"Not Applicable for First Level position\",\"\")","v":""}]
[null,null,null,null,"G.1.2. Analytical mind",null,null,null,null,null,null,{"$f":"IF($E$3=\"First Level\",\"Not Applicable for First Level position\",\"\")","v":""}]
[null,null,null,null,"G.1.3. The ability to motivate co-workers",null,null,null,null,null,null,{"$f":"IF($E$3=\"First Level\",\"Not Applicable for First Level position\",\"\")","v":""}]
[null,null,null,null,"G.1.4. Unifying Factor",null,null,null,null,null,null,{"$f":"IF($E$3=\"First Level\",\"Not Applicable for First Level position\",\"\")","v":""}]
[null,null,null,null,"G.1.5. Vision/foresight",null,null,null,null,null,null,{"$f":"IF($E$3=\"First Level\",\"Not Applicable for First Level position\",\"\")","v":""}]
[null,null,null,null,"G.2. Resourcefulness"]
[null,null,null,null,"G.3. Creativity/ Ingenuity "]
[]
[null,null,null,"TOTAL POINTS FOR POTENTIAL",null,null,null,null,null,null,{"$f":"IF(E3=\"First Level\",(3*(SUM(K64:K65)/8)),(5*(SUM(K59:K65)/28)))","v":0}]
[]
[null,null,{"$f":"IF(E3=\"First Level\",\"H. Written/ Skills Examination (12 pts.)\",\"H. Written/ Skills Examination (15 pts.)\")","v":"H. Written/ Skills Examination (15 pts.)"}]
[null,null,null,null,null,null,null,null,null,null,{"$f":"IFERROR(SUM(K59:K65)/7,0)","v":0}]
[null,null,null,"WRITTEN/SKILLS EXAMINATION"]
[]
[null,null,null,null,"Perfect/Entire Score",null,null,"="]
[null,null,null,null,"Raw Score",null,null,"="]
[]
[]
[null,null,null,"TOTAL FOR EXAMINATION",null,null,null,null,null,null,{"$f":"IFERROR(IF(E3=\"First Level\",IF(K74>K73,0,(K74*12)/K73),IF(K74>K73,0,(K74*15)/K73)),0)","v":0}]
[]
[null,null,"I. Public Service"]
[]
[null,null,null,null,"Additional Pts. in excess of Total Score"]

{"sheet":"AP17","index":24,"n_rows":81,"n_cols":33,"rows_kept":81,"cut":false,"hidden":false,"merged":[[1,2,1,29],[2,4,2,9],[2,13,2,22],[2,27,2,30],[2,32,2,33],[45,4,45,5],[45,6,45,7],[45,8,45,9],[45,10,45,11],[45,13,45,14],[10,15,10,22],[12,15,12,22],[14,15,14,22],[19,19,19,22],[35,4,37,7],[45,28,45,29],[45,24,45,25],[45,26,45,27],[6,11,6,22],[46,4,46,5],[46,6,46,7],[46,8,46,9],[46,10,46,11],[46,13,46,14],[46,17,46,18],[46,19,46,20],[46,22,46,23],[45,15,45,16],[45,17,45,18],[45,19,45,20],[45,22,45,23],[46,24,46,25],[46,26,46,27],[46,28,46,29],[47,4,47,5],[47,6,47,7],[47,8,47,9],[47,10,47,11],[47,13,47,14],[47,15,47,16],[47,17,47,18],[47,19,47,20],[47,22,47,23],[47,24,47,25],[47,26,47,27],[47,28,47,29],[46,15,46,16],[48,4,48,5],[48,6,48,7],[48,8,48,9],[48,10,48,11],[48,13,48,14],[48,28,48,29],[50,16,50,17],[48,15,48,16],[48,17,48,18],[48,19,48,20],[48,22,48,23],[48,24,48,25],[48,26,48,27]]}
[]
[null,null,"MSP CALCULATOR"]
[null,null,"Levels",":",{"$f":"IF(Vacancy!E6=\"\",\"\",Vacancy!E6)","v":""},null,null,null,null,null,null,"Name",":",null,null,null,null,null,null,null,null,null,null,null,null,null,"Employment Category:",null,null,null,null,null,{"$f":"SUM(F13,Y11,Y13,Y15,E25,Z25,J40,Q51,K67,K77,D81)","v":0}]
[null,null,null,null,null,null,null,null,null,null,null,null,null,null,null,null,null,null,null,null,null,null,null,null,null,null,null,null,null,null,null,null,"TOTAL MATRIX POINTS"]
[null,null,{"$f":"IF(E3=\"First Level\",\"A. Performance Rating (20 pts)\",IF(E3=\"Second Level\",\"A. Performance Rating (15 pts)\",\"A. Performance Rating (35 pts)\"))","v":"A. Performance Rating (35 pts)"},null,null,null,null,null,null,null,null,{"$f":"IF(E3=\"First Level\",\"B. Education (15 pts.)\",IF(E3=\"Second Level\",\"B. Education (10 pts.)\",\"B. Education (5 pts.)\"))","v":"B. Education (5 pts.)"}]
[null,null,"New Graduates (No previous work experience)",null,null,null,null,null,null,null,null,"Required:"]
[false,null,null,null,null,null,null,{"$f":"IF(F9>=2.75,1,IF(F9>=2.5,3,IF(F9>=2.25,5,IF(F9>=2,7,IF(F9>=1.75,9,IF(F9>=1.5,11,IF(F9>=1.25,13,IF(F9>=1,15))))))))","v":false},null,null,null,{"$f":"IF(Vacancy!E10=\"\",\"\",Vacancy!E10)","v":""}]
[]
[null,null,"GWA",null,null,null,{"$f":"IF(F9>=2.75,2,IF(F9>=2.5,5,IF(F9>=2.25,8,IF(F9>=2,11,IF(F9>=1.75,14,IF(F9>=1.5,16,IF(F9>=1.25,18,IF(F9>=1,20))))))))","v":false},{"$f":"IF(E3=\"First Level\",(20*F11)/5,IF(E3=\"Second Level\",(15*F11)/5,IF(E3=\"Executive/Managerial\",(35*F11)/5,\"\")))","v":""},null,null,null,"Highest Educational Attainment:",null,null,null,null,null,null,null,null,null,null,null,null,"Total Score:"]
[]
[null,null,"Last Rating Period",null,null,null,null,{"$f":"IFERROR(IF(AND(A7=TRUE,E3=\"First Level\"),G9,IF(AND(A7=TRUE,E3=\"Second Level\"),H7,H9)),\"\")","v":""},null,null,null,"First Level:",null,null,null,null,null,null,null,null,null,null,null,{"$f":"VLOOKUP(P11,Educ_2!$A$11:$B$26,2,FALSE)","v":{"$error":"#N/A"}},{"$f":"IFERROR(VLOOKUP($L$7,Educ_2!$A$1:$Q$8,X11+1,FALSE),\"\")","v":""}]
[]
[false,null,"Total Score",null,":",{"$f":"IF(H11=FALSE,0,H11)","v":""},"pts.",null,null,null,null,"Second Level:",null,null,null,null,null,null,null,null,null,null,null,{"$f":"VLOOKUP(P13,Educ_2!$A$11:$B$26,2,FALSE)","v":{"$error":"#N/A"}},{"$f":"IFERROR(VLOOKUP($L$7,Educ_2!$A$1:$Q$8,X13+1,FALSE),\"\")","v":""}]
[]
[null,null,null,null,null,null,null,null,null,null,null,"Executive/Managerial:",null,null,null,null,null,null,null,null,null,null,null,{"$f":"VLOOKUP(P15,Educ_2!$A$11:$B$26,2,FALSE)","v":{"$error":"#N/A"}},{"$f":"IFERROR(VLOOKUP($L$7,Educ_2!$A$1:$Q$8,X15+1,FALSE),\"\")","v":""}]
[]
[null,null,null,null,null,null,null,null,null,null,null,null,null,null,null,null,null,null,null,null,null,null,null,null,{"$f":"SUM(Y11,Y13,Y15)","v":0}]
[]
[null,null,"C. Training (10 pts.)",null,null,null,null,null,null,null,null,null,null,null,null,null,null,null,null,null,null,null,null,null,{"$f":"IF(E3=\"Executive/Managerial\",\"D. Experience (10 pts)\",\"D. Experience (25 pts)\")","v":"D. Experience (25 pts)"}]
[null,null,null,null,null,null,null,null,null,null,null,null,null,null,null,null,null,null,null,"Coversion to YEAR"]
[true,null,null,null,{"$f":"IF(Vacancy!$R$10=\"None required\",0,IF(Vacancy!$R$10=\"\",\"\",Vacancy!$R$10))","v":""},"Required (hrs.)",null,null,null,null,null,null,null,null,null,null,null,null,null,null,"Year",null,{"$f":"T21","v":0},null,null,{"$f":"IF(Vacancy!$AA$10=\"None required\",0,IF(Vacancy!$AA$10=\"\",\"\",Vacancy!$AA$10))","v":""},"Required Exp."]
[]
[null,null,null,{"$f":"E23-E21","v":{"$error":"#VALUE!"}},null,"Relevant training hrs. acquired",null,null,null,null,null,null,null,null,null,null,null,null,null,null,"Month",null,{"$f":"T23/12","v":0},null,{"$f":"Z23-Z21","v":{"$error":"#VALUE!"}},{"$f":"SUM(W21,W23,W25)","v":0},"Relevant years of experience"]
[]
[null,null,null,null,{"$f":"IF(N3=\"\",0,IFERROR(IF(E21=E23,5,IF(E23>=E21,((5*D23)/Trg_Exp!$D$2)+5,0)),0))","v":0},"Total",null,null,null,null,null,null,null,null,null,null,null,null,null,null,"Day",null,{"$f":"T25/365","v":0},null,{"$f":"IFERROR(IF(AND(Z21=Z23),10,IF(Vacancy!E6=\"Executive/Managerial\",((10*Y23)/Trg_Exp!$K$2),IF(Z23>=Z21,((15*Y23)/Trg_Exp!$K$2)+10,0))),0)","v":0},{"$f":"IF(N3=\"\",0,IF(Y25<0,0,Y25))","v":0},"Total Score:"]
[]
[null,null,{"$f":"IF(Vacancy!E6=\"Second Level\",\"E. Accomplishment (15 pts.)\",\"E. Accomplishment (10 pts.)\")","v":"E. Accomplishment (10 pts.)"}]
[]
[null,null,null,null,"E.1  Awards/Citations/Commendations"]
[]
[false,null,null,null,"E.1.1. Unit Level",null,null,null,null,{"$f":"IF(A31=TRUE,1,\"\")","v":""}]
[]
[false,null,null,null,"E.1.2. University Level",null,null,null,null,{"$f":"IF(A33=TRUE,3,\"\")","v":""}]
[]
[false,null,null,null,"E.1.3. National/CSC Level",null,null,null,null,{"$f":"IF(A35=TRUE,5,\"\")","v":""}]
[null,null,null,null,"E.2. Innovations/ Systems Improvement"]
[false,null,null,null,null,null,null,null,null,{"$f":"IF(A37=TRUE,IF(Vacancy!E6=\"Second Level\",4,3),\"\")","v":""}]
[null,null,null,null,null,null,null,null,null,null,{"$f":"IF(E3=\"Second Level\",((SUM(J31,J33,J35)*11)/9),((SUM(J31,J33,J35)*7)/9))","v":0}]
[]
[null,null,null,null,"C.2. Total Score:",null,null,null,null,{"$f":"IF(E3=\"Second Level\",(15*SUM(K38,J37)/15),(10*SUM(K38,J37)/10))","v":0}]
[]
[null,null,{"$f":"IF(E3=\"Executive/Managerial\",\"F. Physical Characteristics and Personality Traits (10 pts.)\",\"F. Physical Characteristics and Personality Traits (5 pts.)\")","v":"F. Physical Characteristics and Personality Traits (5 pts.)"}]
[]
[null,null,null,null,"Supervisor",null,"Co-worker 1",null,"Co-worker 2",null,"Co-worker 3",null,null,"Supervisor",null,"Co-worker 1",null,"Co-worker 2",null,"Co-worker 3",null,null,"Supervisor",null,"Co-worker 1",null,"Co-worker 2",null,"Co-worker 3"]
[null,null,null,null,"ATTITUDE",null,null,null,null,null,null,null,null,"COMMITMENT",null,null,null,null,null,null,null,null,"APPEARANCE"]
[null,null,null,"F.1.1. ",null,null,null,null,null,null,null,null,"F.2.1. ",null,null,null,null,null,null,null,null,"F.3.1. "]
[null,null,null,"F.1.2. ",null,null,null,null,null,null,null,null,"F.2.2. ",null,null,null,null,null,null,null,null,"F.3.2. "]
[null,null,null,"F.1.3. ",null,null,null,null,null,null,null,null,"F.2.3. "]
[null,null,null,null,{"$f":"IF($E$3=\"Executive/Managerial\",(4*(SUM(E46:F48)/12)),(2*(SUM(E46:F48)/12)))","v":0},null,{"$f":"IF($E$3=\"Executive/Managerial\",(4*(SUM(G46:H48)/12)),(2*(SUM(G46:H48)/12)))","v":0},null,{"$f":"IF($E$3=\"Executive/Managerial\",(4*(SUM(I46:J48)/12)),(2*(SUM(I46:J48)/12)))","v":0},null,{"$f":"IF($E$3=\"Executive/Managerial\",(4*(SUM(K46:L48)/12)),(2*(SUM(K46:L48)/12)))","v":0},null,null,{"$f":"IF($E$3=\"Executive/Managerial\",(4*(SUM(N46:O48)/12)),(2*(SUM(N46:O48)/12)))","v":0},null,{"$f":"IF($E$3=\"Executive/Managerial\",(4*(SUM(P46:Q48)/12)),(2*(SUM(P46:Q48)/12)))","v":0},null,{"$f":"IF($E$3=\"Executive/Managerial\",(4*(SUM(R46:S48)/12)),(2*(SUM(R46:S48)/12)))","v":0},null,{"$f":"IF($E$3=\"Executive/Managerial\",(4*(SUM(T46:U48)/12)),(2*(SUM(T46:U48)/12)))","v":0},null,null,{"$f":"IF($E$3=\"Executive/Managerial\",(2*(SUM(W46:X48))/8),(1*(SUM(W46:X48))/8))","v":0},null,{"$f":"IF($E$3=\"Executive/Managerial\",(2*(SUM(Y46:Z48))/8),(1*(SUM(Y46:Z48))/8))","v":0},null,{"$f":"IF($E$3=\"Executive/Managerial\",(2*(SUM(AA46:AB48))/8),(1*(SUM(AA46:AB48))/8))","v":0},null,{"$f":"IF($E$3=\"Executive/Managerial\",(2*(SUM(AC46:AD48))/8),(1*(SUM(AC46:AD48))/8))","v":0}]
[null,null,null,null,null,null,"Supervisor",null,"Co-worker"]
[null,null,null,null,"Attitude",null,{"$f":"E49","v":0},null,{"$f":"SUM(G49:L49)/3","v":0},null,null,null,null,"Total Score PCPT:",null,null,{"$f":"IF(E3=\"Executive/Managerial\",SUM(G54:J54),SUM(G54:J54))","v":0}]
[null,null,null,null,"Commitment",null,{"$f":"N49","v":0},null,{"$f":"SUM(P49:U49)/3","v":0}]
[null,null,null,null,"Appearance",null,{"$f":"W49","v":0},null,{"$f":"SUM(Y49:AD49)/3","v":0}]
[null,null,null,null,null,null,{"$f":"SUM(G51:G53)*0.6","v":0},null,{"$f":"SUM(I51:I53)*0.4","v":0}]
[null,null,{"$f":"IF(E3=\"First Level\",\"G. Potential [Assessment Form No. 2] (3 pts.)\",\"G. Potential [Assessment Form No. 2] (5 pts.)\")","v":"G. Potential [Assessment Form No. 2] (5 pts.)"}]
[]
[null,null,null,"INTERVIEW"]
[]
[null,null,null,null,"G.1.1. Sound judgement",null,null,null,null,null,null,{"$f":"IF($E$3=\"First Level\",\"Not Applicable for First Level position\",\"\")","v":""}]
[null,null,null,null,"G.1.2. Analytical mind",null,null,null,null,null,null,{"$f":"IF($E$3=\"First Level\",\"Not Applicable for First Level position\",\"\")","v":""}]
[null,null,null,null,"G.1.3. The ability to motivate co-workers",null,null,null,null,null,null,{"$f":"IF($E$3=\"First Level\",\"Not Applicable for First Level position\",\"\")","v":""}]
[null,null,null,null,"G.1.4. Unifying Factor",null,null,null,null,null,null,{"$f":"IF($E$3=\"First Level\",\"Not Applicable for First Level position\",\"\")","v":""}]
[null,null,null,null,"G.1.5. Vision/foresight",null,null,null,null,null,null,{"$f":"IF($E$3=\"First Level\",\"Not Applicable for First Level position\",\"\")","v":""}]
[null,null,null,null,"G.2. Resourcefulness"]
[null,null,null,null,"G.3. Creativity/ Ingenuity "]
[]
[null,null,null,"TOTAL POINTS FOR POTENTIAL",null,null,null,null,null,null,{"$f":"IF(E3=\"First Level\",(3*(SUM(K64:K65)/8)),(5*(SUM(K59:K65)/28)))","v":0}]
[]
[null,null,{"$f":"IF(E3=\"First Level\",\"H. Written/ Skills Examination (12 pts.)\",\"H. Written/ Skills Examination (15 pts.)\")","v":"H. Written/ Skills Examination (15 pts.)"}]
[null,null,null,null,null,null,null,null,null,null,{"$f":"IFERROR(SUM(K59:K65)/7,0)","v":0}]
[null,null,null,"WRITTEN/SKILLS EXAMINATION"]
[]
[null,null,null,null,"Perfect/Entire Score",null,null,"="]
[null,null,null,null,"Raw Score",null,null,"="]
[]
[]
[null,null,null,"TOTAL FOR EXAMINATION",null,null,null,null,null,null,{"$f":"IFERROR(IF(E3=\"First Level\",IF(K74>K73,0,(K74*12)/K73),IF(K74>K73,0,(K74*15)/K73)),0)","v":0}]
[]
[null,null,"I. Public Service"]
[]
[null,null,null,null,"Additional Pts. in excess of Total Score"]

{"sheet":"AP18","index":25,"n_rows":81,"n_cols":33,"rows_kept":81,"cut":false,"hidden":false,"merged":[[1,2,1,29],[2,4,2,9],[2,13,2,22],[2,27,2,30],[2,32,2,33],[45,4,45,5],[45,6,45,7],[45,8,45,9],[45,10,45,11],[45,13,45,14],[10,15,10,22],[12,15,12,22],[14,15,14,22],[19,19,19,22],[35,4,37,7],[45,28,45,29],[45,24,45,25],[45,26,45,27],[6,11,6,22],[46,4,46,5],[46,6,46,7],[46,8,46,9],[46,10,46,11],[46,13,46,14],[46,17,46,18],[46,19,46,20],[46,22,46,23],[45,15,45,16],[45,17,45,18],[45,19,45,20],[45,22,45,23],[46,24,46,25],[46,26,46,27],[46,28,46,29],[47,4,47,5],[47,6,47,7],[47,8,47,9],[47,10,47,11],[47,13,47,14],[47,15,47,16],[47,17,47,18],[47,19,47,20],[47,22,47,23],[47,24,47,25],[47,26,47,27],[47,28,47,29],[46,15,46,16],[48,4,48,5],[48,6,48,7],[48,8,48,9],[48,10,48,11],[48,13,48,14],[48,28,48,29],[50,16,50,17],[48,15,48,16],[48,17,48,18],[48,19,48,20],[48,22,48,23],[48,24,48,25],[48,26,48,27]]}
[]
[null,null,"MSP CALCULATOR"]
[null,null,"Levels",":",{"$f":"IF(Vacancy!E6=\"\",\"\",Vacancy!E6)","v":""},null,null,null,null,null,null,"Name",":",null,null,null,null,null,null,null,null,null,null,null,null,null,"Employment Category:",null,null,null,null,null,{"$f":"SUM(F13,Y11,Y13,Y15,E25,Z25,J40,Q51,K67,K77,D81)","v":0}]
[null,null,null,null,null,null,null,null,null,null,null,null,null,null,null,null,null,null,null,null,null,null,null,null,null,null,null,null,null,null,null,null,"TOTAL MATRIX POINTS"]
[null,null,{"$f":"IF(E3=\"First Level\",\"A. Performance Rating (20 pts)\",IF(E3=\"Second Level\",\"A. Performance Rating (15 pts)\",\"A. Performance Rating (35 pts)\"))","v":"A. Performance Rating (35 pts)"},null,null,null,null,null,null,null,null,{"$f":"IF(E3=\"First Level\",\"B. Education (15 pts.)\",IF(E3=\"Second Level\",\"B. Education (10 pts.)\",\"B. Education (5 pts.)\"))","v":"B. Education (5 pts.)"}]
[null,null,"New Graduates (No previous work experience)",null,null,null,null,null,null,null,null,"Required:"]
[false,null,null,null,null,null,null,{"$f":"IF(F9>=2.75,1,IF(F9>=2.5,3,IF(F9>=2.25,5,IF(F9>=2,7,IF(F9>=1.75,9,IF(F9>=1.5,11,IF(F9>=1.25,13,IF(F9>=1,15))))))))","v":false},null,null,null,{"$f":"IF(Vacancy!E10=\"\",\"\",Vacancy!E10)","v":""}]
[]
[null,null,"GWA",null,null,null,{"$f":"IF(F9>=2.75,2,IF(F9>=2.5,5,IF(F9>=2.25,8,IF(F9>=2,11,IF(F9>=1.75,14,IF(F9>=1.5,16,IF(F9>=1.25,18,IF(F9>=1,20))))))))","v":false},{"$f":"IF(E3=\"First Level\",(20*F11)/5,IF(E3=\"Second Level\",(15*F11)/5,IF(E3=\"Executive/Managerial\",(35*F11)/5,\"\")))","v":""},null,null,null,"Highest Educational Attainment:",null,null,null,null,null,null,null,null,null,null,null,null,"Total Score:"]
[]
[null,null,"Last Rating Period",null,null,null,null,{"$f":"IFERROR(IF(AND(A7=TRUE,E3=\"First Level\"),G9,IF(AND(A7=TRUE,E3=\"Second Level\"),H7,H9)),\"\")","v":""},null,null,null,"First Level:",null,null,null,null,null,null,null,null,null,null,null,{"$f":"VLOOKUP(P11,Educ_2!$A$11:$B$26,2,FALSE)","v":{"$error":"#N/A"}},{"$f":"IFERROR(VLOOKUP($L$7,Educ_2!$A$1:$Q$8,X11+1,FALSE),\"\")","v":""}]
[]
[false,null,"Total Score",null,":",{"$f":"IF(H11=FALSE,0,H11)","v":""},"pts.",null,null,null,null,"Second Level:",null,null,null,null,null,null,null,null,null,null,null,{"$f":"VLOOKUP(P13,Educ_2!$A$11:$B$26,2,FALSE)","v":{"$error":"#N/A"}},{"$f":"IFERROR(VLOOKUP($L$7,Educ_2!$A$1:$Q$8,X13+1,FALSE),\"\")","v":""}]
[]
[null,null,null,null,null,null,null,null,null,null,null,"Executive/Managerial:",null,null,null,null,null,null,null,null,null,null,null,{"$f":"VLOOKUP(P15,Educ_2!$A$11:$B$26,2,FALSE)","v":{"$error":"#N/A"}},{"$f":"IFERROR(VLOOKUP($L$7,Educ_2!$A$1:$Q$8,X15+1,FALSE),\"\")","v":""}]
[]
[null,null,null,null,null,null,null,null,null,null,null,null,null,null,null,null,null,null,null,null,null,null,null,null,{"$f":"SUM(Y11,Y13,Y15)","v":0}]
[]
[null,null,"C. Training (10 pts.)",null,null,null,null,null,null,null,null,null,null,null,null,null,null,null,null,null,null,null,null,null,{"$f":"IF(E3=\"Executive/Managerial\",\"D. Experience (10 pts)\",\"D. Experience (25 pts)\")","v":"D. Experience (25 pts)"}]
[null,null,null,null,null,null,null,null,null,null,null,null,null,null,null,null,null,null,null,"Coversion to YEAR"]
[true,null,null,null,{"$f":"IF(Vacancy!$R$10=\"None required\",0,IF(Vacancy!$R$10=\"\",\"\",Vacancy!$R$10))","v":""},"Required (hrs.)",null,null,null,null,null,null,null,null,null,null,null,null,null,null,"Year",null,{"$f":"T21","v":0},null,null,{"$f":"IF(Vacancy!$AA$10=\"None required\",0,IF(Vacancy!$AA$10=\"\",\"\",Vacancy!$AA$10))","v":""},"Required Exp."]
[]
[null,null,null,{"$f":"E23-E21","v":{"$error":"#VALUE!"}},null,"Relevant training hrs. acquired",null,null,null,null,null,null,null,null,null,null,null,null,null,null,"Month",null,{"$f":"T23/12","v":0},null,{"$f":"Z23-Z21","v":{"$error":"#VALUE!"}},{"$f":"SUM(W21,W23,W25)","v":0},"Relevant years of experience"]
[]
[null,null,null,null,{"$f":"IF(N3=\"\",0,IFERROR(IF(E21=E23,5,IF(E23>=E21,((5*D23)/Trg_Exp!$D$2)+5,0)),0))","v":0},"Total",null,null,null,null,null,null,null,null,null,null,null,null,null,null,"Day",null,{"$f":"T25/365","v":0},null,{"$f":"IFERROR(IF(AND(Z21=Z23),10,IF(Vacancy!E6=\"Executive/Managerial\",((10*Y23)/Trg_Exp!$K$2),IF(Z23>=Z21,((15*Y23)/Trg_Exp!$K$2)+10,0))),0)","v":0},{"$f":"IF(N3=\"\",0,IF(Y25<0,0,Y25))","v":0},"Total Score:"]
[]
[null,null,{"$f":"IF(Vacancy!E6=\"Second Level\",\"E. Accomplishment (15 pts.)\",\"E. Accomplishment (10 pts.)\")","v":"E. Accomplishment (10 pts.)"}]
[]
[null,null,null,null,"E.1  Awards/Citations/Commendations"]
[]
[false,null,null,null,"E.1.1. Unit Level",null,null,null,null,{"$f":"IF(A31=TRUE,1,\"\")","v":""}]
[]
[false,null,null,null,"E.1.2. University Level",null,null,null,null,{"$f":"IF(A33=TRUE,3,\"\")","v":""}]
[]
[false,null,null,null,"E.1.3. National/CSC Level",null,null,null,null,{"$f":"IF(A35=TRUE,5,\"\")","v":""}]
[null,null,null,null,"E.2. Innovations/ Systems Improvement"]
[false,null,null,null,null,null,null,null,null,{"$f":"IF(A37=TRUE,IF(Vacancy!E6=\"Second Level\",4,3),\"\")","v":""}]
[null,null,null,null,null,null,null,null,null,null,{"$f":"IF(E3=\"Second Level\",((SUM(J31,J33,J35)*11)/9),((SUM(J31,J33,J35)*7)/9))","v":0}]
[]
[null,null,null,null,"C.2. Total Score:",null,null,null,null,{"$f":"IF(E3=\"Second Level\",(15*SUM(K38,J37)/15),(10*SUM(K38,J37)/10))","v":0}]
[]
[null,null,{"$f":"IF(E3=\"Executive/Managerial\",\"F. Physical Characteristics and Personality Traits (10 pts.)\",\"F. Physical Characteristics and Personality Traits (5 pts.)\")","v":"F. Physical Characteristics and Personality Traits (5 pts.)"}]
[]
[null,null,null,null,"Supervisor",null,"Co-worker 1",null,"Co-worker 2",null,"Co-worker 3",null,null,"Supervisor",null,"Co-worker 1",null,"Co-worker 2",null,"Co-worker 3",null,null,"Supervisor",null,"Co-worker 1",null,"Co-worker 2",null,"Co-worker 3"]
[null,null,null,null,"ATTITUDE",null,null,null,null,null,null,null,null,"COMMITMENT",null,null,null,null,null,null,null,null,"APPEARANCE"]
[null,null,null,"F.1.1. ",null,null,null,null,null,null,null,null,"F.2.1. ",null,null,null,null,null,null,null,null,"F.3.1. "]
[null,null,null,"F.1.2. ",null,null,null,null,null,null,null,null,"F.2.2. ",null,null,null,null,null,null,null,null,"F.3.2. "]
[null,null,null,"F.1.3. ",null,null,null,null,null,null,null,null,"F.2.3. "]
[null,null,null,null,{"$f":"IF($E$3=\"Executive/Managerial\",(4*(SUM(E46:F48)/12)),(2*(SUM(E46:F48)/12)))","v":0},null,{"$f":"IF($E$3=\"Executive/Managerial\",(4*(SUM(G46:H48)/12)),(2*(SUM(G46:H48)/12)))","v":0},null,{"$f":"IF($E$3=\"Executive/Managerial\",(4*(SUM(I46:J48)/12)),(2*(SUM(I46:J48)/12)))","v":0},null,{"$f":"IF($E$3=\"Executive/Managerial\",(4*(SUM(K46:L48)/12)),(2*(SUM(K46:L48)/12)))","v":0},null,null,{"$f":"IF($E$3=\"Executive/Managerial\",(4*(SUM(N46:O48)/12)),(2*(SUM(N46:O48)/12)))","v":0},null,{"$f":"IF($E$3=\"Executive/Managerial\",(4*(SUM(P46:Q48)/12)),(2*(SUM(P46:Q48)/12)))","v":0},null,{"$f":"IF($E$3=\"Executive/Managerial\",(4*(SUM(R46:S48)/12)),(2*(SUM(R46:S48)/12)))","v":0},null,{"$f":"IF($E$3=\"Executive/Managerial\",(4*(SUM(T46:U48)/12)),(2*(SUM(T46:U48)/12)))","v":0},null,null,{"$f":"IF($E$3=\"Executive/Managerial\",(2*(SUM(W46:X48))/8),(1*(SUM(W46:X48))/8))","v":0},null,{"$f":"IF($E$3=\"Executive/Managerial\",(2*(SUM(Y46:Z48))/8),(1*(SUM(Y46:Z48))/8))","v":0},null,{"$f":"IF($E$3=\"Executive/Managerial\",(2*(SUM(AA46:AB48))/8),(1*(SUM(AA46:AB48))/8))","v":0},null,{"$f":"IF($E$3=\"Executive/Managerial\",(2*(SUM(AC46:AD48))/8),(1*(SUM(AC46:AD48))/8))","v":0}]
[null,null,null,null,null,null,"Supervisor",null,"Co-worker"]
[null,null,null,null,"Attitude",null,{"$f":"E49","v":0},null,{"$f":"SUM(G49:L49)/3","v":0},null,null,null,null,"Total Score PCPT:",null,null,{"$f":"IF(E3=\"Executive/Managerial\",SUM(G54:J54),SUM(G54:J54))","v":0}]
[null,null,null,null,"Commitment",null,{"$f":"N49","v":0},null,{"$f":"SUM(P49:U49)/3","v":0}]
[null,null,null,null,"Appearance",null,{"$f":"W49","v":0},null,{"$f":"SUM(Y49:AD49)/3","v":0}]
[null,null,null,null,null,null,{"$f":"SUM(G51:G53)*0.6","v":0},null,{"$f":"SUM(I51:I53)*0.4","v":0}]
[null,null,{"$f":"IF(E3=\"First Level\",\"G. Potential [Assessment Form No. 2] (3 pts.)\",\"G. Potential [Assessment Form No. 2] (5 pts.)\")","v":"G. Potential [Assessment Form No. 2] (5 pts.)"}]
[]
[null,null,null,"INTERVIEW"]
[]
[null,null,null,null,"G.1.1. Sound judgement",null,null,null,null,null,null,{"$f":"IF($E$3=\"First Level\",\"Not Applicable for First Level position\",\"\")","v":""}]
[null,null,null,null,"G.1.2. Analytical mind",null,null,null,null,null,null,{"$f":"IF($E$3=\"First Level\",\"Not Applicable for First Level position\",\"\")","v":""}]
[null,null,null,null,"G.1.3. The ability to motivate co-workers",null,null,null,null,null,null,{"$f":"IF($E$3=\"First Level\",\"Not Applicable for First Level position\",\"\")","v":""}]
[null,null,null,null,"G.1.4. Unifying Factor",null,null,null,null,null,null,{"$f":"IF($E$3=\"First Level\",\"Not Applicable for First Level position\",\"\")","v":""}]
[null,null,null,null,"G.1.5. Vision/foresight",null,null,null,null,null,null,{"$f":"IF($E$3=\"First Level\",\"Not Applicable for First Level position\",\"\")","v":""}]
[null,null,null,null,"G.2. Resourcefulness"]
[null,null,null,null,"G.3. Creativity/ Ingenuity "]
[]
[null,null,null,"TOTAL POINTS FOR POTENTIAL",null,null,null,null,null,null,{"$f":"IF(E3=\"First Level\",(3*(SUM(K64:K65)/8)),(5*(SUM(K59:K65)/28)))","v":0}]
[]
[null,null,{"$f":"IF(E3=\"First Level\",\"H. Written/ Skills Examination (12 pts.)\",\"H. Written/ Skills Examination (15 pts.)\")","v":"H. Written/ Skills Examination (15 pts.)"}]
[null,null,null,null,null,null,null,null,null,null,{"$f":"IFERROR(SUM(K59:K65)/7,0)","v":0}]
[null,null,null,"WRITTEN/SKILLS EXAMINATION"]
[]
[null,null,null,null,"Perfect/Entire Score",null,null,"="]
[null,null,null,null,"Raw Score",null,null,"="]
[]
[]
[null,null,null,"TOTAL FOR EXAMINATION",null,null,null,null,null,null,{"$f":"IFERROR(IF(E3=\"First Level\",IF(K74>K73,0,(K74*12)/K73),IF(K74>K73,0,(K74*15)/K73)),0)","v":0}]
[]
[null,null,"I. Public Service"]
[]
[null,null,null,null,"Additional Pts. in excess of Total Score"]

{"sheet":"AP19","index":26,"n_rows":81,"n_cols":33,"rows_kept":81,"cut":false,"hidden":false,"merged":[[1,2,1,29],[2,4,2,9],[2,13,2,22],[2,27,2,30],[2,32,2,33],[45,4,45,5],[45,6,45,7],[45,8,45,9],[45,10,45,11],[45,13,45,14],[10,15,10,22],[12,15,12,22],[14,15,14,22],[19,19,19,22],[35,4,37,7],[45,28,45,29],[45,24,45,25],[45,26,45,27],[6,11,6,22],[46,4,46,5],[46,6,46,7],[46,8,46,9],[46,10,46,11],[46,13,46,14],[46,17,46,18],[46,19,46,20],[46,22,46,23],[45,15,45,16],[45,17,45,18],[45,19,45,20],[45,22,45,23],[46,24,46,25],[46,26,46,27],[46,28,46,29],[47,4,47,5],[47,6,47,7],[47,8,47,9],[47,10,47,11],[47,13,47,14],[47,15,47,16],[47,17,47,18],[47,19,47,20],[47,22,47,23],[47,24,47,25],[47,26,47,27],[47,28,47,29],[46,15,46,16],[48,4,48,5],[48,6,48,7],[48,8,48,9],[48,10,48,11],[48,13,48,14],[48,28,48,29],[50,16,50,17],[48,15,48,16],[48,17,48,18],[48,19,48,20],[48,22,48,23],[48,24,48,25],[48,26,48,27]]}
[]
[null,null,"MSP CALCULATOR"]
[null,null,"Levels",":",{"$f":"IF(Vacancy!E6=\"\",\"\",Vacancy!E6)","v":""},null,null,null,null,null,null,"Name",":",null,null,null,null,null,null,null,null,null,null,null,null,null,"Employment Category:",null,null,null,null,null,{"$f":"SUM(F13,Y11,Y13,Y15,E25,Z25,J40,Q51,K67,K77,D81)","v":0}]
[null,null,null,null,null,null,null,null,null,null,null,null,null,null,null,null,null,null,null,null,null,null,null,null,null,null,null,null,null,null,null,null,"TOTAL MATRIX POINTS"]
[null,null,{"$f":"IF(E3=\"First Level\",\"A. Performance Rating (20 pts)\",IF(E3=\"Second Level\",\"A. Performance Rating (15 pts)\",\"A. Performance Rating (35 pts)\"))","v":"A. Performance Rating (35 pts)"},null,null,null,null,null,null,null,null,{"$f":"IF(E3=\"First Level\",\"B. Education (15 pts.)\",IF(E3=\"Second Level\",\"B. Education (10 pts.)\",\"B. Education (5 pts.)\"))","v":"B. Education (5 pts.)"}]
[null,null,"New Graduates (No previous work experience)",null,null,null,null,null,null,null,null,"Required:"]
[false,null,null,null,null,null,null,{"$f":"IF(F9>=2.75,1,IF(F9>=2.5,3,IF(F9>=2.25,5,IF(F9>=2,7,IF(F9>=1.75,9,IF(F9>=1.5,11,IF(F9>=1.25,13,IF(F9>=1,15))))))))","v":false},null,null,null,{"$f":"IF(Vacancy!E10=\"\",\"\",Vacancy!E10)","v":""}]
[]
[null,null,"GWA",null,null,null,{"$f":"IF(F9>=2.75,2,IF(F9>=2.5,5,IF(F9>=2.25,8,IF(F9>=2,11,IF(F9>=1.75,14,IF(F9>=1.5,16,IF(F9>=1.25,18,IF(F9>=1,20))))))))","v":false},{"$f":"IF(E3=\"First Level\",(20*F11)/5,IF(E3=\"Second Level\",(15*F11)/5,IF(E3=\"Executive/Managerial\",(35*F11)/5,\"\")))","v":""},null,null,null,"Highest Educational Attainment:",null,null,null,null,null,null,null,null,null,null,null,null,"Total Score:"]
[]
[null,null,"Last Rating Period",null,null,null,null,{"$f":"IFERROR(IF(AND(A7=TRUE,E3=\"First Level\"),G9,IF(AND(A7=TRUE,E3=\"Second Level\"),H7,H9)),\"\")","v":""},null,null,null,"First Level:",null,null,null,null,null,null,null,null,null,null,null,{"$f":"VLOOKUP(P11,Educ_2!$A$11:$B$26,2,FALSE)","v":{"$error":"#N/A"}},{"$f":"IFERROR(VLOOKUP($L$7,Educ_2!$A$1:$Q$8,X11+1,FALSE),\"\")","v":""}]
[]
[false,null,"Total Score",null,":",{"$f":"IF(H11=FALSE,0,H11)","v":""},"pts.",null,null,null,null,"Second Level:",null,null,null,null,null,null,null,null,null,null,null,{"$f":"VLOOKUP(P13,Educ_2!$A$11:$B$26,2,FALSE)","v":{"$error":"#N/A"}},{"$f":"IFERROR(VLOOKUP($L$7,Educ_2!$A$1:$Q$8,X13+1,FALSE),\"\")","v":""}]
[]
[null,null,null,null,null,null,null,null,null,null,null,"Executive/Managerial:",null,null,null,null,null,null,null,null,null,null,null,{"$f":"VLOOKUP(P15,Educ_2!$A$11:$B$26,2,FALSE)","v":{"$error":"#N/A"}},{"$f":"IFERROR(VLOOKUP($L$7,Educ_2!$A$1:$Q$8,X15+1,FALSE),\"\")","v":""}]
[]
[null,null,null,null,null,null,null,null,null,null,null,null,null,null,null,null,null,null,null,null,null,null,null,null,{"$f":"SUM(Y11,Y13,Y15)","v":0}]
[]
[null,null,"C. Training (10 pts.)",null,null,null,null,null,null,null,null,null,null,null,null,null,null,null,null,null,null,null,null,null,{"$f":"IF(E3=\"Executive/Managerial\",\"D. Experience (10 pts)\",\"D. Experience (25 pts)\")","v":"D. Experience (25 pts)"}]
[null,null,null,null,null,null,null,null,null,null,null,null,null,null,null,null,null,null,null,"Coversion to YEAR"]
[true,null,null,null,{"$f":"IF(Vacancy!$R$10=\"None required\",0,IF(Vacancy!$R$10=\"\",\"\",Vacancy!$R$10))","v":""},"Required (hrs.)",null,null,null,null,null,null,null,null,null,null,null,null,null,null,"Year",null,{"$f":"T21","v":0},null,null,{"$f":"IF(Vacancy!$AA$10=\"None required\",0,IF(Vacancy!$AA$10=\"\",\"\",Vacancy!$AA$10))","v":""},"Required Exp."]
[]
[null,null,null,{"$f":"E23-E21","v":{"$error":"#VALUE!"}},null,"Relevant training hrs. acquired",null,null,null,null,null,null,null,null,null,null,null,null,null,null,"Month",null,{"$f":"T23/12","v":0},null,{"$f":"Z23-Z21","v":{"$error":"#VALUE!"}},{"$f":"SUM(W21,W23,W25)","v":0},"Relevant years of experience"]
[]
[null,null,null,null,{"$f":"IF(N3=\"\",0,IFERROR(IF(E21=E23,5,IF(E23>=E21,((5*D23)/Trg_Exp!$D$2)+5,0)),0))","v":0},"Total",null,null,null,null,null,null,null,null,null,null,null,null,null,null,"Day",null,{"$f":"T25/365","v":0},null,{"$f":"IFERROR(IF(AND(Z21=Z23),10,IF(Vacancy!E6=\"Executive/Managerial\",((10*Y23)/Trg_Exp!$K$2),IF(Z23>=Z21,((15*Y23)/Trg_Exp!$K$2)+10,0))),0)","v":0},{"$f":"IF(N3=\"\",0,IF(Y25<0,0,Y25))","v":0},"Total Score:"]
[]
[null,null,{"$f":"IF(Vacancy!E6=\"Second Level\",\"E. Accomplishment (15 pts.)\",\"E. Accomplishment (10 pts.)\")","v":"E. Accomplishment (10 pts.)"}]
[]
[null,null,null,null,"E.1  Awards/Citations/Commendations"]
[]
[false,null,null,null,"E.1.1. Unit Level",null,null,null,null,{"$f":"IF(A31=TRUE,1,\"\")","v":""}]
[]
[false,null,null,null,"E.1.2. University Level",null,null,null,null,{"$f":"IF(A33=TRUE,3,\"\")","v":""}]
[]
[false,null,null,null,"E.1.3. National/CSC Level",null,null,null,null,{"$f":"IF(A35=TRUE,5,\"\")","v":""}]
[null,null,null,null,"E.2. Innovations/ Systems Improvement"]
[false,null,null,null,null,null,null,null,null,{"$f":"IF(A37=TRUE,IF(Vacancy!E6=\"Second Level\",4,3),\"\")","v":""}]
[null,null,null,null,null,null,null,null,null,null,{"$f":"IF(E3=\"Second Level\",((SUM(J31,J33,J35)*11)/9),((SUM(J31,J33,J35)*7)/9))","v":0}]
[]
[null,null,null,null,"C.2. Total Score:",null,null,null,null,{"$f":"IF(E3=\"Second Level\",(15*SUM(K38,J37)/15),(10*SUM(K38,J37)/10))","v":0}]
[]
[null,null,{"$f":"IF(E3=\"Executive/Managerial\",\"F. Physical Characteristics and Personality Traits (10 pts.)\",\"F. Physical Characteristics and Personality Traits (5 pts.)\")","v":"F. Physical Characteristics and Personality Traits (5 pts.)"}]
[]
[null,null,null,null,"Supervisor",null,"Co-worker 1",null,"Co-worker 2",null,"Co-worker 3",null,null,"Supervisor",null,"Co-worker 1",null,"Co-worker 2",null,"Co-worker 3",null,null,"Supervisor",null,"Co-worker 1",null,"Co-worker 2",null,"Co-worker 3"]
[null,null,null,null,"ATTITUDE",null,null,null,null,null,null,null,null,"COMMITMENT",null,null,null,null,null,null,null,null,"APPEARANCE"]
[null,null,null,"F.1.1. ",null,null,null,null,null,null,null,null,"F.2.1. ",null,null,null,null,null,null,null,null,"F.3.1. "]
[null,null,null,"F.1.2. ",null,null,null,null,null,null,null,null,"F.2.2. ",null,null,null,null,null,null,null,null,"F.3.2. "]
[null,null,null,"F.1.3. ",null,null,null,null,null,null,null,null,"F.2.3. "]
[null,null,null,null,{"$f":"IF($E$3=\"Executive/Managerial\",(4*(SUM(E46:F48)/12)),(2*(SUM(E46:F48)/12)))","v":0},null,{"$f":"IF($E$3=\"Executive/Managerial\",(4*(SUM(G46:H48)/12)),(2*(SUM(G46:H48)/12)))","v":0},null,{"$f":"IF($E$3=\"Executive/Managerial\",(4*(SUM(I46:J48)/12)),(2*(SUM(I46:J48)/12)))","v":0},null,{"$f":"IF($E$3=\"Executive/Managerial\",(4*(SUM(K46:L48)/12)),(2*(SUM(K46:L48)/12)))","v":0},null,null,{"$f":"IF($E$3=\"Executive/Managerial\",(4*(SUM(N46:O48)/12)),(2*(SUM(N46:O48)/12)))","v":0},null,{"$f":"IF($E$3=\"Executive/Managerial\",(4*(SUM(P46:Q48)/12)),(2*(SUM(P46:Q48)/12)))","v":0},null,{"$f":"IF($E$3=\"Executive/Managerial\",(4*(SUM(R46:S48)/12)),(2*(SUM(R46:S48)/12)))","v":0},null,{"$f":"IF($E$3=\"Executive/Managerial\",(4*(SUM(T46:U48)/12)),(2*(SUM(T46:U48)/12)))","v":0},null,null,{"$f":"IF($E$3=\"Executive/Managerial\",(2*(SUM(W46:X48))/8),(1*(SUM(W46:X48))/8))","v":0},null,{"$f":"IF($E$3=\"Executive/Managerial\",(2*(SUM(Y46:Z48))/8),(1*(SUM(Y46:Z48))/8))","v":0},null,{"$f":"IF($E$3=\"Executive/Managerial\",(2*(SUM(AA46:AB48))/8),(1*(SUM(AA46:AB48))/8))","v":0},null,{"$f":"IF($E$3=\"Executive/Managerial\",(2*(SUM(AC46:AD48))/8),(1*(SUM(AC46:AD48))/8))","v":0}]
[null,null,null,null,null,null,"Supervisor",null,"Co-worker"]
[null,null,null,null,"Attitude",null,{"$f":"E49","v":0},null,{"$f":"SUM(G49:L49)/3","v":0},null,null,null,null,"Total Score PCPT:",null,null,{"$f":"IF(E3=\"Executive/Managerial\",SUM(G54:J54),SUM(G54:J54))","v":0}]
[null,null,null,null,"Commitment",null,{"$f":"N49","v":0},null,{"$f":"SUM(P49:U49)/3","v":0}]
[null,null,null,null,"Appearance",null,{"$f":"W49","v":0},null,{"$f":"SUM(Y49:AD49)/3","v":0}]
[null,null,null,null,null,null,{"$f":"SUM(G51:G53)*0.6","v":0},null,{"$f":"SUM(I51:I53)*0.4","v":0}]
[null,null,{"$f":"IF(E3=\"First Level\",\"G. Potential [Assessment Form No. 2] (3 pts.)\",\"G. Potential [Assessment Form No. 2] (5 pts.)\")","v":"G. Potential [Assessment Form No. 2] (5 pts.)"}]
[]
[null,null,null,"INTERVIEW"]
[]
[null,null,null,null,"G.1.1. Sound judgement",null,null,null,null,null,null,{"$f":"IF($E$3=\"First Level\",\"Not Applicable for First Level position\",\"\")","v":""}]
[null,null,null,null,"G.1.2. Analytical mind",null,null,null,null,null,null,{"$f":"IF($E$3=\"First Level\",\"Not Applicable for First Level position\",\"\")","v":""}]
[null,null,null,null,"G.1.3. The ability to motivate co-workers",null,null,null,null,null,null,{"$f":"IF($E$3=\"First Level\",\"Not Applicable for First Level position\",\"\")","v":""}]
[null,null,null,null,"G.1.4. Unifying Factor",null,null,null,null,null,null,{"$f":"IF($E$3=\"First Level\",\"Not Applicable for First Level position\",\"\")","v":""}]
[null,null,null,null,"G.1.5. Vision/foresight",null,null,null,null,null,null,{"$f":"IF($E$3=\"First Level\",\"Not Applicable for First Level position\",\"\")","v":""}]
[null,null,null,null,"G.2. Resourcefulness"]
[null,null,null,null,"G.3. Creativity/ Ingenuity "]
[]
[null,null,null,"TOTAL POINTS FOR POTENTIAL",null,null,null,null,null,null,{"$f":"IF(E3=\"First Level\",(3*(SUM(K64:K65)/8)),(5*(SUM(K59:K65)/28)))","v":0}]
[]
[null,null,{"$f":"IF(E3=\"First Level\",\"H. Written/ Skills Examination (12 pts.)\",\"H. Written/ Skills Examination (15 pts.)\")","v":"H. Written/ Skills Examination (15 pts.)"}]
[null,null,null,null,null,null,null,null,null,null,{"$f":"IFERROR(SUM(K59:K65)/7,0)","v":0}]
[null,null,null,"WRITTEN/SKILLS EXAMINATION"]
[]
[null,null,null,null,"Perfect/Entire Score",null,null,"="]
[null,null,null,null,"Raw Score",null,null,"="]
[]
[]
[null,null,null,"TOTAL FOR EXAMINATION",null,null,null,null,null,null,{"$f":"IFERROR(IF(E3=\"First Level\",IF(K74>K73,0,(K74*12)/K73),IF(K74>K73,0,(K74*15)/K73)),0)","v":0}]
[]
[null,null,"I. Public Service"]
[]
[null,null,null,null,"Additional Pts. in excess of Total Score"]

{"sheet":"AP20","index":27,"n_rows":81,"n_cols":33,"rows_kept":81,"cut":false,"hidden":false,"merged":[[1,2,1,29],[2,4,2,9],[2,13,2,22],[2,27,2,30],[2,32,2,33],[45,4,45,5],[45,6,45,7],[45,8,45,9],[45,10,45,11],[45,13,45,14],[10,15,10,22],[12,15,12,22],[14,15,14,22],[19,19,19,22],[35,4,37,7],[45,28,45,29],[45,24,45,25],[45,26,45,27],[6,11,6,22],[46,4,46,5],[46,6,46,7],[46,8,46,9],[46,10,46,11],[46,13,46,14],[46,17,46,18],[46,19,46,20],[46,22,46,23],[45,15,45,16],[45,17,45,18],[45,19,45,20],[45,22,45,23],[46,24,46,25],[46,26,46,27],[46,28,46,29],[47,4,47,5],[47,6,47,7],[47,8,47,9],[47,10,47,11],[47,13,47,14],[47,15,47,16],[47,17,47,18],[47,19,47,20],[47,22,47,23],[47,24,47,25],[47,26,47,27],[47,28,47,29],[46,15,46,16],[48,4,48,5],[48,6,48,7],[48,8,48,9],[48,10,48,11],[48,13,48,14],[48,28,48,29],[50,16,50,17],[48,15,48,16],[48,17,48,18],[48,19,48,20],[48,22,48,23],[48,24,48,25],[48,26,48,27]]}
[]
[null,null,"MSP CALCULATOR"]
[null,null,"Levels",":",{"$f":"IF(Vacancy!E6=\"\",\"\",Vacancy!E6)","v":""},null,null,null,null,null,null,"Name",":",null,null,null,null,null,null,null,null,null,null,null,null,null,"Employment Category:",null,null,null,null,null,{"$f":"SUM(F13,Y11,Y13,Y15,E25,Z25,J40,Q51,K67,K77,D81)","v":0}]
[null,null,null,null,null,null,null,null,null,null,null,null,null,null,null,null,null,null,null,null,null,null,null,null,null,null,null,null,null,null,null,null,"TOTAL MATRIX POINTS"]
[null,null,{"$f":"IF(E3=\"First Level\",\"A. Performance Rating (20 pts)\",IF(E3=\"Second Level\",\"A. Performance Rating (15 pts)\",\"A. Performance Rating (35 pts)\"))","v":"A. Performance Rating (35 pts)"},null,null,null,null,null,null,null,null,{"$f":"IF(E3=\"First Level\",\"B. Education (15 pts.)\",IF(E3=\"Second Level\",\"B. Education (10 pts.)\",\"B. Education (5 pts.)\"))","v":"B. Education (5 pts.)"}]
[null,null,"New Graduates (No previous work experience)",null,null,null,null,null,null,null,null,"Required:"]
[false,null,null,null,null,null,null,{"$f":"IF(F9>=2.75,1,IF(F9>=2.5,3,IF(F9>=2.25,5,IF(F9>=2,7,IF(F9>=1.75,9,IF(F9>=1.5,11,IF(F9>=1.25,13,IF(F9>=1,15))))))))","v":false},null,null,null,{"$f":"IF(Vacancy!E10=\"\",\"\",Vacancy!E10)","v":""}]
[]
[null,null,"GWA",null,null,null,{"$f":"IF(F9>=2.75,2,IF(F9>=2.5,5,IF(F9>=2.25,8,IF(F9>=2,11,IF(F9>=1.75,14,IF(F9>=1.5,16,IF(F9>=1.25,18,IF(F9>=1,20))))))))","v":false},{"$f":"IF(E3=\"First Level\",(20*F11)/5,IF(E3=\"Second Level\",(15*F11)/5,IF(E3=\"Executive/Managerial\",(35*F11)/5,\"\")))","v":""},null,null,null,"Highest Educational Attainment:",null,null,null,null,null,null,null,null,null,null,null,null,"Total Score:"]
[]
[null,null,"Last Rating Period",null,null,null,null,{"$f":"IFERROR(IF(AND(A7=TRUE,E3=\"First Level\"),G9,IF(AND(A7=TRUE,E3=\"Second Level\"),H7,H9)),\"\")","v":""},null,null,null,"First Level:",null,null,null,null,null,null,null,null,null,null,null,{"$f":"VLOOKUP(P11,Educ_2!$A$11:$B$26,2,FALSE)","v":{"$error":"#N/A"}},{"$f":"IFERROR(VLOOKUP($L$7,Educ_2!$A$1:$Q$8,X11+1,FALSE),\"\")","v":""}]
[]
[false,null,"Total Score",null,":",{"$f":"IF(H11=FALSE,0,H11)","v":""},"pts.",null,null,null,null,"Second Level:",null,null,null,null,null,null,null,null,null,null,null,{"$f":"VLOOKUP(P13,Educ_2!$A$11:$B$26,2,FALSE)","v":{"$error":"#N/A"}},{"$f":"IFERROR(VLOOKUP($L$7,Educ_2!$A$1:$Q$8,X13+1,FALSE),\"\")","v":""}]
[]
[null,null,null,null,null,null,null,null,null,null,null,"Executive/Managerial:",null,null,null,null,null,null,null,null,null,null,null,{"$f":"VLOOKUP(P15,Educ_2!$A$11:$B$26,2,FALSE)","v":{"$error":"#N/A"}},{"$f":"IFERROR(VLOOKUP($L$7,Educ_2!$A$1:$Q$8,X15+1,FALSE),\"\")","v":""}]
[]
[null,null,null,null,null,null,null,null,null,null,null,null,null,null,null,null,null,null,null,null,null,null,null,null,{"$f":"SUM(Y11,Y13,Y15)","v":0}]
[]
[null,null,"C. Training (10 pts.)",null,null,null,null,null,null,null,null,null,null,null,null,null,null,null,null,null,null,null,null,null,{"$f":"IF(E3=\"Executive/Managerial\",\"D. Experience (10 pts)\",\"D. Experience (25 pts)\")","v":"D. Experience (25 pts)"}]
[null,null,null,null,null,null,null,null,null,null,null,null,null,null,null,null,null,null,null,"Coversion to YEAR"]
[true,null,null,null,{"$f":"IF(Vacancy!$R$10=\"None required\",0,IF(Vacancy!$R$10=\"\",\"\",Vacancy!$R$10))","v":""},"Required (hrs.)",null,null,null,null,null,null,null,null,null,null,null,null,null,null,"Year",null,{"$f":"T21","v":0},null,null,{"$f":"IF(Vacancy!$AA$10=\"None required\",0,IF(Vacancy!$AA$10=\"\",\"\",Vacancy!$AA$10))","v":""},"Required Exp."]
[]
[null,null,null,{"$f":"E23-E21","v":{"$error":"#VALUE!"}},null,"Relevant training hrs. acquired",null,null,null,null,null,null,null,null,null,null,null,null,null,null,"Month",null,{"$f":"T23/12","v":0},null,{"$f":"Z23-Z21","v":{"$error":"#VALUE!"}},{"$f":"SUM(W21,W23,W25)","v":0},"Relevant years of experience"]
[]
[null,null,null,null,{"$f":"IF(N3=\"\",0,IFERROR(IF(E21=E23,5,IF(E23>=E21,((5*D23)/Trg_Exp!$D$2)+5,0)),0))","v":0},"Total",null,null,null,null,null,null,null,null,null,null,null,null,null,null,"Day",null,{"$f":"T25/365","v":0},null,{"$f":"IFERROR(IF(AND(Z21=Z23),10,IF(Vacancy!E6=\"Executive/Managerial\",((10*Y23)/Trg_Exp!$K$2),IF(Z23>=Z21,((15*Y23)/Trg_Exp!$K$2)+10,0))),0)","v":0},{"$f":"IF(N3=\"\",0,IF(Y25<0,0,Y25))","v":0},"Total Score:"]
[]
[null,null,{"$f":"IF(Vacancy!E6=\"Second Level\",\"E. Accomplishment (15 pts.)\",\"E. Accomplishment (10 pts.)\")","v":"E. Accomplishment (10 pts.)"}]
[]
[null,null,null,null,"E.1  Awards/Citations/Commendations"]
[]
[false,null,null,null,"E.1.1. Unit Level",null,null,null,null,{"$f":"IF(A31=TRUE,1,\"\")","v":""}]
[]
[false,null,null,null,"E.1.2. University Level",null,null,null,null,{"$f":"IF(A33=TRUE,3,\"\")","v":""}]
[]
[false,null,null,null,"E.1.3. National/CSC Level",null,null,null,null,{"$f":"IF(A35=TRUE,5,\"\")","v":""}]
[null,null,null,null,"E.2. Innovations/ Systems Improvement"]
[false,null,null,null,null,null,null,null,null,{"$f":"IF(A37=TRUE,IF(Vacancy!E6=\"Second Level\",4,3),\"\")","v":""}]
[null,null,null,null,null,null,null,null,null,null,{"$f":"IF(E3=\"Second Level\",((SUM(J31,J33,J35)*11)/9),((SUM(J31,J33,J35)*7)/9))","v":0}]
[]
[null,null,null,null,"C.2. Total Score:",null,null,null,null,{"$f":"IF(E3=\"Second Level\",(15*SUM(K38,J37)/15),(10*SUM(K38,J37)/10))","v":0}]
[]
[null,null,{"$f":"IF(E3=\"Executive/Managerial\",\"F. Physical Characteristics and Personality Traits (10 pts.)\",\"F. Physical Characteristics and Personality Traits (5 pts.)\")","v":"F. Physical Characteristics and Personality Traits (5 pts.)"}]
[]
[null,null,null,null,"Supervisor",null,"Co-worker 1",null,"Co-worker 2",null,"Co-worker 3",null,null,"Supervisor",null,"Co-worker 1",null,"Co-worker 2",null,"Co-worker 3",null,null,"Supervisor",null,"Co-worker 1",null,"Co-worker 2",null,"Co-worker 3"]
[null,null,null,null,"ATTITUDE",null,null,null,null,null,null,null,null,"COMMITMENT",null,null,null,null,null,null,null,null,"APPEARANCE"]
[null,null,null,"F.1.1. ",null,null,null,null,null,null,null,null,"F.2.1. ",null,null,null,null,null,null,null,null,"F.3.1. "]
[null,null,null,"F.1.2. ",null,null,null,null,null,null,null,null,"F.2.2. ",null,null,null,null,null,null,null,null,"F.3.2. "]
[null,null,null,"F.1.3. ",null,null,null,null,null,null,null,null,"F.2.3. "]
[null,null,null,null,{"$f":"IF($E$3=\"Executive/Managerial\",(4*(SUM(E46:F48)/12)),(2*(SUM(E46:F48)/12)))","v":0},null,{"$f":"IF($E$3=\"Executive/Managerial\",(4*(SUM(G46:H48)/12)),(2*(SUM(G46:H48)/12)))","v":0},null,{"$f":"IF($E$3=\"Executive/Managerial\",(4*(SUM(I46:J48)/12)),(2*(SUM(I46:J48)/12)))","v":0},null,{"$f":"IF($E$3=\"Executive/Managerial\",(4*(SUM(K46:L48)/12)),(2*(SUM(K46:L48)/12)))","v":0},null,null,{"$f":"IF($E$3=\"Executive/Managerial\",(4*(SUM(N46:O48)/12)),(2*(SUM(N46:O48)/12)))","v":0},null,{"$f":"IF($E$3=\"Executive/Managerial\",(4*(SUM(P46:Q48)/12)),(2*(SUM(P46:Q48)/12)))","v":0},null,{"$f":"IF($E$3=\"Executive/Managerial\",(4*(SUM(R46:S48)/12)),(2*(SUM(R46:S48)/12)))","v":0},null,{"$f":"IF($E$3=\"Executive/Managerial\",(4*(SUM(T46:U48)/12)),(2*(SUM(T46:U48)/12)))","v":0},null,null,{"$f":"IF($E$3=\"Executive/Managerial\",(2*(SUM(W46:X48))/8),(1*(SUM(W46:X48))/8))","v":0},null,{"$f":"IF($E$3=\"Executive/Managerial\",(2*(SUM(Y46:Z48))/8),(1*(SUM(Y46:Z48))/8))","v":0},null,{"$f":"IF($E$3=\"Executive/Managerial\",(2*(SUM(AA46:AB48))/8),(1*(SUM(AA46:AB48))/8))","v":0},null,{"$f":"IF($E$3=\"Executive/Managerial\",(2*(SUM(AC46:AD48))/8),(1*(SUM(AC46:AD48))/8))","v":0}]
[null,null,null,null,null,null,"Supervisor",null,"Co-worker"]
[null,null,null,null,"Attitude",null,{"$f":"E49","v":0},null,{"$f":"SUM(G49:L49)/3","v":0},null,null,null,null,"Total Score PCPT:",null,null,{"$f":"IF(E3=\"Executive/Managerial\",SUM(G54:J54),SUM(G54:J54))","v":0}]
[null,null,null,null,"Commitment",null,{"$f":"N49","v":0},null,{"$f":"SUM(P49:U49)/3","v":0}]
[null,null,null,null,"Appearance",null,{"$f":"W49","v":0},null,{"$f":"SUM(Y49:AD49)/3","v":0}]
[null,null,null,null,null,null,{"$f":"SUM(G51:G53)*0.6","v":0},null,{"$f":"SUM(I51:I53)*0.4","v":0}]
[null,null,{"$f":"IF(E3=\"First Level\",\"G. Potential [Assessment Form No. 2] (3 pts.)\",\"G. Potential [Assessment Form No. 2] (5 pts.)\")","v":"G. Potential [Assessment Form No. 2] (5 pts.)"}]
[]
[null,null,null,"INTERVIEW"]
[]
[null,null,null,null,"G.1.1. Sound judgement",null,null,null,null,null,null,{"$f":"IF($E$3=\"First Level\",\"Not Applicable for First Level position\",\"\")","v":""}]
[null,null,null,null,"G.1.2. Analytical mind",null,null,null,null,null,null,{"$f":"IF($E$3=\"First Level\",\"Not Applicable for First Level position\",\"\")","v":""}]
[null,null,null,null,"G.1.3. The ability to motivate co-workers",null,null,null,null,null,null,{"$f":"IF($E$3=\"First Level\",\"Not Applicable for First Level position\",\"\")","v":""}]
[null,null,null,null,"G.1.4. Unifying Factor",null,null,null,null,null,null,{"$f":"IF($E$3=\"First Level\",\"Not Applicable for First Level position\",\"\")","v":""}]
[null,null,null,null,"G.1.5. Vision/foresight",null,null,null,null,null,null,{"$f":"IF($E$3=\"First Level\",\"Not Applicable for First Level position\",\"\")","v":""}]
[null,null,null,null,"G.2. Resourcefulness"]
[null,null,null,null,"G.3. Creativity/ Ingenuity "]
[]
[null,null,null,"TOTAL POINTS FOR POTENTIAL",null,null,null,null,null,null,{"$f":"IF(E3=\"First Level\",(3*(SUM(K64:K65)/8)),(5*(SUM(K59:K65)/28)))","v":0}]
[]
[null,null,{"$f":"IF(E3=\"First Level\",\"H. Written/ Skills Examination (12 pts.)\",\"H. Written/ Skills Examination (15 pts.)\")","v":"H. Written/ Skills Examination (15 pts.)"}]
[null,null,null,null,null,null,null,null,null,null,{"$f":"IFERROR(SUM(K59:K65)/7,0)","v":0}]
[null,null,null,"WRITTEN/SKILLS EXAMINATION"]
[]
[null,null,null,null,"Perfect/Entire Score",null,null,"="]
[null,null,null,null,"Raw Score",null,null,"="]
[]
[]
[null,null,null,"TOTAL FOR EXAMINATION",null,null,null,null,null,null,{"$f":"IFERROR(IF(E3=\"First Level\",IF(K74>K73,0,(K74*12)/K73),IF(K74>K73,0,(K74*15)/K73)),0)","v":0}]
[]
[null,null,"I. Public Service"]
[]
[null,null,null,null,"Additional Pts. in excess of Total Score"]

{"sheet":"AP21","index":28,"n_rows":81,"n_cols":33,"rows_kept":81,"cut":false,"hidden":false,"merged":[[1,2,1,29],[2,4,2,9],[2,13,2,22],[2,27,2,30],[2,32,2,33],[45,4,45,5],[45,6,45,7],[45,8,45,9],[45,10,45,11],[45,13,45,14],[10,15,10,22],[12,15,12,22],[14,15,14,22],[19,19,19,22],[35,4,37,7],[45,28,45,29],[45,24,45,25],[45,26,45,27],[6,11,6,22],[46,4,46,5],[46,6,46,7],[46,8,46,9],[46,10,46,11],[46,13,46,14],[46,17,46,18],[46,19,46,20],[46,22,46,23],[45,15,45,16],[45,17,45,18],[45,19,45,20],[45,22,45,23],[46,24,46,25],[46,26,46,27],[46,28,46,29],[47,4,47,5],[47,6,47,7],[47,8,47,9],[47,10,47,11],[47,13,47,14],[47,15,47,16],[47,17,47,18],[47,19,47,20],[47,22,47,23],[47,24,47,25],[47,26,47,27],[47,28,47,29],[46,15,46,16],[48,4,48,5],[48,6,48,7],[48,8,48,9],[48,10,48,11],[48,13,48,14],[48,28,48,29],[50,16,50,17],[48,15,48,16],[48,17,48,18],[48,19,48,20],[48,22,48,23],[48,24,48,25],[48,26,48,27]]}
[]
[null,null,"MSP CALCULATOR"]
[null,null,"Levels",":",{"$f":"IF(Vacancy!E6=\"\",\"\",Vacancy!E6)","v":""},null,null,null,null,null,null,"Name",":",null,null,null,null,null,null,null,null,null,null,null,null,null,"Employment Category:",null,null,null,null,null,{"$f":"SUM(F13,Y11,Y13,Y15,E25,Z25,J40,Q51,K67,K77,D81)","v":0}]
[null,null,null,null,null,null,null,null,null,null,null,null,null,null,null,null,null,null,null,null,null,null,null,null,null,null,null,null,null,null,null,null,"TOTAL MATRIX POINTS"]
[null,null,{"$f":"IF(E3=\"First Level\",\"A. Performance Rating (20 pts)\",IF(E3=\"Second Level\",\"A. Performance Rating (15 pts)\",\"A. Performance Rating (35 pts)\"))","v":"A. Performance Rating (35 pts)"},null,null,null,null,null,null,null,null,{"$f":"IF(E3=\"First Level\",\"B. Education (15 pts.)\",IF(E3=\"Second Level\",\"B. Education (10 pts.)\",\"B. Education (5 pts.)\"))","v":"B. Education (5 pts.)"}]
[null,null,"New Graduates (No previous work experience)",null,null,null,null,null,null,null,null,"Required:"]
[false,null,null,null,null,null,null,{"$f":"IF(F9>=2.75,1,IF(F9>=2.5,3,IF(F9>=2.25,5,IF(F9>=2,7,IF(F9>=1.75,9,IF(F9>=1.5,11,IF(F9>=1.25,13,IF(F9>=1,15))))))))","v":false},null,null,null,{"$f":"IF(Vacancy!E10=\"\",\"\",Vacancy!E10)","v":""}]
[]
[null,null,"GWA",null,null,null,{"$f":"IF(F9>=2.75,2,IF(F9>=2.5,5,IF(F9>=2.25,8,IF(F9>=2,11,IF(F9>=1.75,14,IF(F9>=1.5,16,IF(F9>=1.25,18,IF(F9>=1,20))))))))","v":false},{"$f":"IF(E3=\"First Level\",(20*F11)/5,IF(E3=\"Second Level\",(15*F11)/5,IF(E3=\"Executive/Managerial\",(35*F11)/5,\"\")))","v":""},null,null,null,"Highest Educational Attainment:",null,null,null,null,null,null,null,null,null,null,null,null,"Total Score:"]
[]
[null,null,"Last Rating Period",null,null,null,null,{"$f":"IFERROR(IF(AND(A7=TRUE,E3=\"First Level\"),G9,IF(AND(A7=TRUE,E3=\"Second Level\"),H7,H9)),\"\")","v":""},null,null,null,"First Level:",null,null,null,null,null,null,null,null,null,null,null,{"$f":"VLOOKUP(P11,Educ_2!$A$11:$B$26,2,FALSE)","v":{"$error":"#N/A"}},{"$f":"IFERROR(VLOOKUP($L$7,Educ_2!$A$1:$Q$8,X11+1,FALSE),\"\")","v":""}]
[]
[false,null,"Total Score",null,":",{"$f":"IF(H11=FALSE,0,H11)","v":""},"pts.",null,null,null,null,"Second Level:",null,null,null,null,null,null,null,null,null,null,null,{"$f":"VLOOKUP(P13,Educ_2!$A$11:$B$26,2,FALSE)","v":{"$error":"#N/A"}},{"$f":"IFERROR(VLOOKUP($L$7,Educ_2!$A$1:$Q$8,X13+1,FALSE),\"\")","v":""}]
[]
[null,null,null,null,null,null,null,null,null,null,null,"Executive/Managerial:",null,null,null,null,null,null,null,null,null,null,null,{"$f":"VLOOKUP(P15,Educ_2!$A$11:$B$26,2,FALSE)","v":{"$error":"#N/A"}},{"$f":"IFERROR(VLOOKUP($L$7,Educ_2!$A$1:$Q$8,X15+1,FALSE),\"\")","v":""}]
[]
[null,null,null,null,null,null,null,null,null,null,null,null,null,null,null,null,null,null,null,null,null,null,null,null,{"$f":"SUM(Y11,Y13,Y15)","v":0}]
[]
[null,null,"C. Training (10 pts.)",null,null,null,null,null,null,null,null,null,null,null,null,null,null,null,null,null,null,null,null,null,{"$f":"IF(E3=\"Executive/Managerial\",\"D. Experience (10 pts)\",\"D. Experience (25 pts)\")","v":"D. Experience (25 pts)"}]
[null,null,null,null,null,null,null,null,null,null,null,null,null,null,null,null,null,null,null,"Coversion to YEAR"]
[true,null,null,null,{"$f":"IF(Vacancy!$R$10=\"None required\",0,IF(Vacancy!$R$10=\"\",\"\",Vacancy!$R$10))","v":""},"Required (hrs.)",null,null,null,null,null,null,null,null,null,null,null,null,null,null,"Year",null,{"$f":"T21","v":0},null,null,{"$f":"IF(Vacancy!$AA$10=\"None required\",0,IF(Vacancy!$AA$10=\"\",\"\",Vacancy!$AA$10))","v":""},"Required Exp."]
[]
[null,null,null,{"$f":"E23-E21","v":{"$error":"#VALUE!"}},null,"Relevant training hrs. acquired",null,null,null,null,null,null,null,null,null,null,null,null,null,null,"Month",null,{"$f":"T23/12","v":0},null,{"$f":"Z23-Z21","v":{"$error":"#VALUE!"}},{"$f":"SUM(W21,W23,W25)","v":0},"Relevant years of experience"]
[]
[null,null,null,null,{"$f":"IF(N3=\"\",0,IFERROR(IF(E21=E23,5,IF(E23>=E21,((5*D23)/Trg_Exp!$D$2)+5,0)),0))","v":0},"Total",null,null,null,null,null,null,null,null,null,null,null,null,null,null,"Day",null,{"$f":"T25/365","v":0},null,{"$f":"IFERROR(IF(AND(Z21=Z23),10,IF(Vacancy!E6=\"Executive/Managerial\",((10*Y23)/Trg_Exp!$K$2),IF(Z23>=Z21,((15*Y23)/Trg_Exp!$K$2)+10,0))),0)","v":0},{"$f":"IF(N3=\"\",0,IF(Y25<0,0,Y25))","v":0},"Total Score:"]
[]
[null,null,{"$f":"IF(Vacancy!E6=\"Second Level\",\"E. Accomplishment (15 pts.)\",\"E. Accomplishment (10 pts.)\")","v":"E. Accomplishment (10 pts.)"}]
[]
[null,null,null,null,"E.1  Awards/Citations/Commendations"]
[]
[false,null,null,null,"E.1.1. Unit Level",null,null,null,null,{"$f":"IF(A31=TRUE,1,\"\")","v":""}]
[]
[false,null,null,null,"E.1.2. University Level",null,null,null,null,{"$f":"IF(A33=TRUE,3,\"\")","v":""}]
[]
[false,null,null,null,"E.1.3. National/CSC Level",null,null,null,null,{"$f":"IF(A35=TRUE,5,\"\")","v":""}]
[null,null,null,null,"E.2. Innovations/ Systems Improvement"]
[false,null,null,null,null,null,null,null,null,{"$f":"IF(A37=TRUE,IF(Vacancy!E6=\"Second Level\",4,3),\"\")","v":""}]
[null,null,null,null,null,null,null,null,null,null,{"$f":"IF(E3=\"Second Level\",((SUM(J31,J33,J35)*11)/9),((SUM(J31,J33,J35)*7)/9))","v":0}]
[]
[null,null,null,null,"C.2. Total Score:",null,null,null,null,{"$f":"IF(E3=\"Second Level\",(15*SUM(K38,J37)/15),(10*SUM(K38,J37)/10))","v":0}]
[]
[null,null,{"$f":"IF(E3=\"Executive/Managerial\",\"F. Physical Characteristics and Personality Traits (10 pts.)\",\"F. Physical Characteristics and Personality Traits (5 pts.)\")","v":"F. Physical Characteristics and Personality Traits (5 pts.)"}]
[]
[null,null,null,null,"Supervisor",null,"Co-worker 1",null,"Co-worker 2",null,"Co-worker 3",null,null,"Supervisor",null,"Co-worker 1",null,"Co-worker 2",null,"Co-worker 3",null,null,"Supervisor",null,"Co-worker 1",null,"Co-worker 2",null,"Co-worker 3"]
[null,null,null,null,"ATTITUDE",null,null,null,null,null,null,null,null,"COMMITMENT",null,null,null,null,null,null,null,null,"APPEARANCE"]
[null,null,null,"F.1.1. ",null,null,null,null,null,null,null,null,"F.2.1. ",null,null,null,null,null,null,null,null,"F.3.1. "]
[null,null,null,"F.1.2. ",null,null,null,null,null,null,null,null,"F.2.2. ",null,null,null,null,null,null,null,null,"F.3.2. "]
[null,null,null,"F.1.3. ",null,null,null,null,null,null,null,null,"F.2.3. "]
[null,null,null,null,{"$f":"IF($E$3=\"Executive/Managerial\",(4*(SUM(E46:F48)/12)),(2*(SUM(E46:F48)/12)))","v":0},null,{"$f":"IF($E$3=\"Executive/Managerial\",(4*(SUM(G46:H48)/12)),(2*(SUM(G46:H48)/12)))","v":0},null,{"$f":"IF($E$3=\"Executive/Managerial\",(4*(SUM(I46:J48)/12)),(2*(SUM(I46:J48)/12)))","v":0},null,{"$f":"IF($E$3=\"Executive/Managerial\",(4*(SUM(K46:L48)/12)),(2*(SUM(K46:L48)/12)))","v":0},null,null,{"$f":"IF($E$3=\"Executive/Managerial\",(4*(SUM(N46:O48)/12)),(2*(SUM(N46:O48)/12)))","v":0},null,{"$f":"IF($E$3=\"Executive/Managerial\",(4*(SUM(P46:Q48)/12)),(2*(SUM(P46:Q48)/12)))","v":0},null,{"$f":"IF($E$3=\"Executive/Managerial\",(4*(SUM(R46:S48)/12)),(2*(SUM(R46:S48)/12)))","v":0},null,{"$f":"IF($E$3=\"Executive/Managerial\",(4*(SUM(T46:U48)/12)),(2*(SUM(T46:U48)/12)))","v":0},null,null,{"$f":"IF($E$3=\"Executive/Managerial\",(2*(SUM(W46:X48))/8),(1*(SUM(W46:X48))/8))","v":0},null,{"$f":"IF($E$3=\"Executive/Managerial\",(2*(SUM(Y46:Z48))/8),(1*(SUM(Y46:Z48))/8))","v":0},null,{"$f":"IF($E$3=\"Executive/Managerial\",(2*(SUM(AA46:AB48))/8),(1*(SUM(AA46:AB48))/8))","v":0},null,{"$f":"IF($E$3=\"Executive/Managerial\",(2*(SUM(AC46:AD48))/8),(1*(SUM(AC46:AD48))/8))","v":0}]
[null,null,null,null,null,null,"Supervisor",null,"Co-worker"]
[null,null,null,null,"Attitude",null,{"$f":"E49","v":0},null,{"$f":"SUM(G49:L49)/3","v":0},null,null,null,null,"Total Score PCPT:",null,null,{"$f":"IF(E3=\"Executive/Managerial\",SUM(G54:J54),SUM(G54:J54))","v":0}]
[null,null,null,null,"Commitment",null,{"$f":"N49","v":0},null,{"$f":"SUM(P49:U49)/3","v":0}]
[null,null,null,null,"Appearance",null,{"$f":"W49","v":0},null,{"$f":"SUM(Y49:AD49)/3","v":0}]
[null,null,null,null,null,null,{"$f":"SUM(G51:G53)*0.6","v":0},null,{"$f":"SUM(I51:I53)*0.4","v":0}]
[null,null,{"$f":"IF(E3=\"First Level\",\"G. Potential [Assessment Form No. 2] (3 pts.)\",\"G. Potential [Assessment Form No. 2] (5 pts.)\")","v":"G. Potential [Assessment Form No. 2] (5 pts.)"}]
[]
[null,null,null,"INTERVIEW"]
[]
[null,null,null,null,"G.1.1. Sound judgement",null,null,null,null,null,null,{"$f":"IF($E$3=\"First Level\",\"Not Applicable for First Level position\",\"\")","v":""}]
[null,null,null,null,"G.1.2. Analytical mind",null,null,null,null,null,null,{"$f":"IF($E$3=\"First Level\",\"Not Applicable for First Level position\",\"\")","v":""}]
[null,null,null,null,"G.1.3. The ability to motivate co-workers",null,null,null,null,null,null,{"$f":"IF($E$3=\"First Level\",\"Not Applicable for First Level position\",\"\")","v":""}]
[null,null,null,null,"G.1.4. Unifying Factor",null,null,null,null,null,null,{"$f":"IF($E$3=\"First Level\",\"Not Applicable for First Level position\",\"\")","v":""}]
[null,null,null,null,"G.1.5. Vision/foresight",null,null,null,null,null,null,{"$f":"IF($E$3=\"First Level\",\"Not Applicable for First Level position\",\"\")","v":""}]
[null,null,null,null,"G.2. Resourcefulness"]
[null,null,null,null,"G.3. Creativity/ Ingenuity "]
[]
[null,null,null,"TOTAL POINTS FOR POTENTIAL",null,null,null,null,null,null,{"$f":"IF(E3=\"First Level\",(3*(SUM(K64:K65)/8)),(5*(SUM(K59:K65)/28)))","v":0}]
[]
[null,null,{"$f":"IF(E3=\"First Level\",\"H. Written/ Skills Examination (12 pts.)\",\"H. Written/ Skills Examination (15 pts.)\")","v":"H. Written/ Skills Examination (15 pts.)"}]
[null,null,null,null,null,null,null,null,null,null,{"$f":"IFERROR(SUM(K59:K65)/7,0)","v":0}]
[null,null,null,"WRITTEN/SKILLS EXAMINATION"]
[]
[null,null,null,null,"Perfect/Entire Score",null,null,"="]
[null,null,null,null,"Raw Score",null,null,"="]
[]
[]
[null,null,null,"TOTAL FOR EXAMINATION",null,null,null,null,null,null,{"$f":"IFERROR(IF(E3=\"First Level\",IF(K74>K73,0,(K74*12)/K73),IF(K74>K73,0,(K74*15)/K73)),0)","v":0}]
[]
[null,null,"I. Public Service"]
[]
[null,null,null,null,"Additional Pts. in excess of Total Score"]

{"sheet":"AP22","index":29,"n_rows":81,"n_cols":33,"rows_kept":81,"cut":false,"hidden":false,"merged":[[1,2,1,29],[2,4,2,9],[2,13,2,22],[2,27,2,30],[2,32,2,33],[45,4,45,5],[45,6,45,7],[45,8,45,9],[45,10,45,11],[45,13,45,14],[10,15,10,22],[12,15,12,22],[14,15,14,22],[19,19,19,22],[35,4,37,7],[45,28,45,29],[45,24,45,25],[45,26,45,27],[6,11,6,22],[46,4,46,5],[46,6,46,7],[46,8,46,9],[46,10,46,11],[46,13,46,14],[46,17,46,18],[46,19,46,20],[46,22,46,23],[45,15,45,16],[45,17,45,18],[45,19,45,20],[45,22,45,23],[46,24,46,25],[46,26,46,27],[46,28,46,29],[47,4,47,5],[47,6,47,7],[47,8,47,9],[47,10,47,11],[47,13,47,14],[47,15,47,16],[47,17,47,18],[47,19,47,20],[47,22,47,23],[47,24,47,25],[47,26,47,27],[47,28,47,29],[46,15,46,16],[48,4,48,5],[48,6,48,7],[48,8,48,9],[48,10,48,11],[48,13,48,14],[48,28,48,29],[50,16,50,17],[48,15,48,16],[48,17,48,18],[48,19,48,20],[48,22,48,23],[48,24,48,25],[48,26,48,27]]}
[]
[null,null,"MSP CALCULATOR"]
[null,null,"Levels",":",{"$f":"IF(Vacancy!E6=\"\",\"\",Vacancy!E6)","v":""},null,null,null,null,null,null,"Name",":",null,null,null,null,null,null,null,null,null,null,null,null,null,"Employment Category:",null,null,null,null,null,{"$f":"SUM(F13,Y11,Y13,Y15,E25,Z25,J40,Q51,K67,K77,D81)","v":0}]
[null,null,null,null,null,null,null,null,null,null,null,null,null,null,null,null,null,null,null,null,null,null,null,null,null,null,null,null,null,null,null,null,"TOTAL MATRIX POINTS"]
[null,null,{"$f":"IF(E3=\"First Level\",\"A. Performance Rating (20 pts)\",IF(E3=\"Second Level\",\"A. Performance Rating (15 pts)\",\"A. Performance Rating (35 pts)\"))","v":"A. Performance Rating (35 pts)"},null,null,null,null,null,null,null,null,{"$f":"IF(E3=\"First Level\",\"B. Education (15 pts.)\",IF(E3=\"Second Level\",\"B. Education (10 pts.)\",\"B. Education (5 pts.)\"))","v":"B. Education (5 pts.)"}]
[null,null,"New Graduates (No previous work experience)",null,null,null,null,null,null,null,null,"Required:"]
[false,null,null,null,null,null,null,{"$f":"IF(F9>=2.75,1,IF(F9>=2.5,3,IF(F9>=2.25,5,IF(F9>=2,7,IF(F9>=1.75,9,IF(F9>=1.5,11,IF(F9>=1.25,13,IF(F9>=1,15))))))))","v":false},null,null,null,{"$f":"IF(Vacancy!E10=\"\",\"\",Vacancy!E10)","v":""}]
[]
[null,null,"GWA",null,null,null,{"$f":"IF(F9>=2.75,2,IF(F9>=2.5,5,IF(F9>=2.25,8,IF(F9>=2,11,IF(F9>=1.75,14,IF(F9>=1.5,16,IF(F9>=1.25,18,IF(F9>=1,20))))))))","v":false},{"$f":"IF(E3=\"First Level\",(20*F11)/5,IF(E3=\"Second Level\",(15*F11)/5,IF(E3=\"Executive/Managerial\",(35*F11)/5,\"\")))","v":""},null,null,null,"Highest Educational Attainment:",null,null,null,null,null,null,null,null,null,null,null,null,"Total Score:"]
[]
[null,null,"Last Rating Period",null,null,null,null,{"$f":"IFERROR(IF(AND(A7=TRUE,E3=\"First Level\"),G9,IF(AND(A7=TRUE,E3=\"Second Level\"),H7,H9)),\"\")","v":""},null,null,null,"First Level:",null,null,null,null,null,null,null,null,null,null,null,{"$f":"VLOOKUP(P11,Educ_2!$A$11:$B$26,2,FALSE)","v":{"$error":"#N/A"}},{"$f":"IFERROR(VLOOKUP($L$7,Educ_2!$A$1:$Q$8,X11+1,FALSE),\"\")","v":""}]
[]
[false,null,"Total Score",null,":",{"$f":"IF(H11=FALSE,0,H11)","v":""},"pts.",null,null,null,null,"Second Level:",null,null,null,null,null,null,null,null,null,null,null,{"$f":"VLOOKUP(P13,Educ_2!$A$11:$B$26,2,FALSE)","v":{"$error":"#N/A"}},{"$f":"IFERROR(VLOOKUP($L$7,Educ_2!$A$1:$Q$8,X13+1,FALSE),\"\")","v":""}]
[]
[null,null,null,null,null,null,null,null,null,null,null,"Executive/Managerial:",null,null,null,null,null,null,null,null,null,null,null,{"$f":"VLOOKUP(P15,Educ_2!$A$11:$B$26,2,FALSE)","v":{"$error":"#N/A"}},{"$f":"IFERROR(VLOOKUP($L$7,Educ_2!$A$1:$Q$8,X15+1,FALSE),\"\")","v":""}]
[]
[null,null,null,null,null,null,null,null,null,null,null,null,null,null,null,null,null,null,null,null,null,null,null,null,{"$f":"SUM(Y11,Y13,Y15)","v":0}]
[]
[null,null,"C. Training (10 pts.)",null,null,null,null,null,null,null,null,null,null,null,null,null,null,null,null,null,null,null,null,null,{"$f":"IF(E3=\"Executive/Managerial\",\"D. Experience (10 pts)\",\"D. Experience (25 pts)\")","v":"D. Experience (25 pts)"}]
[null,null,null,null,null,null,null,null,null,null,null,null,null,null,null,null,null,null,null,"Coversion to YEAR"]
[true,null,null,null,{"$f":"IF(Vacancy!$R$10=\"None required\",0,IF(Vacancy!$R$10=\"\",\"\",Vacancy!$R$10))","v":""},"Required (hrs.)",null,null,null,null,null,null,null,null,null,null,null,null,null,null,"Year",null,{"$f":"T21","v":0},null,null,{"$f":"IF(Vacancy!$AA$10=\"None required\",0,IF(Vacancy!$AA$10=\"\",\"\",Vacancy!$AA$10))","v":""},"Required Exp."]
[]
[null,null,null,{"$f":"E23-E21","v":{"$error":"#VALUE!"}},null,"Relevant training hrs. acquired",null,null,null,null,null,null,null,null,null,null,null,null,null,null,"Month",null,{"$f":"T23/12","v":0},null,{"$f":"Z23-Z21","v":{"$error":"#VALUE!"}},{"$f":"SUM(W21,W23,W25)","v":0},"Relevant years of experience"]
[]
[null,null,null,null,{"$f":"IF(N3=\"\",0,IFERROR(IF(E21=E23,5,IF(E23>=E21,((5*D23)/Trg_Exp!$D$2)+5,0)),0))","v":0},"Total",null,null,null,null,null,null,null,null,null,null,null,null,null,null,"Day",null,{"$f":"T25/365","v":0},null,{"$f":"IFERROR(IF(AND(Z21=Z23),10,IF(Vacancy!E6=\"Executive/Managerial\",((10*Y23)/Trg_Exp!$K$2),IF(Z23>=Z21,((15*Y23)/Trg_Exp!$K$2)+10,0))),0)","v":0},{"$f":"IF(N3=\"\",0,IF(Y25<0,0,Y25))","v":0},"Total Score:"]
[]
[null,null,{"$f":"IF(Vacancy!E6=\"Second Level\",\"E. Accomplishment (15 pts.)\",\"E. Accomplishment (10 pts.)\")","v":"E. Accomplishment (10 pts.)"}]
[]
[null,null,null,null,"E.1  Awards/Citations/Commendations"]
[]
[false,null,null,null,"E.1.1. Unit Level",null,null,null,null,{"$f":"IF(A31=TRUE,1,\"\")","v":""}]
[]
[false,null,null,null,"E.1.2. University Level",null,null,null,null,{"$f":"IF(A33=TRUE,3,\"\")","v":""}]
[]
[false,null,null,null,"E.1.3. National/CSC Level",null,null,null,null,{"$f":"IF(A35=TRUE,5,\"\")","v":""}]
[null,null,null,null,"E.2. Innovations/ Systems Improvement"]
[false,null,null,null,null,null,null,null,null,{"$f":"IF(A37=TRUE,IF(Vacancy!E6=\"Second Level\",4,3),\"\")","v":""}]
[null,null,null,null,null,null,null,null,null,null,{"$f":"IF(E3=\"Second Level\",((SUM(J31,J33,J35)*11)/9),((SUM(J31,J33,J35)*7)/9))","v":0}]
[]
[null,null,null,null,"C.2. Total Score:",null,null,null,null,{"$f":"IF(E3=\"Second Level\",(15*SUM(K38,J37)/15),(10*SUM(K38,J37)/10))","v":0}]
[]
[null,null,{"$f":"IF(E3=\"Executive/Managerial\",\"F. Physical Characteristics and Personality Traits (10 pts.)\",\"F. Physical Characteristics and Personality Traits (5 pts.)\")","v":"F. Physical Characteristics and Personality Traits (5 pts.)"}]
[]
[null,null,null,null,"Supervisor",null,"Co-worker 1",null,"Co-worker 2",null,"Co-worker 3",null,null,"Supervisor",null,"Co-worker 1",null,"Co-worker 2",null,"Co-worker 3",null,null,"Supervisor",null,"Co-worker 1",null,"Co-worker 2",null,"Co-worker 3"]
[null,null,null,null,"ATTITUDE",null,null,null,null,null,null,null,null,"COMMITMENT",null,null,null,null,null,null,null,null,"APPEARANCE"]
[null,null,null,"F.1.1. ",null,null,null,null,null,null,null,null,"F.2.1. ",null,null,null,null,null,null,null,null,"F.3.1. "]
[null,null,null,"F.1.2. ",null,null,null,null,null,null,null,null,"F.2.2. ",null,null,null,null,null,null,null,null,"F.3.2. "]
[null,null,null,"F.1.3. ",null,null,null,null,null,null,null,null,"F.2.3. "]
[null,null,null,null,{"$f":"IF($E$3=\"Executive/Managerial\",(4*(SUM(E46:F48)/12)),(2*(SUM(E46:F48)/12)))","v":0},null,{"$f":"IF($E$3=\"Executive/Managerial\",(4*(SUM(G46:H48)/12)),(2*(SUM(G46:H48)/12)))","v":0},null,{"$f":"IF($E$3=\"Executive/Managerial\",(4*(SUM(I46:J48)/12)),(2*(SUM(I46:J48)/12)))","v":0},null,{"$f":"IF($E$3=\"Executive/Managerial\",(4*(SUM(K46:L48)/12)),(2*(SUM(K46:L48)/12)))","v":0},null,null,{"$f":"IF($E$3=\"Executive/Managerial\",(4*(SUM(N46:O48)/12)),(2*(SUM(N46:O48)/12)))","v":0},null,{"$f":"IF($E$3=\"Executive/Managerial\",(4*(SUM(P46:Q48)/12)),(2*(SUM(P46:Q48)/12)))","v":0},null,{"$f":"IF($E$3=\"Executive/Managerial\",(4*(SUM(R46:S48)/12)),(2*(SUM(R46:S48)/12)))","v":0},null,{"$f":"IF($E$3=\"Executive/Managerial\",(4*(SUM(T46:U48)/12)),(2*(SUM(T46:U48)/12)))","v":0},null,null,{"$f":"IF($E$3=\"Executive/Managerial\",(2*(SUM(W46:X48))/8),(1*(SUM(W46:X48))/8))","v":0},null,{"$f":"IF($E$3=\"Executive/Managerial\",(2*(SUM(Y46:Z48))/8),(1*(SUM(Y46:Z48))/8))","v":0},null,{"$f":"IF($E$3=\"Executive/Managerial\",(2*(SUM(AA46:AB48))/8),(1*(SUM(AA46:AB48))/8))","v":0},null,{"$f":"IF($E$3=\"Executive/Managerial\",(2*(SUM(AC46:AD48))/8),(1*(SUM(AC46:AD48))/8))","v":0}]
[null,null,null,null,null,null,"Supervisor",null,"Co-worker"]
[null,null,null,null,"Attitude",null,{"$f":"E49","v":0},null,{"$f":"SUM(G49:L49)/3","v":0},null,null,null,null,"Total Score PCPT:",null,null,{"$f":"IF(E3=\"Executive/Managerial\",SUM(G54:J54),SUM(G54:J54))","v":0}]
[null,null,null,null,"Commitment",null,{"$f":"N49","v":0},null,{"$f":"SUM(P49:U49)/3","v":0}]
[null,null,null,null,"Appearance",null,{"$f":"W49","v":0},null,{"$f":"SUM(Y49:AD49)/3","v":0}]
[null,null,null,null,null,null,{"$f":"SUM(G51:G53)*0.6","v":0},null,{"$f":"SUM(I51:I53)*0.4","v":0}]
[null,null,{"$f":"IF(E3=\"First Level\",\"G. Potential [Assessment Form No. 2] (3 pts.)\",\"G. Potential [Assessment Form No. 2] (5 pts.)\")","v":"G. Potential [Assessment Form No. 2] (5 pts.)"}]
[]
[null,null,null,"INTERVIEW"]
[]
[null,null,null,null,"G.1.1. Sound judgement",null,null,null,null,null,null,{"$f":"IF($E$3=\"First Level\",\"Not Applicable for First Level position\",\"\")","v":""}]
[null,null,null,null,"G.1.2. Analytical mind",null,null,null,null,null,null,{"$f":"IF($E$3=\"First Level\",\"Not Applicable for First Level position\",\"\")","v":""}]
[null,null,null,null,"G.1.3. The ability to motivate co-workers",null,null,null,null,null,null,{"$f":"IF($E$3=\"First Level\",\"Not Applicable for First Level position\",\"\")","v":""}]
[null,null,null,null,"G.1.4. Unifying Factor",null,null,null,null,null,null,{"$f":"IF($E$3=\"First Level\",\"Not Applicable for First Level position\",\"\")","v":""}]
[null,null,null,null,"G.1.5. Vision/foresight",null,null,null,null,null,null,{"$f":"IF($E$3=\"First Level\",\"Not Applicable for First Level position\",\"\")","v":""}]
[null,null,null,null,"G.2. Resourcefulness"]
[null,null,null,null,"G.3. Creativity/ Ingenuity "]
[]
[null,null,null,"TOTAL POINTS FOR POTENTIAL",null,null,null,null,null,null,{"$f":"IF(E3=\"First Level\",(3*(SUM(K64:K65)/8)),(5*(SUM(K59:K65)/28)))","v":0}]
[]
[null,null,{"$f":"IF(E3=\"First Level\",\"H. Written/ Skills Examination (12 pts.)\",\"H. Written/ Skills Examination (15 pts.)\")","v":"H. Written/ Skills Examination (15 pts.)"}]
[null,null,null,null,null,null,null,null,null,null,{"$f":"IFERROR(SUM(K59:K65)/7,0)","v":0}]
[null,null,null,"WRITTEN/SKILLS EXAMINATION"]
[]
[null,null,null,null,"Perfect/Entire Score",null,null,"="]
[null,null,null,null,"Raw Score",null,null,"="]
[]
[]
[null,null,null,"TOTAL FOR EXAMINATION",null,null,null,null,null,null,{"$f":"IFERROR(IF(E3=\"First Level\",IF(K74>K73,0,(K74*12)/K73),IF(K74>K73,0,(K74*15)/K73)),0)","v":0}]
[]
[null,null,"I. Public Service"]
[]
[null,null,null,null,"Additional Pts. in excess of Total Score"]

{"sheet":"AP23","index":30,"n_rows":81,"n_cols":33,"rows_kept":81,"cut":false,"hidden":false,"merged":[[1,2,1,29],[2,4,2,9],[2,13,2,22],[2,27,2,30],[2,32,2,33],[45,4,45,5],[45,6,45,7],[45,8,45,9],[45,10,45,11],[45,13,45,14],[10,15,10,22],[12,15,12,22],[14,15,14,22],[19,19,19,22],[35,4,37,7],[45,28,45,29],[45,24,45,25],[45,26,45,27],[6,11,6,22],[46,4,46,5],[46,6,46,7],[46,8,46,9],[46,10,46,11],[46,13,46,14],[46,17,46,18],[46,19,46,20],[46,22,46,23],[45,15,45,16],[45,17,45,18],[45,19,45,20],[45,22,45,23],[46,24,46,25],[46,26,46,27],[46,28,46,29],[47,4,47,5],[47,6,47,7],[47,8,47,9],[47,10,47,11],[47,13,47,14],[47,15,47,16],[47,17,47,18],[47,19,47,20],[47,22,47,23],[47,24,47,25],[47,26,47,27],[47,28,47,29],[46,15,46,16],[48,4,48,5],[48,6,48,7],[48,8,48,9],[48,10,48,11],[48,13,48,14],[48,28,48,29],[50,16,50,17],[48,15,48,16],[48,17,48,18],[48,19,48,20],[48,22,48,23],[48,24,48,25],[48,26,48,27]]}
[]
[null,null,"MSP CALCULATOR"]
[null,null,"Levels",":",{"$f":"IF(Vacancy!E6=\"\",\"\",Vacancy!E6)","v":""},null,null,null,null,null,null,"Name",":",null,null,null,null,null,null,null,null,null,null,null,null,null,"Employment Category:",null,null,null,null,null,{"$f":"SUM(F13,Y11,Y13,Y15,E25,Z25,J40,Q51,K67,K77,D81)","v":0}]
[null,null,null,null,null,null,null,null,null,null,null,null,null,null,null,null,null,null,null,null,null,null,null,null,null,null,null,null,null,null,null,null,"TOTAL MATRIX POINTS"]
[null,null,{"$f":"IF(E3=\"First Level\",\"A. Performance Rating (20 pts)\",IF(E3=\"Second Level\",\"A. Performance Rating (15 pts)\",\"A. Performance Rating (35 pts)\"))","v":"A. Performance Rating (35 pts)"},null,null,null,null,null,null,null,null,{"$f":"IF(E3=\"First Level\",\"B. Education (15 pts.)\",IF(E3=\"Second Level\",\"B. Education (10 pts.)\",\"B. Education (5 pts.)\"))","v":"B. Education (5 pts.)"}]
[null,null,"New Graduates (No previous work experience)",null,null,null,null,null,null,null,null,"Required:"]
[false,null,null,null,null,null,null,{"$f":"IF(F9>=2.75,1,IF(F9>=2.5,3,IF(F9>=2.25,5,IF(F9>=2,7,IF(F9>=1.75,9,IF(F9>=1.5,11,IF(F9>=1.25,13,IF(F9>=1,15))))))))","v":false},null,null,null,{"$f":"IF(Vacancy!E10=\"\",\"\",Vacancy!E10)","v":""}]
[]
[null,null,"GWA",null,null,null,{"$f":"IF(F9>=2.75,2,IF(F9>=2.5,5,IF(F9>=2.25,8,IF(F9>=2,11,IF(F9>=1.75,14,IF(F9>=1.5,16,IF(F9>=1.25,18,IF(F9>=1,20))))))))","v":false},{"$f":"IF(E3=\"First Level\",(20*F11)/5,IF(E3=\"Second Level\",(15*F11)/5,IF(E3=\"Executive/Managerial\",(35*F11)/5,\"\")))","v":""},null,null,null,"Highest Educational Attainment:",null,null,null,null,null,null,null,null,null,null,null,null,"Total Score:"]
[]
[null,null,"Last Rating Period",null,null,null,null,{"$f":"IFERROR(IF(AND(A7=TRUE,E3=\"First Level\"),G9,IF(AND(A7=TRUE,E3=\"Second Level\"),H7,H9)),\"\")","v":""},null,null,null,"First Level:",null,null,null,null,null,null,null,null,null,null,null,{"$f":"VLOOKUP(P11,Educ_2!$A$11:$B$26,2,FALSE)","v":{"$error":"#N/A"}},{"$f":"IFERROR(VLOOKUP($L$7,Educ_2!$A$1:$Q$8,X11+1,FALSE),\"\")","v":""}]
[]
[false,null,"Total Score",null,":",{"$f":"IF(H11=FALSE,0,H11)","v":""},"pts.",null,null,null,null,"Second Level:",null,null,null,null,null,null,null,null,null,null,null,{"$f":"VLOOKUP(P13,Educ_2!$A$11:$B$26,2,FALSE)","v":{"$error":"#N/A"}},{"$f":"IFERROR(VLOOKUP($L$7,Educ_2!$A$1:$Q$8,X13+1,FALSE),\"\")","v":""}]
[]
[null,null,null,null,null,null,null,null,null,null,null,"Executive/Managerial:",null,null,null,null,null,null,null,null,null,null,null,{"$f":"VLOOKUP(P15,Educ_2!$A$11:$B$26,2,FALSE)","v":{"$error":"#N/A"}},{"$f":"IFERROR(VLOOKUP($L$7,Educ_2!$A$1:$Q$8,X15+1,FALSE),\"\")","v":""}]
[]
[null,null,null,null,null,null,null,null,null,null,null,null,null,null,null,null,null,null,null,null,null,null,null,null,{"$f":"SUM(Y11,Y13,Y15)","v":0}]
[]
[null,null,"C. Training (10 pts.)",null,null,null,null,null,null,null,null,null,null,null,null,null,null,null,null,null,null,null,null,null,{"$f":"IF(E3=\"Executive/Managerial\",\"D. Experience (10 pts)\",\"D. Experience (25 pts)\")","v":"D. Experience (25 pts)"}]
[null,null,null,null,null,null,null,null,null,null,null,null,null,null,null,null,null,null,null,"Coversion to YEAR"]
[true,null,null,null,{"$f":"IF(Vacancy!$R$10=\"None required\",0,IF(Vacancy!$R$10=\"\",\"\",Vacancy!$R$10))","v":""},"Required (hrs.)",null,null,null,null,null,null,null,null,null,null,null,null,null,null,"Year",null,{"$f":"T21","v":0},null,null,{"$f":"IF(Vacancy!$AA$10=\"None required\",0,IF(Vacancy!$AA$10=\"\",\"\",Vacancy!$AA$10))","v":""},"Required Exp."]
[]
[null,null,null,{"$f":"E23-E21","v":{"$error":"#VALUE!"}},null,"Relevant training hrs. acquired",null,null,null,null,null,null,null,null,null,null,null,null,null,null,"Month",null,{"$f":"T23/12","v":0},null,{"$f":"Z23-Z21","v":{"$error":"#VALUE!"}},{"$f":"SUM(W21,W23,W25)","v":0},"Relevant years of experience"]
[]
[null,null,null,null,{"$f":"IF(N3=\"\",0,IFERROR(IF(E21=E23,5,IF(E23>=E21,((5*D23)/Trg_Exp!$D$2)+5,0)),0))","v":0},"Total",null,null,null,null,null,null,null,null,null,null,null,null,null,null,"Day",null,{"$f":"T25/365","v":0},null,{"$f":"IFERROR(IF(AND(Z21=Z23),10,IF(Vacancy!E6=\"Executive/Managerial\",((10*Y23)/Trg_Exp!$K$2),IF(Z23>=Z21,((15*Y23)/Trg_Exp!$K$2)+10,0))),0)","v":0},{"$f":"IF(N3=\"\",0,IF(Y25<0,0,Y25))","v":0},"Total Score:"]
[]
[null,null,{"$f":"IF(Vacancy!E6=\"Second Level\",\"E. Accomplishment (15 pts.)\",\"E. Accomplishment (10 pts.)\")","v":"E. Accomplishment (10 pts.)"}]
[]
[null,null,null,null,"E.1  Awards/Citations/Commendations"]
[]
[false,null,null,null,"E.1.1. Unit Level",null,null,null,null,{"$f":"IF(A31=TRUE,1,\"\")","v":""}]
[]
[false,null,null,null,"E.1.2. University Level",null,null,null,null,{"$f":"IF(A33=TRUE,3,\"\")","v":""}]
[]
[false,null,null,null,"E.1.3. National/CSC Level",null,null,null,null,{"$f":"IF(A35=TRUE,5,\"\")","v":""}]
[null,null,null,null,"E.2. Innovations/ Systems Improvement"]
[false,null,null,null,null,null,null,null,null,{"$f":"IF(A37=TRUE,IF(Vacancy!E6=\"Second Level\",4,3),\"\")","v":""}]
[null,null,null,null,null,null,null,null,null,null,{"$f":"IF(E3=\"Second Level\",((SUM(J31,J33,J35)*11)/9),((SUM(J31,J33,J35)*7)/9))","v":0}]
[]
[null,null,null,null,"C.2. Total Score:",null,null,null,null,{"$f":"IF(E3=\"Second Level\",(15*SUM(K38,J37)/15),(10*SUM(K38,J37)/10))","v":0}]
[]
[null,null,{"$f":"IF(E3=\"Executive/Managerial\",\"F. Physical Characteristics and Personality Traits (10 pts.)\",\"F. Physical Characteristics and Personality Traits (5 pts.)\")","v":"F. Physical Characteristics and Personality Traits (5 pts.)"}]
[]
[null,null,null,null,"Supervisor",null,"Co-worker 1",null,"Co-worker 2",null,"Co-worker 3",null,null,"Supervisor",null,"Co-worker 1",null,"Co-worker 2",null,"Co-worker 3",null,null,"Supervisor",null,"Co-worker 1",null,"Co-worker 2",null,"Co-worker 3"]
[null,null,null,null,"ATTITUDE",null,null,null,null,null,null,null,null,"COMMITMENT",null,null,null,null,null,null,null,null,"APPEARANCE"]
[null,null,null,"F.1.1. ",null,null,null,null,null,null,null,null,"F.2.1. ",null,null,null,null,null,null,null,null,"F.3.1. "]
[null,null,null,"F.1.2. ",null,null,null,null,null,null,null,null,"F.2.2. ",null,null,null,null,null,null,null,null,"F.3.2. "]
[null,null,null,"F.1.3. ",null,null,null,null,null,null,null,null,"F.2.3. "]
[null,null,null,null,{"$f":"IF($E$3=\"Executive/Managerial\",(4*(SUM(E46:F48)/12)),(2*(SUM(E46:F48)/12)))","v":0},null,{"$f":"IF($E$3=\"Executive/Managerial\",(4*(SUM(G46:H48)/12)),(2*(SUM(G46:H48)/12)))","v":0},null,{"$f":"IF($E$3=\"Executive/Managerial\",(4*(SUM(I46:J48)/12)),(2*(SUM(I46:J48)/12)))","v":0},null,{"$f":"IF($E$3=\"Executive/Managerial\",(4*(SUM(K46:L48)/12)),(2*(SUM(K46:L48)/12)))","v":0},null,null,{"$f":"IF($E$3=\"Executive/Managerial\",(4*(SUM(N46:O48)/12)),(2*(SUM(N46:O48)/12)))","v":0},null,{"$f":"IF($E$3=\"Executive/Managerial\",(4*(SUM(P46:Q48)/12)),(2*(SUM(P46:Q48)/12)))","v":0},null,{"$f":"IF($E$3=\"Executive/Managerial\",(4*(SUM(R46:S48)/12)),(2*(SUM(R46:S48)/12)))","v":0},null,{"$f":"IF($E$3=\"Executive/Managerial\",(4*(SUM(T46:U48)/12)),(2*(SUM(T46:U48)/12)))","v":0},null,null,{"$f":"IF($E$3=\"Executive/Managerial\",(2*(SUM(W46:X48))/8),(1*(SUM(W46:X48))/8))","v":0},null,{"$f":"IF($E$3=\"Executive/Managerial\",(2*(SUM(Y46:Z48))/8),(1*(SUM(Y46:Z48))/8))","v":0},null,{"$f":"IF($E$3=\"Executive/Managerial\",(2*(SUM(AA46:AB48))/8),(1*(SUM(AA46:AB48))/8))","v":0},null,{"$f":"IF($E$3=\"Executive/Managerial\",(2*(SUM(AC46:AD48))/8),(1*(SUM(AC46:AD48))/8))","v":0}]
[null,null,null,null,null,null,"Supervisor",null,"Co-worker"]
[null,null,null,null,"Attitude",null,{"$f":"E49","v":0},null,{"$f":"SUM(G49:L49)/3","v":0},null,null,null,null,"Total Score PCPT:",null,null,{"$f":"IF(E3=\"Executive/Managerial\",SUM(G54:J54),SUM(G54:J54))","v":0}]
[null,null,null,null,"Commitment",null,{"$f":"N49","v":0},null,{"$f":"SUM(P49:U49)/3","v":0}]
[null,null,null,null,"Appearance",null,{"$f":"W49","v":0},null,{"$f":"SUM(Y49:AD49)/3","v":0}]
[null,null,null,null,null,null,{"$f":"SUM(G51:G53)*0.6","v":0},null,{"$f":"SUM(I51:I53)*0.4","v":0}]
[null,null,{"$f":"IF(E3=\"First Level\",\"G. Potential [Assessment Form No. 2] (3 pts.)\",\"G. Potential [Assessment Form No. 2] (5 pts.)\")","v":"G. Potential [Assessment Form No. 2] (5 pts.)"}]
[]
[null,null,null,"INTERVIEW"]
[]
[null,null,null,null,"G.1.1. Sound judgement",null,null,null,null,null,null,{"$f":"IF($E$3=\"First Level\",\"Not Applicable for First Level position\",\"\")","v":""}]
[null,null,null,null,"G.1.2. Analytical mind",null,null,null,null,null,null,{"$f":"IF($E$3=\"First Level\",\"Not Applicable for First Level position\",\"\")","v":""}]
[null,null,null,null,"G.1.3. The ability to motivate co-workers",null,null,null,null,null,null,{"$f":"IF($E$3=\"First Level\",\"Not Applicable for First Level position\",\"\")","v":""}]
[null,null,null,null,"G.1.4. Unifying Factor",null,null,null,null,null,null,{"$f":"IF($E$3=\"First Level\",\"Not Applicable for First Level position\",\"\")","v":""}]
[null,null,null,null,"G.1.5. Vision/foresight",null,null,null,null,null,null,{"$f":"IF($E$3=\"First Level\",\"Not Applicable for First Level position\",\"\")","v":""}]
[null,null,null,null,"G.2. Resourcefulness"]
[null,null,null,null,"G.3. Creativity/ Ingenuity "]
[]
[null,null,null,"TOTAL POINTS FOR POTENTIAL",null,null,null,null,null,null,{"$f":"IF(E3=\"First Level\",(3*(SUM(K64:K65)/8)),(5*(SUM(K59:K65)/28)))","v":0}]
[]
[null,null,{"$f":"IF(E3=\"First Level\",\"H. Written/ Skills Examination (12 pts.)\",\"H. Written/ Skills Examination (15 pts.)\")","v":"H. Written/ Skills Examination (15 pts.)"}]
[null,null,null,null,null,null,null,null,null,null,{"$f":"IFERROR(SUM(K59:K65)/7,0)","v":0}]
[null,null,null,"WRITTEN/SKILLS EXAMINATION"]
[]
[null,null,null,null,"Perfect/Entire Score",null,null,"="]
[null,null,null,null,"Raw Score",null,null,"="]
[]
[]
[null,null,null,"TOTAL FOR EXAMINATION",null,null,null,null,null,null,{"$f":"IFERROR(IF(E3=\"First Level\",IF(K74>K73,0,(K74*12)/K73),IF(K74>K73,0,(K74*15)/K73)),0)","v":0}]
[]
[null,null,"I. Public Service"]
[]
[null,null,null,null,"Additional Pts. in excess of Total Score"]

{"sheet":"AP24","index":31,"n_rows":81,"n_cols":33,"rows_kept":81,"cut":false,"hidden":false,"merged":[[1,2,1,29],[2,4,2,9],[2,13,2,22],[2,27,2,30],[2,32,2,33],[45,4,45,5],[45,6,45,7],[45,8,45,9],[45,10,45,11],[45,13,45,14],[10,15,10,22],[12,15,12,22],[14,15,14,22],[19,19,19,22],[35,4,37,7],[45,28,45,29],[45,24,45,25],[45,26,45,27],[6,11,6,22],[46,4,46,5],[46,6,46,7],[46,8,46,9],[46,10,46,11],[46,13,46,14],[46,17,46,18],[46,19,46,20],[46,22,46,23],[45,15,45,16],[45,17,45,18],[45,19,45,20],[45,22,45,23],[46,24,46,25],[46,26,46,27],[46,28,46,29],[47,4,47,5],[47,6,47,7],[47,8,47,9],[47,10,47,11],[47,13,47,14],[47,15,47,16],[47,17,47,18],[47,19,47,20],[47,22,47,23],[47,24,47,25],[47,26,47,27],[47,28,47,29],[46,15,46,16],[48,4,48,5],[48,6,48,7],[48,8,48,9],[48,10,48,11],[48,13,48,14],[48,28,48,29],[50,16,50,17],[48,15,48,16],[48,17,48,18],[48,19,48,20],[48,22,48,23],[48,24,48,25],[48,26,48,27]]}
[]
[null,null,"MSP CALCULATOR"]
[null,null,"Levels",":",{"$f":"IF(Vacancy!E6=\"\",\"\",Vacancy!E6)","v":""},null,null,null,null,null,null,"Name",":",null,null,null,null,null,null,null,null,null,null,null,null,null,"Employment Category:",null,null,null,null,null,{"$f":"SUM(F13,Y11,Y13,Y15,E25,Z25,J40,Q51,K67,K77,D81)","v":0}]
[null,null,null,null,null,null,null,null,null,null,null,null,null,null,null,null,null,null,null,null,null,null,null,null,null,null,null,null,null,null,null,null,"TOTAL MATRIX POINTS"]
[null,null,{"$f":"IF(E3=\"First Level\",\"A. Performance Rating (20 pts)\",IF(E3=\"Second Level\",\"A. Performance Rating (15 pts)\",\"A. Performance Rating (35 pts)\"))","v":"A. Performance Rating (35 pts)"},null,null,null,null,null,null,null,null,{"$f":"IF(E3=\"First Level\",\"B. Education (15 pts.)\",IF(E3=\"Second Level\",\"B. Education (10 pts.)\",\"B. Education (5 pts.)\"))","v":"B. Education (5 pts.)"}]
[null,null,"New Graduates (No previous work experience)",null,null,null,null,null,null,null,null,"Required:"]
[false,null,null,null,null,null,null,{"$f":"IF(F9>=2.75,1,IF(F9>=2.5,3,IF(F9>=2.25,5,IF(F9>=2,7,IF(F9>=1.75,9,IF(F9>=1.5,11,IF(F9>=1.25,13,IF(F9>=1,15))))))))","v":false},null,null,null,{"$f":"IF(Vacancy!E10=\"\",\"\",Vacancy!E10)","v":""}]
[]
[null,null,"GWA",null,null,null,{"$f":"IF(F9>=2.75,2,IF(F9>=2.5,5,IF(F9>=2.25,8,IF(F9>=2,11,IF(F9>=1.75,14,IF(F9>=1.5,16,IF(F9>=1.25,18,IF(F9>=1,20))))))))","v":false},{"$f":"IF(E3=\"First Level\",(20*F11)/5,IF(E3=\"Second Level\",(15*F11)/5,IF(E3=\"Executive/Managerial\",(35*F11)/5,\"\")))","v":""},null,null,null,"Highest Educational Attainment:",null,null,null,null,null,null,null,null,null,null,null,null,"Total Score:"]
[]
[null,null,"Last Rating Period",null,null,null,null,{"$f":"IFERROR(IF(AND(A7=TRUE,E3=\"First Level\"),G9,IF(AND(A7=TRUE,E3=\"Second Level\"),H7,H9)),\"\")","v":""},null,null,null,"First Level:",null,null,null,null,null,null,null,null,null,null,null,{"$f":"VLOOKUP(P11,Educ_2!$A$11:$B$26,2,FALSE)","v":{"$error":"#N/A"}},{"$f":"IFERROR(VLOOKUP($L$7,Educ_2!$A$1:$Q$8,X11+1,FALSE),\"\")","v":""}]
[]
[false,null,"Total Score",null,":",{"$f":"IF(H11=FALSE,0,H11)","v":""},"pts.",null,null,null,null,"Second Level:",null,null,null,null,null,null,null,null,null,null,null,{"$f":"VLOOKUP(P13,Educ_2!$A$11:$B$26,2,FALSE)","v":{"$error":"#N/A"}},{"$f":"IFERROR(VLOOKUP($L$7,Educ_2!$A$1:$Q$8,X13+1,FALSE),\"\")","v":""}]
[]
[null,null,null,null,null,null,null,null,null,null,null,"Executive/Managerial:",null,null,null,null,null,null,null,null,null,null,null,{"$f":"VLOOKUP(P15,Educ_2!$A$11:$B$26,2,FALSE)","v":{"$error":"#N/A"}},{"$f":"IFERROR(VLOOKUP($L$7,Educ_2!$A$1:$Q$8,X15+1,FALSE),\"\")","v":""}]
[]
[null,null,null,null,null,null,null,null,null,null,null,null,null,null,null,null,null,null,null,null,null,null,null,null,{"$f":"SUM(Y11,Y13,Y15)","v":0}]
[]
[null,null,"C. Training (10 pts.)",null,null,null,null,null,null,null,null,null,null,null,null,null,null,null,null,null,null,null,null,null,{"$f":"IF(E3=\"Executive/Managerial\",\"D. Experience (10 pts)\",\"D. Experience (25 pts)\")","v":"D. Experience (25 pts)"}]
[null,null,null,null,null,null,null,null,null,null,null,null,null,null,null,null,null,null,null,"Coversion to YEAR"]
[true,null,null,null,{"$f":"IF(Vacancy!$R$10=\"None required\",0,IF(Vacancy!$R$10=\"\",\"\",Vacancy!$R$10))","v":""},"Required (hrs.)",null,null,null,null,null,null,null,null,null,null,null,null,null,null,"Year",null,{"$f":"T21","v":0},null,null,{"$f":"IF(Vacancy!$AA$10=\"None required\",0,IF(Vacancy!$AA$10=\"\",\"\",Vacancy!$AA$10))","v":""},"Required Exp."]
[]
[null,null,null,{"$f":"E23-E21","v":{"$error":"#VALUE!"}},null,"Relevant training hrs. acquired",null,null,null,null,null,null,null,null,null,null,null,null,null,null,"Month",null,{"$f":"T23/12","v":0},null,{"$f":"Z23-Z21","v":{"$error":"#VALUE!"}},{"$f":"SUM(W21,W23,W25)","v":0},"Relevant years of experience"]
[]
[null,null,null,null,{"$f":"IF(N3=\"\",0,IFERROR(IF(E21=E23,5,IF(E23>=E21,((5*D23)/Trg_Exp!$D$2)+5,0)),0))","v":0},"Total",null,null,null,null,null,null,null,null,null,null,null,null,null,null,"Day",null,{"$f":"T25/365","v":0},null,{"$f":"IFERROR(IF(AND(Z21=Z23),10,IF(Vacancy!E6=\"Executive/Managerial\",((10*Y23)/Trg_Exp!$K$2),IF(Z23>=Z21,((15*Y23)/Trg_Exp!$K$2)+10,0))),0)","v":0},{"$f":"IF(N3=\"\",0,IF(Y25<0,0,Y25))","v":0},"Total Score:"]
[]
[null,null,{"$f":"IF(Vacancy!E6=\"Second Level\",\"E. Accomplishment (15 pts.)\",\"E. Accomplishment (10 pts.)\")","v":"E. Accomplishment (10 pts.)"}]
[]
[null,null,null,null,"E.1  Awards/Citations/Commendations"]
[]
[false,null,null,null,"E.1.1. Unit Level",null,null,null,null,{"$f":"IF(A31=TRUE,1,\"\")","v":""}]
[]
[false,null,null,null,"E.1.2. University Level",null,null,null,null,{"$f":"IF(A33=TRUE,3,\"\")","v":""}]
[]
[false,null,null,null,"E.1.3. National/CSC Level",null,null,null,null,{"$f":"IF(A35=TRUE,5,\"\")","v":""}]
[null,null,null,null,"E.2. Innovations/ Systems Improvement"]
[false,null,null,null,null,null,null,null,null,{"$f":"IF(A37=TRUE,IF(Vacancy!E6=\"Second Level\",4,3),\"\")","v":""}]
[null,null,null,null,null,null,null,null,null,null,{"$f":"IF(E3=\"Second Level\",((SUM(J31,J33,J35)*11)/9),((SUM(J31,J33,J35)*7)/9))","v":0}]
[]
[null,null,null,null,"C.2. Total Score:",null,null,null,null,{"$f":"IF(E3=\"Second Level\",(15*SUM(K38,J37)/15),(10*SUM(K38,J37)/10))","v":0}]
[]
[null,null,{"$f":"IF(E3=\"Executive/Managerial\",\"F. Physical Characteristics and Personality Traits (10 pts.)\",\"F. Physical Characteristics and Personality Traits (5 pts.)\")","v":"F. Physical Characteristics and Personality Traits (5 pts.)"}]
[]
[null,null,null,null,"Supervisor",null,"Co-worker 1",null,"Co-worker 2",null,"Co-worker 3",null,null,"Supervisor",null,"Co-worker 1",null,"Co-worker 2",null,"Co-worker 3",null,null,"Supervisor",null,"Co-worker 1",null,"Co-worker 2",null,"Co-worker 3"]
[null,null,null,null,"ATTITUDE",null,null,null,null,null,null,null,null,"COMMITMENT",null,null,null,null,null,null,null,null,"APPEARANCE"]
[null,null,null,"F.1.1. ",null,null,null,null,null,null,null,null,"F.2.1. ",null,null,null,null,null,null,null,null,"F.3.1. "]
[null,null,null,"F.1.2. ",null,null,null,null,null,null,null,null,"F.2.2. ",null,null,null,null,null,null,null,null,"F.3.2. "]
[null,null,null,"F.1.3. ",null,null,null,null,null,null,null,null,"F.2.3. "]
[null,null,null,null,{"$f":"IF($E$3=\"Executive/Managerial\",(4*(SUM(E46:F48)/12)),(2*(SUM(E46:F48)/12)))","v":0},null,{"$f":"IF($E$3=\"Executive/Managerial\",(4*(SUM(G46:H48)/12)),(2*(SUM(G46:H48)/12)))","v":0},null,{"$f":"IF($E$3=\"Executive/Managerial\",(4*(SUM(I46:J48)/12)),(2*(SUM(I46:J48)/12)))","v":0},null,{"$f":"IF($E$3=\"Executive/Managerial\",(4*(SUM(K46:L48)/12)),(2*(SUM(K46:L48)/12)))","v":0},null,null,{"$f":"IF($E$3=\"Executive/Managerial\",(4*(SUM(N46:O48)/12)),(2*(SUM(N46:O48)/12)))","v":0},null,{"$f":"IF($E$3=\"Executive/Managerial\",(4*(SUM(P46:Q48)/12)),(2*(SUM(P46:Q48)/12)))","v":0},null,{"$f":"IF($E$3=\"Executive/Managerial\",(4*(SUM(R46:S48)/12)),(2*(SUM(R46:S48)/12)))","v":0},null,{"$f":"IF($E$3=\"Executive/Managerial\",(4*(SUM(T46:U48)/12)),(2*(SUM(T46:U48)/12)))","v":0},null,null,{"$f":"IF($E$3=\"Executive/Managerial\",(2*(SUM(W46:X48))/8),(1*(SUM(W46:X48))/8))","v":0},null,{"$f":"IF($E$3=\"Executive/Managerial\",(2*(SUM(Y46:Z48))/8),(1*(SUM(Y46:Z48))/8))","v":0},null,{"$f":"IF($E$3=\"Executive/Managerial\",(2*(SUM(AA46:AB48))/8),(1*(SUM(AA46:AB48))/8))","v":0},null,{"$f":"IF($E$3=\"Executive/Managerial\",(2*(SUM(AC46:AD48))/8),(1*(SUM(AC46:AD48))/8))","v":0}]
[null,null,null,null,null,null,"Supervisor",null,"Co-worker"]
[null,null,null,null,"Attitude",null,{"$f":"E49","v":0},null,{"$f":"SUM(G49:L49)/3","v":0},null,null,null,null,"Total Score PCPT:",null,null,{"$f":"IF(E3=\"Executive/Managerial\",SUM(G54:J54),SUM(G54:J54))","v":0}]
[null,null,null,null,"Commitment",null,{"$f":"N49","v":0},null,{"$f":"SUM(P49:U49)/3","v":0}]
[null,null,null,null,"Appearance",null,{"$f":"W49","v":0},null,{"$f":"SUM(Y49:AD49)/3","v":0}]
[null,null,null,null,null,null,{"$f":"SUM(G51:G53)*0.6","v":0},null,{"$f":"SUM(I51:I53)*0.4","v":0}]
[null,null,{"$f":"IF(E3=\"First Level\",\"G. Potential [Assessment Form No. 2] (3 pts.)\",\"G. Potential [Assessment Form No. 2] (5 pts.)\")","v":"G. Potential [Assessment Form No. 2] (5 pts.)"}]
[]
[null,null,null,"INTERVIEW"]
[]
[null,null,null,null,"G.1.1. Sound judgement",null,null,null,null,null,null,{"$f":"IF($E$3=\"First Level\",\"Not Applicable for First Level position\",\"\")","v":""}]
[null,null,null,null,"G.1.2. Analytical mind",null,null,null,null,null,null,{"$f":"IF($E$3=\"First Level\",\"Not Applicable for First Level position\",\"\")","v":""}]
[null,null,null,null,"G.1.3. The ability to motivate co-workers",null,null,null,null,null,null,{"$f":"IF($E$3=\"First Level\",\"Not Applicable for First Level position\",\"\")","v":""}]
[null,null,null,null,"G.1.4. Unifying Factor",null,null,null,null,null,null,{"$f":"IF($E$3=\"First Level\",\"Not Applicable for First Level position\",\"\")","v":""}]
[null,null,null,null,"G.1.5. Vision/foresight",null,null,null,null,null,null,{"$f":"IF($E$3=\"First Level\",\"Not Applicable for First Level position\",\"\")","v":""}]
[null,null,null,null,"G.2. Resourcefulness"]
[null,null,null,null,"G.3. Creativity/ Ingenuity "]
[]
[null,null,null,"TOTAL POINTS FOR POTENTIAL",null,null,null,null,null,null,{"$f":"IF(E3=\"First Level\",(3*(SUM(K64:K65)/8)),(5*(SUM(K59:K65)/28)))","v":0}]
[]
[null,null,{"$f":"IF(E3=\"First Level\",\"H. Written/ Skills Examination (12 pts.)\",\"H. Written/ Skills Examination (15 pts.)\")","v":"H. Written/ Skills Examination (15 pts.)"}]
[null,null,null,null,null,null,null,null,null,null,{"$f":"IFERROR(SUM(K59:K65)/7,0)","v":0}]
[null,null,null,"WRITTEN/SKILLS EXAMINATION"]
[]
[null,null,null,null,"Perfect/Entire Score",null,null,"="]
[null,null,null,null,"Raw Score",null,null,"="]
[]
[]
[null,null,null,"TOTAL FOR EXAMINATION",null,null,null,null,null,null,{"$f":"IFERROR(IF(E3=\"First Level\",IF(K74>K73,0,(K74*12)/K73),IF(K74>K73,0,(K74*15)/K73)),0)","v":0}]
[]
[null,null,"I. Public Service"]
[]
[null,null,null,null,"Additional Pts. in excess of Total Score"]

{"sheet":"AP25","index":32,"n_rows":81,"n_cols":33,"rows_kept":81,"cut":false,"hidden":false,"merged":[[1,2,1,29],[2,4,2,9],[2,13,2,22],[2,27,2,30],[2,32,2,33],[45,4,45,5],[45,6,45,7],[45,8,45,9],[45,10,45,11],[45,13,45,14],[10,15,10,22],[12,15,12,22],[14,15,14,22],[19,19,19,22],[35,4,37,7],[45,28,45,29],[45,24,45,25],[45,26,45,27],[6,11,6,22],[46,4,46,5],[46,6,46,7],[46,8,46,9],[46,10,46,11],[46,13,46,14],[46,17,46,18],[46,19,46,20],[46,22,46,23],[45,15,45,16],[45,17,45,18],[45,19,45,20],[45,22,45,23],[46,24,46,25],[46,26,46,27],[46,28,46,29],[47,4,47,5],[47,6,47,7],[47,8,47,9],[47,10,47,11],[47,13,47,14],[47,15,47,16],[47,17,47,18],[47,19,47,20],[47,22,47,23],[47,24,47,25],[47,26,47,27],[47,28,47,29],[46,15,46,16],[48,4,48,5],[48,6,48,7],[48,8,48,9],[48,10,48,11],[48,13,48,14],[48,28,48,29],[50,16,50,17],[48,15,48,16],[48,17,48,18],[48,19,48,20],[48,22,48,23],[48,24,48,25],[48,26,48,27]]}
[]
[null,null,"MSP CALCULATOR"]
[null,null,"Levels",":",{"$f":"IF(Vacancy!E6=\"\",\"\",Vacancy!E6)","v":""},null,null,null,null,null,null,"Name",":",null,null,null,null,null,null,null,null,null,null,null,null,null,"Employment Category:",null,null,null,null,null,{"$f":"SUM(F13,Y11,Y13,Y15,E25,Z25,J40,Q51,K67,K77,D81)","v":0}]
[null,null,null,null,null,null,null,null,null,null,null,null,null,null,null,null,null,null,null,null,null,null,null,null,null,null,null,null,null,null,null,null,"TOTAL MATRIX POINTS"]
[null,null,{"$f":"IF(E3=\"First Level\",\"A. Performance Rating (20 pts)\",IF(E3=\"Second Level\",\"A. Performance Rating (15 pts)\",\"A. Performance Rating (35 pts)\"))","v":"A. Performance Rating (35 pts)"},null,null,null,null,null,null,null,null,{"$f":"IF(E3=\"First Level\",\"B. Education (15 pts.)\",IF(E3=\"Second Level\",\"B. Education (10 pts.)\",\"B. Education (5 pts.)\"))","v":"B. Education (5 pts.)"}]
[null,null,"New Graduates (No previous work experience)",null,null,null,null,null,null,null,null,"Required:"]
[false,null,null,null,null,null,null,{"$f":"IF(F9>=2.75,1,IF(F9>=2.5,3,IF(F9>=2.25,5,IF(F9>=2,7,IF(F9>=1.75,9,IF(F9>=1.5,11,IF(F9>=1.25,13,IF(F9>=1,15))))))))","v":false},null,null,null,{"$f":"IF(Vacancy!E10=\"\",\"\",Vacancy!E10)","v":""}]
[]
[null,null,"GWA",null,null,null,{"$f":"IF(F9>=2.75,2,IF(F9>=2.5,5,IF(F9>=2.25,8,IF(F9>=2,11,IF(F9>=1.75,14,IF(F9>=1.5,16,IF(F9>=1.25,18,IF(F9>=1,20))))))))","v":false},{"$f":"IF(E3=\"First Level\",(20*F11)/5,IF(E3=\"Second Level\",(15*F11)/5,IF(E3=\"Executive/Managerial\",(35*F11)/5,\"\")))","v":""},null,null,null,"Highest Educational Attainment:",null,null,null,null,null,null,null,null,null,null,null,null,"Total Score:"]
[]
[null,null,"Last Rating Period",null,null,null,null,{"$f":"IFERROR(IF(AND(A7=TRUE,E3=\"First Level\"),G9,IF(AND(A7=TRUE,E3=\"Second Level\"),H7,H9)),\"\")","v":""},null,null,null,"First Level:",null,null,null,null,null,null,null,null,null,null,null,{"$f":"VLOOKUP(P11,Educ_2!$A$11:$B$26,2,FALSE)","v":{"$error":"#N/A"}},{"$f":"IFERROR(VLOOKUP($L$7,Educ_2!$A$1:$Q$8,X11+1,FALSE),\"\")","v":""}]
[]
[false,null,"Total Score",null,":",{"$f":"IF(H11=FALSE,0,H11)","v":""},"pts.",null,null,null,null,"Second Level:",null,null,null,null,null,null,null,null,null,null,null,{"$f":"VLOOKUP(P13,Educ_2!$A$11:$B$26,2,FALSE)","v":{"$error":"#N/A"}},{"$f":"IFERROR(VLOOKUP($L$7,Educ_2!$A$1:$Q$8,X13+1,FALSE),\"\")","v":""}]
[]
[null,null,null,null,null,null,null,null,null,null,null,"Executive/Managerial:",null,null,null,null,null,null,null,null,null,null,null,{"$f":"VLOOKUP(P15,Educ_2!$A$11:$B$26,2,FALSE)","v":{"$error":"#N/A"}},{"$f":"IFERROR(VLOOKUP($L$7,Educ_2!$A$1:$Q$8,X15+1,FALSE),\"\")","v":""}]
[]
[null,null,null,null,null,null,null,null,null,null,null,null,null,null,null,null,null,null,null,null,null,null,null,null,{"$f":"SUM(Y11,Y13,Y15)","v":0}]
[]
[null,null,"C. Training (10 pts.)",null,null,null,null,null,null,null,null,null,null,null,null,null,null,null,null,null,null,null,null,null,{"$f":"IF(E3=\"Executive/Managerial\",\"D. Experience (10 pts)\",\"D. Experience (25 pts)\")","v":"D. Experience (25 pts)"}]
[null,null,null,null,null,null,null,null,null,null,null,null,null,null,null,null,null,null,null,"Coversion to YEAR"]
[true,null,null,null,{"$f":"IF(Vacancy!$R$10=\"None required\",0,IF(Vacancy!$R$10=\"\",\"\",Vacancy!$R$10))","v":""},"Required (hrs.)",null,null,null,null,null,null,null,null,null,null,null,null,null,null,"Year",null,{"$f":"T21","v":0},null,null,{"$f":"IF(Vacancy!$AA$10=\"None required\",0,IF(Vacancy!$AA$10=\"\",\"\",Vacancy!$AA$10))","v":""},"Required Exp."]
[]
[null,null,null,{"$f":"E23-E21","v":{"$error":"#VALUE!"}},null,"Relevant training hrs. acquired",null,null,null,null,null,null,null,null,null,null,null,null,null,null,"Month",null,{"$f":"T23/12","v":0},null,{"$f":"Z23-Z21","v":{"$error":"#VALUE!"}},{"$f":"SUM(W21,W23,W25)","v":0},"Relevant years of experience"]
[]
[null,null,null,null,{"$f":"IF(N3=\"\",0,IFERROR(IF(E21=E23,5,IF(E23>=E21,((5*D23)/Trg_Exp!$D$2)+5,0)),0))","v":0},"Total",null,null,null,null,null,null,null,null,null,null,null,null,null,null,"Day",null,{"$f":"T25/365","v":0},null,{"$f":"IFERROR(IF(AND(Z21=Z23),10,IF(Vacancy!E6=\"Executive/Managerial\",((10*Y23)/Trg_Exp!$K$2),IF(Z23>=Z21,((15*Y23)/Trg_Exp!$K$2)+10,0))),0)","v":0},{"$f":"IF(N3=\"\",0,IF(Y25<0,0,Y25))","v":0},"Total Score:"]
[]
[null,null,{"$f":"IF(Vacancy!E6=\"Second Level\",\"E. Accomplishment (15 pts.)\",\"E. Accomplishment (10 pts.)\")","v":"E. Accomplishment (10 pts.)"}]
[]
[null,null,null,null,"E.1  Awards/Citations/Commendations"]
[]
[false,null,null,null,"E.1.1. Unit Level",null,null,null,null,{"$f":"IF(A31=TRUE,1,\"\")","v":""}]
[]
[false,null,null,null,"E.1.2. University Level",null,null,null,null,{"$f":"IF(A33=TRUE,3,\"\")","v":""}]
[]
[false,null,null,null,"E.1.3. National/CSC Level",null,null,null,null,{"$f":"IF(A35=TRUE,5,\"\")","v":""}]
[null,null,null,null,"E.2. Innovations/ Systems Improvement"]
[false,null,null,null,null,null,null,null,null,{"$f":"IF(A37=TRUE,IF(Vacancy!E6=\"Second Level\",4,3),\"\")","v":""}]
[null,null,null,null,null,null,null,null,null,null,{"$f":"IF(E3=\"Second Level\",((SUM(J31,J33,J35)*11)/9),((SUM(J31,J33,J35)*7)/9))","v":0}]
[]
[null,null,null,null,"C.2. Total Score:",null,null,null,null,{"$f":"IF(E3=\"Second Level\",(15*SUM(K38,J37)/15),(10*SUM(K38,J37)/10))","v":0}]
[]
[null,null,{"$f":"IF(E3=\"Executive/Managerial\",\"F. Physical Characteristics and Personality Traits (10 pts.)\",\"F. Physical Characteristics and Personality Traits (5 pts.)\")","v":"F. Physical Characteristics and Personality Traits (5 pts.)"}]
[]
[null,null,null,null,"Supervisor",null,"Co-worker 1",null,"Co-worker 2",null,"Co-worker 3",null,null,"Supervisor",null,"Co-worker 1",null,"Co-worker 2",null,"Co-worker 3",null,null,"Supervisor",null,"Co-worker 1",null,"Co-worker 2",null,"Co-worker 3"]
[null,null,null,null,"ATTITUDE",null,null,null,null,null,null,null,null,"COMMITMENT",null,null,null,null,null,null,null,null,"APPEARANCE"]
[null,null,null,"F.1.1. ",null,null,null,null,null,null,null,null,"F.2.1. ",null,null,null,null,null,null,null,null,"F.3.1. "]
[null,null,null,"F.1.2. ",null,null,null,null,null,null,null,null,"F.2.2. ",null,null,null,null,null,null,null,null,"F.3.2. "]
[null,null,null,"F.1.3. ",null,null,null,null,null,null,null,null,"F.2.3. "]
[null,null,null,null,{"$f":"IF($E$3=\"Executive/Managerial\",(4*(SUM(E46:F48)/12)),(2*(SUM(E46:F48)/12)))","v":0},null,{"$f":"IF($E$3=\"Executive/Managerial\",(4*(SUM(G46:H48)/12)),(2*(SUM(G46:H48)/12)))","v":0},null,{"$f":"IF($E$3=\"Executive/Managerial\",(4*(SUM(I46:J48)/12)),(2*(SUM(I46:J48)/12)))","v":0},null,{"$f":"IF($E$3=\"Executive/Managerial\",(4*(SUM(K46:L48)/12)),(2*(SUM(K46:L48)/12)))","v":0},null,null,{"$f":"IF($E$3=\"Executive/Managerial\",(4*(SUM(N46:O48)/12)),(2*(SUM(N46:O48)/12)))","v":0},null,{"$f":"IF($E$3=\"Executive/Managerial\",(4*(SUM(P46:Q48)/12)),(2*(SUM(P46:Q48)/12)))","v":0},null,{"$f":"IF($E$3=\"Executive/Managerial\",(4*(SUM(R46:S48)/12)),(2*(SUM(R46:S48)/12)))","v":0},null,{"$f":"IF($E$3=\"Executive/Managerial\",(4*(SUM(T46:U48)/12)),(2*(SUM(T46:U48)/12)))","v":0},null,null,{"$f":"IF($E$3=\"Executive/Managerial\",(2*(SUM(W46:X48))/8),(1*(SUM(W46:X48))/8))","v":0},null,{"$f":"IF($E$3=\"Executive/Managerial\",(2*(SUM(Y46:Z48))/8),(1*(SUM(Y46:Z48))/8))","v":0},null,{"$f":"IF($E$3=\"Executive/Managerial\",(2*(SUM(AA46:AB48))/8),(1*(SUM(AA46:AB48))/8))","v":0},null,{"$f":"IF($E$3=\"Executive/Managerial\",(2*(SUM(AC46:AD48))/8),(1*(SUM(AC46:AD48))/8))","v":0}]
[null,null,null,null,null,null,"Supervisor",null,"Co-worker"]
[null,null,null,null,"Attitude",null,{"$f":"E49","v":0},null,{"$f":"SUM(G49:L49)/3","v":0},null,null,null,null,"Total Score PCPT:",null,null,{"$f":"IF(E3=\"Executive/Managerial\",SUM(G54:J54),SUM(G54:J54))","v":0}]
[null,null,null,null,"Commitment",null,{"$f":"N49","v":0},null,{"$f":"SUM(P49:U49)/3","v":0}]
[null,null,null,null,"Appearance",null,{"$f":"W49","v":0},null,{"$f":"SUM(Y49:AD49)/3","v":0}]
[null,null,null,null,null,null,{"$f":"SUM(G51:G53)*0.6","v":0},null,{"$f":"SUM(I51:I53)*0.4","v":0}]
[null,null,{"$f":"IF(E3=\"First Level\",\"G. Potential [Assessment Form No. 2] (3 pts.)\",\"G. Potential [Assessment Form No. 2] (5 pts.)\")","v":"G. Potential [Assessment Form No. 2] (5 pts.)"}]
[]
[null,null,null,"INTERVIEW"]
[]
[null,null,null,null,"G.1.1. Sound judgement",null,null,null,null,null,null,{"$f":"IF($E$3=\"First Level\",\"Not Applicable for First Level position\",\"\")","v":""}]
[null,null,null,null,"G.1.2. Analytical mind",null,null,null,null,null,null,{"$f":"IF($E$3=\"First Level\",\"Not Applicable for First Level position\",\"\")","v":""}]
[null,null,null,null,"G.1.3. The ability to motivate co-workers",null,null,null,null,null,null,{"$f":"IF($E$3=\"First Level\",\"Not Applicable for First Level position\",\"\")","v":""}]
[null,null,null,null,"G.1.4. Unifying Factor",null,null,null,null,null,null,{"$f":"IF($E$3=\"First Level\",\"Not Applicable for First Level position\",\"\")","v":""}]
[null,null,null,null,"G.1.5. Vision/foresight",null,null,null,null,null,null,{"$f":"IF($E$3=\"First Level\",\"Not Applicable for First Level position\",\"\")","v":""}]
[null,null,null,null,"G.2. Resourcefulness"]
[null,null,null,null,"G.3. Creativity/ Ingenuity "]
[]
[null,null,null,"TOTAL POINTS FOR POTENTIAL",null,null,null,null,null,null,{"$f":"IF(E3=\"First Level\",(3*(SUM(K64:K65)/8)),(5*(SUM(K59:K65)/28)))","v":0}]
[]
[null,null,{"$f":"IF(E3=\"First Level\",\"H. Written/ Skills Examination (12 pts.)\",\"H. Written/ Skills Examination (15 pts.)\")","v":"H. Written/ Skills Examination (15 pts.)"}]
[null,null,null,null,null,null,null,null,null,null,{"$f":"IFERROR(SUM(K59:K65)/7,0)","v":0}]
[null,null,null,"WRITTEN/SKILLS EXAMINATION"]
[]
[null,null,null,null,"Perfect/Entire Score",null,null,"="]
[null,null,null,null,"Raw Score",null,null,"="]
[]
[]
[null,null,null,"TOTAL FOR EXAMINATION",null,null,null,null,null,null,{"$f":"IFERROR(IF(E3=\"First Level\",IF(K74>K73,0,(K74*12)/K73),IF(K74>K73,0,(K74*15)/K73)),0)","v":0}]
[]
[null,null,"I. Public Service"]
[]
[null,null,null,null,"Additional Pts. in excess of Total Score"]

{"sheet":"AP26","index":33,"n_rows":81,"n_cols":33,"rows_kept":81,"cut":false,"hidden":false,"merged":[[1,2,1,29],[2,4,2,9],[2,13,2,22],[2,27,2,30],[2,32,2,33],[45,4,45,5],[45,6,45,7],[45,8,45,9],[45,10,45,11],[45,13,45,14],[10,15,10,22],[12,15,12,22],[14,15,14,22],[19,19,19,22],[35,4,37,7],[45,28,45,29],[45,24,45,25],[45,26,45,27],[6,11,6,22],[46,4,46,5],[46,6,46,7],[46,8,46,9],[46,10,46,11],[46,13,46,14],[46,17,46,18],[46,19,46,20],[46,22,46,23],[45,15,45,16],[45,17,45,18],[45,19,45,20],[45,22,45,23],[46,24,46,25],[46,26,46,27],[46,28,46,29],[47,4,47,5],[47,6,47,7],[47,8,47,9],[47,10,47,11],[47,13,47,14],[47,15,47,16],[47,17,47,18],[47,19,47,20],[47,22,47,23],[47,24,47,25],[47,26,47,27],[47,28,47,29],[46,15,46,16],[48,4,48,5],[48,6,48,7],[48,8,48,9],[48,10,48,11],[48,13,48,14],[48,28,48,29],[50,16,50,17],[48,15,48,16],[48,17,48,18],[48,19,48,20],[48,22,48,23],[48,24,48,25],[48,26,48,27]]}
[]
[null,null,"MSP CALCULATOR"]
[null,null,"Levels",":",{"$f":"IF(Vacancy!E6=\"\",\"\",Vacancy!E6)","v":""},null,null,null,null,null,null,"Name",":",null,null,null,null,null,null,null,null,null,null,null,null,null,"Employment Category:",null,null,null,null,null,{"$f":"SUM(F13,Y11,Y13,Y15,E25,Z25,J40,Q51,K67,K77,D81)","v":0}]
[null,null,null,null,null,null,null,null,null,null,null,null,null,null,null,null,null,null,null,null,null,null,null,null,null,null,null,null,null,null,null,null,"TOTAL MATRIX POINTS"]
[null,null,{"$f":"IF(E3=\"First Level\",\"A. Performance Rating (20 pts)\",IF(E3=\"Second Level\",\"A. Performance Rating (15 pts)\",\"A. Performance Rating (35 pts)\"))","v":"A. Performance Rating (35 pts)"},null,null,null,null,null,null,null,null,{"$f":"IF(E3=\"First Level\",\"B. Education (15 pts.)\",IF(E3=\"Second Level\",\"B. Education (10 pts.)\",\"B. Education (5 pts.)\"))","v":"B. Education (5 pts.)"}]
[null,null,"New Graduates (No previous work experience)",null,null,null,null,null,null,null,null,"Required:"]
[false,null,null,null,null,null,null,{"$f":"IF(F9>=2.75,1,IF(F9>=2.5,3,IF(F9>=2.25,5,IF(F9>=2,7,IF(F9>=1.75,9,IF(F9>=1.5,11,IF(F9>=1.25,13,IF(F9>=1,15))))))))","v":false},null,null,null,{"$f":"IF(Vacancy!E10=\"\",\"\",Vacancy!E10)","v":""}]
[]
[null,null,"GWA",null,null,null,{"$f":"IF(F9>=2.75,2,IF(F9>=2.5,5,IF(F9>=2.25,8,IF(F9>=2,11,IF(F9>=1.75,14,IF(F9>=1.5,16,IF(F9>=1.25,18,IF(F9>=1,20))))))))","v":false},{"$f":"IF(E3=\"First Level\",(20*F11)/5,IF(E3=\"Second Level\",(15*F11)/5,IF(E3=\"Executive/Managerial\",(35*F11)/5,\"\")))","v":""},null,null,null,"Highest Educational Attainment:",null,null,null,null,null,null,null,null,null,null,null,null,"Total Score:"]
[]
[null,null,"Last Rating Period",null,null,null,null,{"$f":"IFERROR(IF(AND(A7=TRUE,E3=\"First Level\"),G9,IF(AND(A7=TRUE,E3=\"Second Level\"),H7,H9)),\"\")","v":""},null,null,null,"First Level:",null,null,null,null,null,null,null,null,null,null,null,{"$f":"VLOOKUP(P11,Educ_2!$A$11:$B$26,2,FALSE)","v":{"$error":"#N/A"}},{"$f":"IFERROR(VLOOKUP($L$7,Educ_2!$A$1:$Q$8,X11+1,FALSE),\"\")","v":""}]
[]
[false,null,"Total Score",null,":",{"$f":"IF(H11=FALSE,0,H11)","v":""},"pts.",null,null,null,null,"Second Level:",null,null,null,null,null,null,null,null,null,null,null,{"$f":"VLOOKUP(P13,Educ_2!$A$11:$B$26,2,FALSE)","v":{"$error":"#N/A"}},{"$f":"IFERROR(VLOOKUP($L$7,Educ_2!$A$1:$Q$8,X13+1,FALSE),\"\")","v":""}]
[]
[null,null,null,null,null,null,null,null,null,null,null,"Executive/Managerial:",null,null,null,null,null,null,null,null,null,null,null,{"$f":"VLOOKUP(P15,Educ_2!$A$11:$B$26,2,FALSE)","v":{"$error":"#N/A"}},{"$f":"IFERROR(VLOOKUP($L$7,Educ_2!$A$1:$Q$8,X15+1,FALSE),\"\")","v":""}]
[]
[null,null,null,null,null,null,null,null,null,null,null,null,null,null,null,null,null,null,null,null,null,null,null,null,{"$f":"SUM(Y11,Y13,Y15)","v":0}]
[]
[null,null,"C. Training (10 pts.)",null,null,null,null,null,null,null,null,null,null,null,null,null,null,null,null,null,null,null,null,null,{"$f":"IF(E3=\"Executive/Managerial\",\"D. Experience (10 pts)\",\"D. Experience (25 pts)\")","v":"D. Experience (25 pts)"}]
[null,null,null,null,null,null,null,null,null,null,null,null,null,null,null,null,null,null,null,"Coversion to YEAR"]
[true,null,null,null,{"$f":"IF(Vacancy!$R$10=\"None required\",0,IF(Vacancy!$R$10=\"\",\"\",Vacancy!$R$10))","v":""},"Required (hrs.)",null,null,null,null,null,null,null,null,null,null,null,null,null,null,"Year",null,{"$f":"T21","v":0},null,null,{"$f":"IF(Vacancy!$AA$10=\"None required\",0,IF(Vacancy!$AA$10=\"\",\"\",Vacancy!$AA$10))","v":""},"Required Exp."]
[]
[null,null,null,{"$f":"E23-E21","v":{"$error":"#VALUE!"}},null,"Relevant training hrs. acquired",null,null,null,null,null,null,null,null,null,null,null,null,null,null,"Month",null,{"$f":"T23/12","v":0},null,{"$f":"Z23-Z21","v":{"$error":"#VALUE!"}},{"$f":"SUM(W21,W23,W25)","v":0},"Relevant years of experience"]
[]
[null,null,null,null,{"$f":"IF(N3=\"\",0,IFERROR(IF(E21=E23,5,IF(E23>=E21,((5*D23)/Trg_Exp!$D$2)+5,0)),0))","v":0},"Total",null,null,null,null,null,null,null,null,null,null,null,null,null,null,"Day",null,{"$f":"T25/365","v":0},null,{"$f":"IFERROR(IF(AND(Z21=Z23),10,IF(Vacancy!E6=\"Executive/Managerial\",((10*Y23)/Trg_Exp!$K$2),IF(Z23>=Z21,((15*Y23)/Trg_Exp!$K$2)+10,0))),0)","v":0},{"$f":"IF(N3=\"\",0,IF(Y25<0,0,Y25))","v":0},"Total Score:"]
[]
[null,null,{"$f":"IF(Vacancy!E6=\"Second Level\",\"E. Accomplishment (15 pts.)\",\"E. Accomplishment (10 pts.)\")","v":"E. Accomplishment (10 pts.)"}]
[]
[null,null,null,null,"E.1  Awards/Citations/Commendations"]
[]
[false,null,null,null,"E.1.1. Unit Level",null,null,null,null,{"$f":"IF(A31=TRUE,1,\"\")","v":""}]
[]
[false,null,null,null,"E.1.2. University Level",null,null,null,null,{"$f":"IF(A33=TRUE,3,\"\")","v":""}]
[]
[false,null,null,null,"E.1.3. National/CSC Level",null,null,null,null,{"$f":"IF(A35=TRUE,5,\"\")","v":""}]
[null,null,null,null,"E.2. Innovations/ Systems Improvement"]
[false,null,null,null,null,null,null,null,null,{"$f":"IF(A37=TRUE,IF(Vacancy!E6=\"Second Level\",4,3),\"\")","v":""}]
[null,null,null,null,null,null,null,null,null,null,{"$f":"IF(E3=\"Second Level\",((SUM(J31,J33,J35)*11)/9),((SUM(J31,J33,J35)*7)/9))","v":0}]
[]
[null,null,null,null,"C.2. Total Score:",null,null,null,null,{"$f":"IF(E3=\"Second Level\",(15*SUM(K38,J37)/15),(10*SUM(K38,J37)/10))","v":0}]
[]
[null,null,{"$f":"IF(E3=\"Executive/Managerial\",\"F. Physical Characteristics and Personality Traits (10 pts.)\",\"F. Physical Characteristics and Personality Traits (5 pts.)\")","v":"F. Physical Characteristics and Personality Traits (5 pts.)"}]
[]
[null,null,null,null,"Supervisor",null,"Co-worker 1",null,"Co-worker 2",null,"Co-worker 3",null,null,"Supervisor",null,"Co-worker 1",null,"Co-worker 2",null,"Co-worker 3",null,null,"Supervisor",null,"Co-worker 1",null,"Co-worker 2",null,"Co-worker 3"]
[null,null,null,null,"ATTITUDE",null,null,null,null,null,null,null,null,"COMMITMENT",null,null,null,null,null,null,null,null,"APPEARANCE"]
[null,null,null,"F.1.1. ",null,null,null,null,null,null,null,null,"F.2.1. ",null,null,null,null,null,null,null,null,"F.3.1. "]
[null,null,null,"F.1.2. ",null,null,null,null,null,null,null,null,"F.2.2. ",null,null,null,null,null,null,null,null,"F.3.2. "]
[null,null,null,"F.1.3. ",null,null,null,null,null,null,null,null,"F.2.3. "]
[null,null,null,null,{"$f":"IF($E$3=\"Executive/Managerial\",(4*(SUM(E46:F48)/12)),(2*(SUM(E46:F48)/12)))","v":0},null,{"$f":"IF($E$3=\"Executive/Managerial\",(4*(SUM(G46:H48)/12)),(2*(SUM(G46:H48)/12)))","v":0},null,{"$f":"IF($E$3=\"Executive/Managerial\",(4*(SUM(I46:J48)/12)),(2*(SUM(I46:J48)/12)))","v":0},null,{"$f":"IF($E$3=\"Executive/Managerial\",(4*(SUM(K46:L48)/12)),(2*(SUM(K46:L48)/12)))","v":0},null,null,{"$f":"IF($E$3=\"Executive/Managerial\",(4*(SUM(N46:O48)/12)),(2*(SUM(N46:O48)/12)))","v":0},null,{"$f":"IF($E$3=\"Executive/Managerial\",(4*(SUM(P46:Q48)/12)),(2*(SUM(P46:Q48)/12)))","v":0},null,{"$f":"IF($E$3=\"Executive/Managerial\",(4*(SUM(R46:S48)/12)),(2*(SUM(R46:S48)/12)))","v":0},null,{"$f":"IF($E$3=\"Executive/Managerial\",(4*(SUM(T46:U48)/12)),(2*(SUM(T46:U48)/12)))","v":0},null,null,{"$f":"IF($E$3=\"Executive/Managerial\",(2*(SUM(W46:X48))/8),(1*(SUM(W46:X48))/8))","v":0},null,{"$f":"IF($E$3=\"Executive/Managerial\",(2*(SUM(Y46:Z48))/8),(1*(SUM(Y46:Z48))/8))","v":0},null,{"$f":"IF($E$3=\"Executive/Managerial\",(2*(SUM(AA46:AB48))/8),(1*(SUM(AA46:AB48))/8))","v":0},null,{"$f":"IF($E$3=\"Executive/Managerial\",(2*(SUM(AC46:AD48))/8),(1*(SUM(AC46:AD48))/8))","v":0}]
[null,null,null,null,null,null,"Supervisor",null,"Co-worker"]
[null,null,null,null,"Attitude",null,{"$f":"E49","v":0},null,{"$f":"SUM(G49:L49)/3","v":0},null,null,null,null,"Total Score PCPT:",null,null,{"$f":"IF(E3=\"Executive/Managerial\",SUM(G54:J54),SUM(G54:J54))","v":0}]
[null,null,null,null,"Commitment",null,{"$f":"N49","v":0},null,{"$f":"SUM(P49:U49)/3","v":0}]
[null,null,null,null,"Appearance",null,{"$f":"W49","v":0},null,{"$f":"SUM(Y49:AD49)/3","v":0}]
[null,null,null,null,null,null,{"$f":"SUM(G51:G53)*0.6","v":0},null,{"$f":"SUM(I51:I53)*0.4","v":0}]
[null,null,{"$f":"IF(E3=\"First Level\",\"G. Potential [Assessment Form No. 2] (3 pts.)\",\"G. Potential [Assessment Form No. 2] (5 pts.)\")","v":"G. Potential [Assessment Form No. 2] (5 pts.)"}]
[]
[null,null,null,"INTERVIEW"]
[]
[null,null,null,null,"G.1.1. Sound judgement",null,null,null,null,null,null,{"$f":"IF($E$3=\"First Level\",\"Not Applicable for First Level position\",\"\")","v":""}]
[null,null,null,null,"G.1.2. Analytical mind",null,null,null,null,null,null,{"$f":"IF($E$3=\"First Level\",\"Not Applicable for First Level position\",\"\")","v":""}]
[null,null,null,null,"G.1.3. The ability to motivate co-workers",null,null,null,null,null,null,{"$f":"IF($E$3=\"First Level\",\"Not Applicable for First Level position\",\"\")","v":""}]
[null,null,null,null,"G.1.4. Unifying Factor",null,null,null,null,null,null,{"$f":"IF($E$3=\"First Level\",\"Not Applicable for First Level position\",\"\")","v":""}]
[null,null,null,null,"G.1.5. Vision/foresight",null,null,null,null,null,null,{"$f":"IF($E$3=\"First Level\",\"Not Applicable for First Level position\",\"\")","v":""}]
[null,null,null,null,"G.2. Resourcefulness"]
[null,null,null,null,"G.3. Creativity/ Ingenuity "]
[]
[null,null,null,"TOTAL POINTS FOR POTENTIAL",null,null,null,null,null,null,{"$f":"IF(E3=\"First Level\",(3*(SUM(K64:K65)/8)),(5*(SUM(K59:K65)/28)))","v":0}]
[]
[null,null,{"$f":"IF(E3=\"First Level\",\"H. Written/ Skills Examination (12 pts.)\",\"H. Written/ Skills Examination (15 pts.)\")","v":"H. Written/ Skills Examination (15 pts.)"}]
[null,null,null,null,null,null,null,null,null,null,{"$f":"IFERROR(SUM(K59:K65)/7,0)","v":0}]
[null,null,null,"WRITTEN/SKILLS EXAMINATION"]
[]
[null,null,null,null,"Perfect/Entire Score",null,null,"="]
[null,null,null,null,"Raw Score",null,null,"="]
[]
[]
[null,null,null,"TOTAL FOR EXAMINATION",null,null,null,null,null,null,{"$f":"IFERROR(IF(E3=\"First Level\",IF(K74>K73,0,(K74*12)/K73),IF(K74>K73,0,(K74*15)/K73)),0)","v":0}]
[]
[null,null,"I. Public Service"]
[]
[null,null,null,null,"Additional Pts. in excess of Total Score"]

{"sheet":"AP27","index":34,"n_rows":81,"n_cols":33,"rows_kept":81,"cut":false,"hidden":false,"merged":[[1,2,1,29],[2,4,2,9],[2,13,2,22],[2,27,2,30],[2,32,2,33],[45,4,45,5],[45,6,45,7],[45,8,45,9],[45,10,45,11],[45,13,45,14],[10,15,10,22],[12,15,12,22],[14,15,14,22],[19,19,19,22],[35,4,37,7],[45,28,45,29],[45,24,45,25],[45,26,45,27],[6,11,6,22],[46,4,46,5],[46,6,46,7],[46,8,46,9],[46,10,46,11],[46,13,46,14],[46,17,46,18],[46,19,46,20],[46,22,46,23],[45,15,45,16],[45,17,45,18],[45,19,45,20],[45,22,45,23],[46,24,46,25],[46,26,46,27],[46,28,46,29],[47,4,47,5],[47,6,47,7],[47,8,47,9],[47,10,47,11],[47,13,47,14],[47,15,47,16],[47,17,47,18],[47,19,47,20],[47,22,47,23],[47,24,47,25],[47,26,47,27],[47,28,47,29],[46,15,46,16],[48,4,48,5],[48,6,48,7],[48,8,48,9],[48,10,48,11],[48,13,48,14],[48,28,48,29],[50,16,50,17],[48,15,48,16],[48,17,48,18],[48,19,48,20],[48,22,48,23],[48,24,48,25],[48,26,48,27]]}
[]
[null,null,"MSP CALCULATOR"]
[null,null,"Levels",":",{"$f":"IF(Vacancy!E6=\"\",\"\",Vacancy!E6)","v":""},null,null,null,null,null,null,"Name",":",null,null,null,null,null,null,null,null,null,null,null,null,null,"Employment Category:",null,null,null,null,null,{"$f":"SUM(F13,Y11,Y13,Y15,E25,Z25,J40,Q51,K67,K77,D81)","v":0}]
[null,null,null,null,null,null,null,null,null,null,null,null,null,null,null,null,null,null,null,null,null,null,null,null,null,null,null,null,null,null,null,null,"TOTAL MATRIX POINTS"]
[null,null,{"$f":"IF(E3=\"First Level\",\"A. Performance Rating (20 pts)\",IF(E3=\"Second Level\",\"A. Performance Rating (15 pts)\",\"A. Performance Rating (35 pts)\"))","v":"A. Performance Rating (35 pts)"},null,null,null,null,null,null,null,null,{"$f":"IF(E3=\"First Level\",\"B. Education (15 pts.)\",IF(E3=\"Second Level\",\"B. Education (10 pts.)\",\"B. Education (5 pts.)\"))","v":"B. Education (5 pts.)"}]
[null,null,"New Graduates (No previous work experience)",null,null,null,null,null,null,null,null,"Required:"]
[false,null,null,null,null,null,null,{"$f":"IF(F9>=2.75,1,IF(F9>=2.5,3,IF(F9>=2.25,5,IF(F9>=2,7,IF(F9>=1.75,9,IF(F9>=1.5,11,IF(F9>=1.25,13,IF(F9>=1,15))))))))","v":false},null,null,null,{"$f":"IF(Vacancy!E10=\"\",\"\",Vacancy!E10)","v":""}]
[]
[null,null,"GWA",null,null,null,{"$f":"IF(F9>=2.75,2,IF(F9>=2.5,5,IF(F9>=2.25,8,IF(F9>=2,11,IF(F9>=1.75,14,IF(F9>=1.5,16,IF(F9>=1.25,18,IF(F9>=1,20))))))))","v":false},{"$f":"IF(E3=\"First Level\",(20*F11)/5,IF(E3=\"Second Level\",(15*F11)/5,IF(E3=\"Executive/Managerial\",(35*F11)/5,\"\")))","v":""},null,null,null,"Highest Educational Attainment:",null,null,null,null,null,null,null,null,null,null,null,null,"Total Score:"]
[]
[null,null,"Last Rating Period",null,null,null,null,{"$f":"IFERROR(IF(AND(A7=TRUE,E3=\"First Level\"),G9,IF(AND(A7=TRUE,E3=\"Second Level\"),H7,H9)),\"\")","v":""},null,null,null,"First Level:",null,null,null,null,null,null,null,null,null,null,null,{"$f":"VLOOKUP(P11,Educ_2!$A$11:$B$26,2,FALSE)","v":{"$error":"#N/A"}},{"$f":"IFERROR(VLOOKUP($L$7,Educ_2!$A$1:$Q$8,X11+1,FALSE),\"\")","v":""}]
[]
[false,null,"Total Score",null,":",{"$f":"IF(H11=FALSE,0,H11)","v":""},"pts.",null,null,null,null,"Second Level:",null,null,null,null,null,null,null,null,null,null,null,{"$f":"VLOOKUP(P13,Educ_2!$A$11:$B$26,2,FALSE)","v":{"$error":"#N/A"}},{"$f":"IFERROR(VLOOKUP($L$7,Educ_2!$A$1:$Q$8,X13+1,FALSE),\"\")","v":""}]
[]
[null,null,null,null,null,null,null,null,null,null,null,"Executive/Managerial:",null,null,null,null,null,null,null,null,null,null,null,{"$f":"VLOOKUP(P15,Educ_2!$A$11:$B$26,2,FALSE)","v":{"$error":"#N/A"}},{"$f":"IFERROR(VLOOKUP($L$7,Educ_2!$A$1:$Q$8,X15+1,FALSE),\"\")","v":""}]
[]
[null,null,null,null,null,null,null,null,null,null,null,null,null,null,null,null,null,null,null,null,null,null,null,null,{"$f":"SUM(Y11,Y13,Y15)","v":0}]
[]
[null,null,"C. Training (10 pts.)",null,null,null,null,null,null,null,null,null,null,null,null,null,null,null,null,null,null,null,null,null,{"$f":"IF(E3=\"Executive/Managerial\",\"D. Experience (10 pts)\",\"D. Experience (25 pts)\")","v":"D. Experience (25 pts)"}]
[null,null,null,null,null,null,null,null,null,null,null,null,null,null,null,null,null,null,null,"Coversion to YEAR"]
[true,null,null,null,{"$f":"IF(Vacancy!$R$10=\"None required\",0,IF(Vacancy!$R$10=\"\",\"\",Vacancy!$R$10))","v":""},"Required (hrs.)",null,null,null,null,null,null,null,null,null,null,null,null,null,null,"Year",null,{"$f":"T21","v":0},null,null,{"$f":"IF(Vacancy!$AA$10=\"None required\",0,IF(Vacancy!$AA$10=\"\",\"\",Vacancy!$AA$10))","v":""},"Required Exp."]
[]
[null,null,null,{"$f":"E23-E21","v":{"$error":"#VALUE!"}},null,"Relevant training hrs. acquired",null,null,null,null,null,null,null,null,null,null,null,null,null,null,"Month",null,{"$f":"T23/12","v":0},null,{"$f":"Z23-Z21","v":{"$error":"#VALUE!"}},{"$f":"SUM(W21,W23,W25)","v":0},"Relevant years of experience"]
[]
[null,null,null,null,{"$f":"IF(N3=\"\",0,IFERROR(IF(E21=E23,5,IF(E23>=E21,((5*D23)/Trg_Exp!$D$2)+5,0)),0))","v":0},"Total",null,null,null,null,null,null,null,null,null,null,null,null,null,null,"Day",null,{"$f":"T25/365","v":0},null,{"$f":"IFERROR(IF(AND(Z21=Z23),10,IF(Vacancy!E6=\"Executive/Managerial\",((10*Y23)/Trg_Exp!$K$2),IF(Z23>=Z21,((15*Y23)/Trg_Exp!$K$2)+10,0))),0)","v":0},{"$f":"IF(N3=\"\",0,IF(Y25<0,0,Y25))","v":0},"Total Score:"]
[]
[null,null,{"$f":"IF(Vacancy!E6=\"Second Level\",\"E. Accomplishment (15 pts.)\",\"E. Accomplishment (10 pts.)\")","v":"E. Accomplishment (10 pts.)"}]
[]
[null,null,null,null,"E.1  Awards/Citations/Commendations"]
[]
[false,null,null,null,"E.1.1. Unit Level",null,null,null,null,{"$f":"IF(A31=TRUE,1,\"\")","v":""}]
[]
[false,null,null,null,"E.1.2. University Level",null,null,null,null,{"$f":"IF(A33=TRUE,3,\"\")","v":""}]
[]
[false,null,null,null,"E.1.3. National/CSC Level",null,null,null,null,{"$f":"IF(A35=TRUE,5,\"\")","v":""}]
[null,null,null,null,"E.2. Innovations/ Systems Improvement"]
[false,null,null,null,null,null,null,null,null,{"$f":"IF(A37=TRUE,IF(Vacancy!E6=\"Second Level\",4,3),\"\")","v":""}]
[null,null,null,null,null,null,null,null,null,null,{"$f":"IF(E3=\"Second Level\",((SUM(J31,J33,J35)*11)/9),((SUM(J31,J33,J35)*7)/9))","v":0}]
[]
[null,null,null,null,"C.2. Total Score:",null,null,null,null,{"$f":"IF(E3=\"Second Level\",(15*SUM(K38,J37)/15),(10*SUM(K38,J37)/10))","v":0}]
[]
[null,null,{"$f":"IF(E3=\"Executive/Managerial\",\"F. Physical Characteristics and Personality Traits (10 pts.)\",\"F. Physical Characteristics and Personality Traits (5 pts.)\")","v":"F. Physical Characteristics and Personality Traits (5 pts.)"}]
[]
[null,null,null,null,"Supervisor",null,"Co-worker 1",null,"Co-worker 2",null,"Co-worker 3",null,null,"Supervisor",null,"Co-worker 1",null,"Co-worker 2",null,"Co-worker 3",null,null,"Supervisor",null,"Co-worker 1",null,"Co-worker 2",null,"Co-worker 3"]
[null,null,null,null,"ATTITUDE",null,null,null,null,null,null,null,null,"COMMITMENT",null,null,null,null,null,null,null,null,"APPEARANCE"]
[null,null,null,"F.1.1. ",null,null,null,null,null,null,null,null,"F.2.1. ",null,null,null,null,null,null,null,null,"F.3.1. "]
[null,null,null,"F.1.2. ",null,null,null,null,null,null,null,null,"F.2.2. ",null,null,null,null,null,null,null,null,"F.3.2. "]
[null,null,null,"F.1.3. ",null,null,null,null,null,null,null,null,"F.2.3. "]
[null,null,null,null,{"$f":"IF($E$3=\"Executive/Managerial\",(4*(SUM(E46:F48)/12)),(2*(SUM(E46:F48)/12)))","v":0},null,{"$f":"IF($E$3=\"Executive/Managerial\",(4*(SUM(G46:H48)/12)),(2*(SUM(G46:H48)/12)))","v":0},null,{"$f":"IF($E$3=\"Executive/Managerial\",(4*(SUM(I46:J48)/12)),(2*(SUM(I46:J48)/12)))","v":0},null,{"$f":"IF($E$3=\"Executive/Managerial\",(4*(SUM(K46:L48)/12)),(2*(SUM(K46:L48)/12)))","v":0},null,null,{"$f":"IF($E$3=\"Executive/Managerial\",(4*(SUM(N46:O48)/12)),(2*(SUM(N46:O48)/12)))","v":0},null,{"$f":"IF($E$3=\"Executive/Managerial\",(4*(SUM(P46:Q48)/12)),(2*(SUM(P46:Q48)/12)))","v":0},null,{"$f":"IF($E$3=\"Executive/Managerial\",(4*(SUM(R46:S48)/12)),(2*(SUM(R46:S48)/12)))","v":0},null,{"$f":"IF($E$3=\"Executive/Managerial\",(4*(SUM(T46:U48)/12)),(2*(SUM(T46:U48)/12)))","v":0},null,null,{"$f":"IF($E$3=\"Executive/Managerial\",(2*(SUM(W46:X48))/8),(1*(SUM(W46:X48))/8))","v":0},null,{"$f":"IF($E$3=\"Executive/Managerial\",(2*(SUM(Y46:Z48))/8),(1*(SUM(Y46:Z48))/8))","v":0},null,{"$f":"IF($E$3=\"Executive/Managerial\",(2*(SUM(AA46:AB48))/8),(1*(SUM(AA46:AB48))/8))","v":0},null,{"$f":"IF($E$3=\"Executive/Managerial\",(2*(SUM(AC46:AD48))/8),(1*(SUM(AC46:AD48))/8))","v":0}]
[null,null,null,null,null,null,"Supervisor",null,"Co-worker"]
[null,null,null,null,"Attitude",null,{"$f":"E49","v":0},null,{"$f":"SUM(G49:L49)/3","v":0},null,null,null,null,"Total Score PCPT:",null,null,{"$f":"IF(E3=\"Executive/Managerial\",SUM(G54:J54),SUM(G54:J54))","v":0}]
[null,null,null,null,"Commitment",null,{"$f":"N49","v":0},null,{"$f":"SUM(P49:U49)/3","v":0}]
[null,null,null,null,"Appearance",null,{"$f":"W49","v":0},null,{"$f":"SUM(Y49:AD49)/3","v":0}]
[null,null,null,null,null,null,{"$f":"SUM(G51:G53)*0.6","v":0},null,{"$f":"SUM(I51:I53)*0.4","v":0}]
[null,null,{"$f":"IF(E3=\"First Level\",\"G. Potential [Assessment Form No. 2] (3 pts.)\",\"G. Potential [Assessment Form No. 2] (5 pts.)\")","v":"G. Potential [Assessment Form No. 2] (5 pts.)"}]
[]
[null,null,null,"INTERVIEW"]
[]
[null,null,null,null,"G.1.1. Sound judgement",null,null,null,null,null,null,{"$f":"IF($E$3=\"First Level\",\"Not Applicable for First Level position\",\"\")","v":""}]
[null,null,null,null,"G.1.2. Analytical mind",null,null,null,null,null,null,{"$f":"IF($E$3=\"First Level\",\"Not Applicable for First Level position\",\"\")","v":""}]
[null,null,null,null,"G.1.3. The ability to motivate co-workers",null,null,null,null,null,null,{"$f":"IF($E$3=\"First Level\",\"Not Applicable for First Level position\",\"\")","v":""}]
[null,null,null,null,"G.1.4. Unifying Factor",null,null,null,null,null,null,{"$f":"IF($E$3=\"First Level\",\"Not Applicable for First Level position\",\"\")","v":""}]
[null,null,null,null,"G.1.5. Vision/foresight",null,null,null,null,null,null,{"$f":"IF($E$3=\"First Level\",\"Not Applicable for First Level position\",\"\")","v":""}]
[null,null,null,null,"G.2. Resourcefulness"]
[null,null,null,null,"G.3. Creativity/ Ingenuity "]
[]
[null,null,null,"TOTAL POINTS FOR POTENTIAL",null,null,null,null,null,null,{"$f":"IF(E3=\"First Level\",(3*(SUM(K64:K65)/8)),(5*(SUM(K59:K65)/28)))","v":0}]
[]
[null,null,{"$f":"IF(E3=\"First Level\",\"H. Written/ Skills Examination (12 pts.)\",\"H. Written/ Skills Examination (15 pts.)\")","v":"H. Written/ Skills Examination (15 pts.)"}]
[null,null,null,null,null,null,null,null,null,null,{"$f":"IFERROR(SUM(K59:K65)/7,0)","v":0}]
[null,null,null,"WRITTEN/SKILLS EXAMINATION"]
[]
[null,null,null,null,"Perfect/Entire Score",null,null,"="]
[null,null,null,null,"Raw Score",null,null,"="]
[]
[]
[null,null,null,"TOTAL FOR EXAMINATION",null,null,null,null,null,null,{"$f":"IFERROR(IF(E3=\"First Level\",IF(K74>K73,0,(K74*12)/K73),IF(K74>K73,0,(K74*15)/K73)),0)","v":0}]
[]
[null,null,"I. Public Service"]
[]
[null,null,null,null,"Additional Pts. in excess of Total Score"]

{"sheet":"AP28","index":35,"n_rows":81,"n_cols":33,"rows_kept":81,"cut":false,"hidden":false,"merged":[[1,2,1,29],[2,4,2,9],[2,13,2,22],[2,27,2,30],[2,32,2,33],[45,4,45,5],[45,6,45,7],[45,8,45,9],[45,10,45,11],[45,13,45,14],[10,15,10,22],[12,15,12,22],[14,15,14,22],[19,19,19,22],[35,4,37,7],[45,28,45,29],[45,24,45,25],[45,26,45,27],[6,11,6,22],[46,4,46,5],[46,6,46,7],[46,8,46,9],[46,10,46,11],[46,13,46,14],[46,17,46,18],[46,19,46,20],[46,22,46,23],[45,15,45,16],[45,17,45,18],[45,19,45,20],[45,22,45,23],[46,24,46,25],[46,26,46,27],[46,28,46,29],[47,4,47,5],[47,6,47,7],[47,8,47,9],[47,10,47,11],[47,13,47,14],[47,15,47,16],[47,17,47,18],[47,19,47,20],[47,22,47,23],[47,24,47,25],[47,26,47,27],[47,28,47,29],[46,15,46,16],[48,4,48,5],[48,6,48,7],[48,8,48,9],[48,10,48,11],[48,13,48,14],[48,28,48,29],[50,16,50,17],[48,15,48,16],[48,17,48,18],[48,19,48,20],[48,22,48,23],[48,24,48,25],[48,26,48,27]]}
[]
[null,null,"MSP CALCULATOR"]
[null,null,"Levels",":",{"$f":"IF(Vacancy!E6=\"\",\"\",Vacancy!E6)","v":""},null,null,null,null,null,null,"Name",":",null,null,null,null,null,null,null,null,null,null,null,null,null,"Employment Category:",null,null,null,null,null,{"$f":"SUM(F13,Y11,Y13,Y15,E25,Z25,J40,Q51,K67,K77,D81)","v":0}]
[null,null,null,null,null,null,null,null,null,null,null,null,null,null,null,null,null,null,null,null,null,null,null,null,null,null,null,null,null,null,null,null,"TOTAL MATRIX POINTS"]
[null,null,{"$f":"IF(E3=\"First Level\",\"A. Performance Rating (20 pts)\",IF(E3=\"Second Level\",\"A. Performance Rating (15 pts)\",\"A. Performance Rating (35 pts)\"))","v":"A. Performance Rating (35 pts)"},null,null,null,null,null,null,null,null,{"$f":"IF(E3=\"First Level\",\"B. Education (15 pts.)\",IF(E3=\"Second Level\",\"B. Education (10 pts.)\",\"B. Education (5 pts.)\"))","v":"B. Education (5 pts.)"}]
[null,null,"New Graduates (No previous work experience)",null,null,null,null,null,null,null,null,"Required:"]
[false,null,null,null,null,null,null,{"$f":"IF(F9>=2.75,1,IF(F9>=2.5,3,IF(F9>=2.25,5,IF(F9>=2,7,IF(F9>=1.75,9,IF(F9>=1.5,11,IF(F9>=1.25,13,IF(F9>=1,15))))))))","v":false},null,null,null,{"$f":"IF(Vacancy!E10=\"\",\"\",Vacancy!E10)","v":""}]
[]
[null,null,"GWA",null,null,null,{"$f":"IF(F9>=2.75,2,IF(F9>=2.5,5,IF(F9>=2.25,8,IF(F9>=2,11,IF(F9>=1.75,14,IF(F9>=1.5,16,IF(F9>=1.25,18,IF(F9>=1,20))))))))","v":false},{"$f":"IF(E3=\"First Level\",(20*F11)/5,IF(E3=\"Second Level\",(15*F11)/5,IF(E3=\"Executive/Managerial\",(35*F11)/5,\"\")))","v":""},null,null,null,"Highest Educational Attainment:",null,null,null,null,null,null,null,null,null,null,null,null,"Total Score:"]
[]
[null,null,"Last Rating Period",null,null,null,null,{"$f":"IFERROR(IF(AND(A7=TRUE,E3=\"First Level\"),G9,IF(AND(A7=TRUE,E3=\"Second Level\"),H7,H9)),\"\")","v":""},null,null,null,"First Level:",null,null,null,null,null,null,null,null,null,null,null,{"$f":"VLOOKUP(P11,Educ_2!$A$11:$B$26,2,FALSE)","v":{"$error":"#N/A"}},{"$f":"IFERROR(VLOOKUP($L$7,Educ_2!$A$1:$Q$8,X11+1,FALSE),\"\")","v":""}]
[]
[false,null,"Total Score",null,":",{"$f":"IF(H11=FALSE,0,H11)","v":""},"pts.",null,null,null,null,"Second Level:",null,null,null,null,null,null,null,null,null,null,null,{"$f":"VLOOKUP(P13,Educ_2!$A$11:$B$26,2,FALSE)","v":{"$error":"#N/A"}},{"$f":"IFERROR(VLOOKUP($L$7,Educ_2!$A$1:$Q$8,X13+1,FALSE),\"\")","v":""}]
[]
[null,null,null,null,null,null,null,null,null,null,null,"Executive/Managerial:",null,null,null,null,null,null,null,null,null,null,null,{"$f":"VLOOKUP(P15,Educ_2!$A$11:$B$26,2,FALSE)","v":{"$error":"#N/A"}},{"$f":"IFERROR(VLOOKUP($L$7,Educ_2!$A$1:$Q$8,X15+1,FALSE),\"\")","v":""}]
[]
[null,null,null,null,null,null,null,null,null,null,null,null,null,null,null,null,null,null,null,null,null,null,null,null,{"$f":"SUM(Y11,Y13,Y15)","v":0}]
[]
[null,null,"C. Training (10 pts.)",null,null,null,null,null,null,null,null,null,null,null,null,null,null,null,null,null,null,null,null,null,{"$f":"IF(E3=\"Executive/Managerial\",\"D. Experience (10 pts)\",\"D. Experience (25 pts)\")","v":"D. Experience (25 pts)"}]
[null,null,null,null,null,null,null,null,null,null,null,null,null,null,null,null,null,null,null,"Coversion to YEAR"]
[true,null,null,null,{"$f":"IF(Vacancy!$R$10=\"None required\",0,IF(Vacancy!$R$10=\"\",\"\",Vacancy!$R$10))","v":""},"Required (hrs.)",null,null,null,null,null,null,null,null,null,null,null,null,null,null,"Year",null,{"$f":"T21","v":0},null,null,{"$f":"IF(Vacancy!$AA$10=\"None required\",0,IF(Vacancy!$AA$10=\"\",\"\",Vacancy!$AA$10))","v":""},"Required Exp."]
[]
[null,null,null,{"$f":"E23-E21","v":{"$error":"#VALUE!"}},null,"Relevant training hrs. acquired",null,null,null,null,null,null,null,null,null,null,null,null,null,null,"Month",null,{"$f":"T23/12","v":0},null,{"$f":"Z23-Z21","v":{"$error":"#VALUE!"}},{"$f":"SUM(W21,W23,W25)","v":0},"Relevant years of experience"]
[]
[null,null,null,null,{"$f":"IF(N3=\"\",0,IFERROR(IF(E21=E23,5,IF(E23>=E21,((5*D23)/Trg_Exp!$D$2)+5,0)),0))","v":0},"Total",null,null,null,null,null,null,null,null,null,null,null,null,null,null,"Day",null,{"$f":"T25/365","v":0},null,{"$f":"IFERROR(IF(AND(Z21=Z23),10,IF(Vacancy!E6=\"Executive/Managerial\",((10*Y23)/Trg_Exp!$K$2),IF(Z23>=Z21,((15*Y23)/Trg_Exp!$K$2)+10,0))),0)","v":0},{"$f":"IF(N3=\"\",0,IF(Y25<0,0,Y25))","v":0},"Total Score:"]
[]
[null,null,{"$f":"IF(Vacancy!E6=\"Second Level\",\"E. Accomplishment (15 pts.)\",\"E. Accomplishment (10 pts.)\")","v":"E. Accomplishment (10 pts.)"}]
[]
[null,null,null,null,"E.1  Awards/Citations/Commendations"]
[]
[false,null,null,null,"E.1.1. Unit Level",null,null,null,null,{"$f":"IF(A31=TRUE,1,\"\")","v":""}]
[]
[false,null,null,null,"E.1.2. University Level",null,null,null,null,{"$f":"IF(A33=TRUE,3,\"\")","v":""}]
[]
[false,null,null,null,"E.1.3. National/CSC Level",null,null,null,null,{"$f":"IF(A35=TRUE,5,\"\")","v":""}]
[null,null,null,null,"E.2. Innovations/ Systems Improvement"]
[false,null,null,null,null,null,null,null,null,{"$f":"IF(A37=TRUE,IF(Vacancy!E6=\"Second Level\",4,3),\"\")","v":""}]
[null,null,null,null,null,null,null,null,null,null,{"$f":"IF(E3=\"Second Level\",((SUM(J31,J33,J35)*11)/9),((SUM(J31,J33,J35)*7)/9))","v":0}]
[]
[null,null,null,null,"C.2. Total Score:",null,null,null,null,{"$f":"IF(E3=\"Second Level\",(15*SUM(K38,J37)/15),(10*SUM(K38,J37)/10))","v":0}]
[]
[null,null,{"$f":"IF(E3=\"Executive/Managerial\",\"F. Physical Characteristics and Personality Traits (10 pts.)\",\"F. Physical Characteristics and Personality Traits (5 pts.)\")","v":"F. Physical Characteristics and Personality Traits (5 pts.)"}]
[]
[null,null,null,null,"Supervisor",null,"Co-worker 1",null,"Co-worker 2",null,"Co-worker 3",null,null,"Supervisor",null,"Co-worker 1",null,"Co-worker 2",null,"Co-worker 3",null,null,"Supervisor",null,"Co-worker 1",null,"Co-worker 2",null,"Co-worker 3"]
[null,null,null,null,"ATTITUDE",null,null,null,null,null,null,null,null,"COMMITMENT",null,null,null,null,null,null,null,null,"APPEARANCE"]
[null,null,null,"F.1.1. ",null,null,null,null,null,null,null,null,"F.2.1. ",null,null,null,null,null,null,null,null,"F.3.1. "]
[null,null,null,"F.1.2. ",null,null,null,null,null,null,null,null,"F.2.2. ",null,null,null,null,null,null,null,null,"F.3.2. "]
[null,null,null,"F.1.3. ",null,null,null,null,null,null,null,null,"F.2.3. "]
[null,null,null,null,{"$f":"IF($E$3=\"Executive/Managerial\",(4*(SUM(E46:F48)/12)),(2*(SUM(E46:F48)/12)))","v":0},null,{"$f":"IF($E$3=\"Executive/Managerial\",(4*(SUM(G46:H48)/12)),(2*(SUM(G46:H48)/12)))","v":0},null,{"$f":"IF($E$3=\"Executive/Managerial\",(4*(SUM(I46:J48)/12)),(2*(SUM(I46:J48)/12)))","v":0},null,{"$f":"IF($E$3=\"Executive/Managerial\",(4*(SUM(K46:L48)/12)),(2*(SUM(K46:L48)/12)))","v":0},null,null,{"$f":"IF($E$3=\"Executive/Managerial\",(4*(SUM(N46:O48)/12)),(2*(SUM(N46:O48)/12)))","v":0},null,{"$f":"IF($E$3=\"Executive/Managerial\",(4*(SUM(P46:Q48)/12)),(2*(SUM(P46:Q48)/12)))","v":0},null,{"$f":"IF($E$3=\"Executive/Managerial\",(4*(SUM(R46:S48)/12)),(2*(SUM(R46:S48)/12)))","v":0},null,{"$f":"IF($E$3=\"Executive/Managerial\",(4*(SUM(T46:U48)/12)),(2*(SUM(T46:U48)/12)))","v":0},null,null,{"$f":"IF($E$3=\"Executive/Managerial\",(2*(SUM(W46:X48))/8),(1*(SUM(W46:X48))/8))","v":0},null,{"$f":"IF($E$3=\"Executive/Managerial\",(2*(SUM(Y46:Z48))/8),(1*(SUM(Y46:Z48))/8))","v":0},null,{"$f":"IF($E$3=\"Executive/Managerial\",(2*(SUM(AA46:AB48))/8),(1*(SUM(AA46:AB48))/8))","v":0},null,{"$f":"IF($E$3=\"Executive/Managerial\",(2*(SUM(AC46:AD48))/8),(1*(SUM(AC46:AD48))/8))","v":0}]
[null,null,null,null,null,null,"Supervisor",null,"Co-worker"]
[null,null,null,null,"Attitude",null,{"$f":"E49","v":0},null,{"$f":"SUM(G49:L49)/3","v":0},null,null,null,null,"Total Score PCPT:",null,null,{"$f":"IF(E3=\"Executive/Managerial\",SUM(G54:J54),SUM(G54:J54))","v":0}]
[null,null,null,null,"Commitment",null,{"$f":"N49","v":0},null,{"$f":"SUM(P49:U49)/3","v":0}]
[null,null,null,null,"Appearance",null,{"$f":"W49","v":0},null,{"$f":"SUM(Y49:AD49)/3","v":0}]
[null,null,null,null,null,null,{"$f":"SUM(G51:G53)*0.6","v":0},null,{"$f":"SUM(I51:I53)*0.4","v":0}]
[null,null,{"$f":"IF(E3=\"First Level\",\"G. Potential [Assessment Form No. 2] (3 pts.)\",\"G. Potential [Assessment Form No. 2] (5 pts.)\")","v":"G. Potential [Assessment Form No. 2] (5 pts.)"}]
[]
[null,null,null,"INTERVIEW"]
[]
[null,null,null,null,"G.1.1. Sound judgement",null,null,null,null,null,null,{"$f":"IF($E$3=\"First Level\",\"Not Applicable for First Level position\",\"\")","v":""}]
[null,null,null,null,"G.1.2. Analytical mind",null,null,null,null,null,null,{"$f":"IF($E$3=\"First Level\",\"Not Applicable for First Level position\",\"\")","v":""}]
[null,null,null,null,"G.1.3. The ability to motivate co-workers",null,null,null,null,null,null,{"$f":"IF($E$3=\"First Level\",\"Not Applicable for First Level position\",\"\")","v":""}]
[null,null,null,null,"G.1.4. Unifying Factor",null,null,null,null,null,null,{"$f":"IF($E$3=\"First Level\",\"Not Applicable for First Level position\",\"\")","v":""}]
[null,null,null,null,"G.1.5. Vision/foresight",null,null,null,null,null,null,{"$f":"IF($E$3=\"First Level\",\"Not Applicable for First Level position\",\"\")","v":""}]
[null,null,null,null,"G.2. Resourcefulness"]
[null,null,null,null,"G.3. Creativity/ Ingenuity "]
[]
[null,null,null,"TOTAL POINTS FOR POTENTIAL",null,null,null,null,null,null,{"$f":"IF(E3=\"First Level\",(3*(SUM(K64:K65)/8)),(5*(SUM(K59:K65)/28)))","v":0}]
[]
[null,null,{"$f":"IF(E3=\"First Level\",\"H. Written/ Skills Examination (12 pts.)\",\"H. Written/ Skills Examination (15 pts.)\")","v":"H. Written/ Skills Examination (15 pts.)"}]
[null,null,null,null,null,null,null,null,null,null,{"$f":"IFERROR(SUM(K59:K65)/7,0)","v":0}]
[null,null,null,"WRITTEN/SKILLS EXAMINATION"]
[]
[null,null,null,null,"Perfect/Entire Score",null,null,"="]
[null,null,null,null,"Raw Score",null,null,"="]
[]
[]
[null,null,null,"TOTAL FOR EXAMINATION",null,null,null,null,null,null,{"$f":"IFERROR(IF(E3=\"First Level\",IF(K74>K73,0,(K74*12)/K73),IF(K74>K73,0,(K74*15)/K73)),0)","v":0}]
[]
[null,null,"I. Public Service"]
[]
[null,null,null,null,"Additional Pts. in excess of Total Score"]

{"sheet":"AP29","index":36,"n_rows":81,"n_cols":33,"rows_kept":81,"cut":false,"hidden":false,"merged":[[1,2,1,29],[2,4,2,9],[2,13,2,22],[2,27,2,30],[2,32,2,33],[45,4,45,5],[45,6,45,7],[45,8,45,9],[45,10,45,11],[45,13,45,14],[10,15,10,22],[12,15,12,22],[14,15,14,22],[19,19,19,22],[35,4,37,7],[45,28,45,29],[45,24,45,25],[45,26,45,27],[6,11,6,22],[46,4,46,5],[46,6,46,7],[46,8,46,9],[46,10,46,11],[46,13,46,14],[46,17,46,18],[46,19,46,20],[46,22,46,23],[45,15,45,16],[45,17,45,18],[45,19,45,20],[45,22,45,23],[46,24,46,25],[46,26,46,27],[46,28,46,29],[47,4,47,5],[47,6,47,7],[47,8,47,9],[47,10,47,11],[47,13,47,14],[47,15,47,16],[47,17,47,18],[47,19,47,20],[47,22,47,23],[47,24,47,25],[47,26,47,27],[47,28,47,29],[46,15,46,16],[48,4,48,5],[48,6,48,7],[48,8,48,9],[48,10,48,11],[48,13,48,14],[48,28,48,29],[50,16,50,17],[48,15,48,16],[48,17,48,18],[48,19,48,20],[48,22,48,23],[48,24,48,25],[48,26,48,27]]}
[]
[null,null,"MSP CALCULATOR"]
[null,null,"Levels",":",{"$f":"IF(Vacancy!E6=\"\",\"\",Vacancy!E6)","v":""},null,null,null,null,null,null,"Name",":",null,null,null,null,null,null,null,null,null,null,null,null,null,"Employment Category:",null,null,null,null,null,{"$f":"SUM(F13,Y11,Y13,Y15,E25,Z25,J40,Q51,K67,K77,D81)","v":0}]
[null,null,null,null,null,null,null,null,null,null,null,null,null,null,null,null,null,null,null,null,null,null,null,null,null,null,null,null,null,null,null,null,"TOTAL MATRIX POINTS"]
[null,null,{"$f":"IF(E3=\"First Level\",\"A. Performance Rating (20 pts)\",IF(E3=\"Second Level\",\"A. Performance Rating (15 pts)\",\"A. Performance Rating (35 pts)\"))","v":"A. Performance Rating (35 pts)"},null,null,null,null,null,null,null,null,{"$f":"IF(E3=\"First Level\",\"B. Education (15 pts.)\",IF(E3=\"Second Level\",\"B. Education (10 pts.)\",\"B. Education (5 pts.)\"))","v":"B. Education (5 pts.)"}]
[null,null,"New Graduates (No previous work experience)",null,null,null,null,null,null,null,null,"Required:"]
[false,null,null,null,null,null,null,{"$f":"IF(F9>=2.75,1,IF(F9>=2.5,3,IF(F9>=2.25,5,IF(F9>=2,7,IF(F9>=1.75,9,IF(F9>=1.5,11,IF(F9>=1.25,13,IF(F9>=1,15))))))))","v":false},null,null,null,{"$f":"IF(Vacancy!E10=\"\",\"\",Vacancy!E10)","v":""}]
[]
[null,null,"GWA",null,null,null,{"$f":"IF(F9>=2.75,2,IF(F9>=2.5,5,IF(F9>=2.25,8,IF(F9>=2,11,IF(F9>=1.75,14,IF(F9>=1.5,16,IF(F9>=1.25,18,IF(F9>=1,20))))))))","v":false},{"$f":"IF(E3=\"First Level\",(20*F11)/5,IF(E3=\"Second Level\",(15*F11)/5,IF(E3=\"Executive/Managerial\",(35*F11)/5,\"\")))","v":""},null,null,null,"Highest Educational Attainment:",null,null,null,null,null,null,null,null,null,null,null,null,"Total Score:"]
[]
[null,null,"Last Rating Period",null,null,null,null,{"$f":"IFERROR(IF(AND(A7=TRUE,E3=\"First Level\"),G9,IF(AND(A7=TRUE,E3=\"Second Level\"),H7,H9)),\"\")","v":""},null,null,null,"First Level:",null,null,null,null,null,null,null,null,null,null,null,{"$f":"VLOOKUP(P11,Educ_2!$A$11:$B$26,2,FALSE)","v":{"$error":"#N/A"}},{"$f":"IFERROR(VLOOKUP($L$7,Educ_2!$A$1:$Q$8,X11+1,FALSE),\"\")","v":""}]
[]
[false,null,"Total Score",null,":",{"$f":"IF(H11=FALSE,0,H11)","v":""},"pts.",null,null,null,null,"Second Level:",null,null,null,null,null,null,null,null,null,null,null,{"$f":"VLOOKUP(P13,Educ_2!$A$11:$B$26,2,FALSE)","v":{"$error":"#N/A"}},{"$f":"IFERROR(VLOOKUP($L$7,Educ_2!$A$1:$Q$8,X13+1,FALSE),\"\")","v":""}]
[]
[null,null,null,null,null,null,null,null,null,null,null,"Executive/Managerial:",null,null,null,null,null,null,null,null,null,null,null,{"$f":"VLOOKUP(P15,Educ_2!$A$11:$B$26,2,FALSE)","v":{"$error":"#N/A"}},{"$f":"IFERROR(VLOOKUP($L$7,Educ_2!$A$1:$Q$8,X15+1,FALSE),\"\")","v":""}]
[]
[null,null,null,null,null,null,null,null,null,null,null,null,null,null,null,null,null,null,null,null,null,null,null,null,{"$f":"SUM(Y11,Y13,Y15)","v":0}]
[]
[null,null,"C. Training (10 pts.)",null,null,null,null,null,null,null,null,null,null,null,null,null,null,null,null,null,null,null,null,null,{"$f":"IF(E3=\"Executive/Managerial\",\"D. Experience (10 pts)\",\"D. Experience (25 pts)\")","v":"D. Experience (25 pts)"}]
[null,null,null,null,null,null,null,null,null,null,null,null,null,null,null,null,null,null,null,"Coversion to YEAR"]
[true,null,null,null,{"$f":"IF(Vacancy!$R$10=\"None required\",0,IF(Vacancy!$R$10=\"\",\"\",Vacancy!$R$10))","v":""},"Required (hrs.)",null,null,null,null,null,null,null,null,null,null,null,null,null,null,"Year",null,{"$f":"T21","v":0},null,null,{"$f":"IF(Vacancy!$AA$10=\"None required\",0,IF(Vacancy!$AA$10=\"\",\"\",Vacancy!$AA$10))","v":""},"Required Exp."]
[]
[null,null,null,{"$f":"E23-E21","v":{"$error":"#VALUE!"}},null,"Relevant training hrs. acquired",null,null,null,null,null,null,null,null,null,null,null,null,null,null,"Month",null,{"$f":"T23/12","v":0},null,{"$f":"Z23-Z21","v":{"$error":"#VALUE!"}},{"$f":"SUM(W21,W23,W25)","v":0},"Relevant years of experience"]
[]
[null,null,null,null,{"$f":"IF(N3=\"\",0,IFERROR(IF(E21=E23,5,IF(E23>=E21,((5*D23)/Trg_Exp!$D$2)+5,0)),0))","v":0},"Total",null,null,null,null,null,null,null,null,null,null,null,null,null,null,"Day",null,{"$f":"T25/365","v":0},null,{"$f":"IFERROR(IF(AND(Z21=Z23),10,IF(Vacancy!E6=\"Executive/Managerial\",((10*Y23)/Trg_Exp!$K$2),IF(Z23>=Z21,((15*Y23)/Trg_Exp!$K$2)+10,0))),0)","v":0},{"$f":"IF(N3=\"\",0,IF(Y25<0,0,Y25))","v":0},"Total Score:"]
[]
[null,null,{"$f":"IF(Vacancy!E6=\"Second Level\",\"E. Accomplishment (15 pts.)\",\"E. Accomplishment (10 pts.)\")","v":"E. Accomplishment (10 pts.)"}]
[]
[null,null,null,null,"E.1  Awards/Citations/Commendations"]
[]
[false,null,null,null,"E.1.1. Unit Level",null,null,null,null,{"$f":"IF(A31=TRUE,1,\"\")","v":""}]
[]
[false,null,null,null,"E.1.2. University Level",null,null,null,null,{"$f":"IF(A33=TRUE,3,\"\")","v":""}]
[]
[false,null,null,null,"E.1.3. National/CSC Level",null,null,null,null,{"$f":"IF(A35=TRUE,5,\"\")","v":""}]
[null,null,null,null,"E.2. Innovations/ Systems Improvement"]
[false,null,null,null,null,null,null,null,null,{"$f":"IF(A37=TRUE,IF(Vacancy!E6=\"Second Level\",4,3),\"\")","v":""}]
[null,null,null,null,null,null,null,null,null,null,{"$f":"IF(E3=\"Second Level\",((SUM(J31,J33,J35)*11)/9),((SUM(J31,J33,J35)*7)/9))","v":0}]
[]
[null,null,null,null,"C.2. Total Score:",null,null,null,null,{"$f":"IF(E3=\"Second Level\",(15*SUM(K38,J37)/15),(10*SUM(K38,J37)/10))","v":0}]
[]
[null,null,{"$f":"IF(E3=\"Executive/Managerial\",\"F. Physical Characteristics and Personality Traits (10 pts.)\",\"F. Physical Characteristics and Personality Traits (5 pts.)\")","v":"F. Physical Characteristics and Personality Traits (5 pts.)"}]
[]
[null,null,null,null,"Supervisor",null,"Co-worker 1",null,"Co-worker 2",null,"Co-worker 3",null,null,"Supervisor",null,"Co-worker 1",null,"Co-worker 2",null,"Co-worker 3",null,null,"Supervisor",null,"Co-worker 1",null,"Co-worker 2",null,"Co-worker 3"]
[null,null,null,null,"ATTITUDE",null,null,null,null,null,null,null,null,"COMMITMENT",null,null,null,null,null,null,null,null,"APPEARANCE"]
[null,null,null,"F.1.1. ",null,null,null,null,null,null,null,null,"F.2.1. ",null,null,null,null,null,null,null,null,"F.3.1. "]
[null,null,null,"F.1.2. ",null,null,null,null,null,null,null,null,"F.2.2. ",null,null,null,null,null,null,null,null,"F.3.2. "]
[null,null,null,"F.1.3. ",null,null,null,null,null,null,null,null,"F.2.3. "]
[null,null,null,null,{"$f":"IF($E$3=\"Executive/Managerial\",(4*(SUM(E46:F48)/12)),(2*(SUM(E46:F48)/12)))","v":0},null,{"$f":"IF($E$3=\"Executive/Managerial\",(4*(SUM(G46:H48)/12)),(2*(SUM(G46:H48)/12)))","v":0},null,{"$f":"IF($E$3=\"Executive/Managerial\",(4*(SUM(I46:J48)/12)),(2*(SUM(I46:J48)/12)))","v":0},null,{"$f":"IF($E$3=\"Executive/Managerial\",(4*(SUM(K46:L48)/12)),(2*(SUM(K46:L48)/12)))","v":0},null,null,{"$f":"IF($E$3=\"Executive/Managerial\",(4*(SUM(N46:O48)/12)),(2*(SUM(N46:O48)/12)))","v":0},null,{"$f":"IF($E$3=\"Executive/Managerial\",(4*(SUM(P46:Q48)/12)),(2*(SUM(P46:Q48)/12)))","v":0},null,{"$f":"IF($E$3=\"Executive/Managerial\",(4*(SUM(R46:S48)/12)),(2*(SUM(R46:S48)/12)))","v":0},null,{"$f":"IF($E$3=\"Executive/Managerial\",(4*(SUM(T46:U48)/12)),(2*(SUM(T46:U48)/12)))","v":0},null,null,{"$f":"IF($E$3=\"Executive/Managerial\",(2*(SUM(W46:X48))/8),(1*(SUM(W46:X48))/8))","v":0},null,{"$f":"IF($E$3=\"Executive/Managerial\",(2*(SUM(Y46:Z48))/8),(1*(SUM(Y46:Z48))/8))","v":0},null,{"$f":"IF($E$3=\"Executive/Managerial\",(2*(SUM(AA46:AB48))/8),(1*(SUM(AA46:AB48))/8))","v":0},null,{"$f":"IF($E$3=\"Executive/Managerial\",(2*(SUM(AC46:AD48))/8),(1*(SUM(AC46:AD48))/8))","v":0}]
[null,null,null,null,null,null,"Supervisor",null,"Co-worker"]
[null,null,null,null,"Attitude",null,{"$f":"E49","v":0},null,{"$f":"SUM(G49:L49)/3","v":0},null,null,null,null,"Total Score PCPT:",null,null,{"$f":"IF(E3=\"Executive/Managerial\",SUM(G54:J54),SUM(G54:J54))","v":0}]
[null,null,null,null,"Commitment",null,{"$f":"N49","v":0},null,{"$f":"SUM(P49:U49)/3","v":0}]
[null,null,null,null,"Appearance",null,{"$f":"W49","v":0},null,{"$f":"SUM(Y49:AD49)/3","v":0}]
[null,null,null,null,null,null,{"$f":"SUM(G51:G53)*0.6","v":0},null,{"$f":"SUM(I51:I53)*0.4","v":0}]
[null,null,{"$f":"IF(E3=\"First Level\",\"G. Potential [Assessment Form No. 2] (3 pts.)\",\"G. Potential [Assessment Form No. 2] (5 pts.)\")","v":"G. Potential [Assessment Form No. 2] (5 pts.)"}]
[]
[null,null,null,"INTERVIEW"]
[]
[null,null,null,null,"G.1.1. Sound judgement",null,null,null,null,null,null,{"$f":"IF($E$3=\"First Level\",\"Not Applicable for First Level position\",\"\")","v":""}]
[null,null,null,null,"G.1.2. Analytical mind",null,null,null,null,null,null,{"$f":"IF($E$3=\"First Level\",\"Not Applicable for First Level position\",\"\")","v":""}]
[null,null,null,null,"G.1.3. The ability to motivate co-workers",null,null,null,null,null,null,{"$f":"IF($E$3=\"First Level\",\"Not Applicable for First Level position\",\"\")","v":""}]
[null,null,null,null,"G.1.4. Unifying Factor",null,null,null,null,null,null,{"$f":"IF($E$3=\"First Level\",\"Not Applicable for First Level position\",\"\")","v":""}]
[null,null,null,null,"G.1.5. Vision/foresight",null,null,null,null,null,null,{"$f":"IF($E$3=\"First Level\",\"Not Applicable for First Level position\",\"\")","v":""}]
[null,null,null,null,"G.2. Resourcefulness"]
[null,null,null,null,"G.3. Creativity/ Ingenuity "]
[]
[null,null,null,"TOTAL POINTS FOR POTENTIAL",null,null,null,null,null,null,{"$f":"IF(E3=\"First Level\",(3*(SUM(K64:K65)/8)),(5*(SUM(K59:K65)/28)))","v":0}]
[]
[null,null,{"$f":"IF(E3=\"First Level\",\"H. Written/ Skills Examination (12 pts.)\",\"H. Written/ Skills Examination (15 pts.)\")","v":"H. Written/ Skills Examination (15 pts.)"}]
[null,null,null,null,null,null,null,null,null,null,{"$f":"IFERROR(SUM(K59:K65)/7,0)","v":0}]
[null,null,null,"WRITTEN/SKILLS EXAMINATION"]
[]
[null,null,null,null,"Perfect/Entire Score",null,null,"="]
[null,null,null,null,"Raw Score",null,null,"="]
[]
[]
[null,null,null,"TOTAL FOR EXAMINATION",null,null,null,null,null,null,{"$f":"IFERROR(IF(E3=\"First Level\",IF(K74>K73,0,(K74*12)/K73),IF(K74>K73,0,(K74*15)/K73)),0)","v":0}]
[]
[null,null,"I. Public Service"]
[]
[null,null,null,null,"Additional Pts. in excess of Total Score"]

{"sheet":"AP30","index":37,"n_rows":81,"n_cols":33,"rows_kept":81,"cut":false,"hidden":false,"merged":[[1,2,1,29],[2,4,2,9],[2,13,2,22],[2,27,2,30],[2,32,2,33],[45,4,45,5],[45,6,45,7],[45,8,45,9],[45,10,45,11],[45,13,45,14],[10,15,10,22],[12,15,12,22],[14,15,14,22],[19,19,19,22],[35,4,37,7],[45,28,45,29],[45,24,45,25],[45,26,45,27],[6,11,6,22],[46,4,46,5],[46,6,46,7],[46,8,46,9],[46,10,46,11],[46,13,46,14],[46,17,46,18],[46,19,46,20],[46,22,46,23],[45,15,45,16],[45,17,45,18],[45,19,45,20],[45,22,45,23],[46,24,46,25],[46,26,46,27],[46,28,46,29],[47,4,47,5],[47,6,47,7],[47,8,47,9],[47,10,47,11],[47,13,47,14],[47,15,47,16],[47,17,47,18],[47,19,47,20],[47,22,47,23],[47,24,47,25],[47,26,47,27],[47,28,47,29],[46,15,46,16],[48,4,48,5],[48,6,48,7],[48,8,48,9],[48,10,48,11],[48,13,48,14],[48,28,48,29],[50,16,50,17],[48,15,48,16],[48,17,48,18],[48,19,48,20],[48,22,48,23],[48,24,48,25],[48,26,48,27]]}
[]
[null,null,"MSP CALCULATOR"]
[null,null,"Levels",":",{"$f":"IF(Vacancy!E6=\"\",\"\",Vacancy!E6)","v":""},null,null,null,null,null,null,"Name",":",null,null,null,null,null,null,null,null,null,null,null,null,null,"Employment Category:",null,null,null,null,null,{"$f":"SUM(F13,Y11,Y13,Y15,E25,Z25,J40,Q51,K67,K77,D81)","v":0}]
[null,null,null,null,null,null,null,null,null,null,null,null,null,null,null,null,null,null,null,null,null,null,null,null,null,null,null,null,null,null,null,null,"TOTAL MATRIX POINTS"]
[null,null,{"$f":"IF(E3=\"First Level\",\"A. Performance Rating (20 pts)\",IF(E3=\"Second Level\",\"A. Performance Rating (15 pts)\",\"A. Performance Rating (35 pts)\"))","v":"A. Performance Rating (35 pts)"},null,null,null,null,null,null,null,null,{"$f":"IF(E3=\"First Level\",\"B. Education (15 pts.)\",IF(E3=\"Second Level\",\"B. Education (10 pts.)\",\"B. Education (5 pts.)\"))","v":"B. Education (5 pts.)"}]
[null,null,"New Graduates (No previous work experience)",null,null,null,null,null,null,null,null,"Required:"]
[false,null,null,null,null,null,null,{"$f":"IF(F9>=2.75,1,IF(F9>=2.5,3,IF(F9>=2.25,5,IF(F9>=2,7,IF(F9>=1.75,9,IF(F9>=1.5,11,IF(F9>=1.25,13,IF(F9>=1,15))))))))","v":false},null,null,null,{"$f":"IF(Vacancy!E10=\"\",\"\",Vacancy!E10)","v":""}]
[]
[null,null,"GWA",null,null,null,{"$f":"IF(F9>=2.75,2,IF(F9>=2.5,5,IF(F9>=2.25,8,IF(F9>=2,11,IF(F9>=1.75,14,IF(F9>=1.5,16,IF(F9>=1.25,18,IF(F9>=1,20))))))))","v":false},{"$f":"IF(E3=\"First Level\",(20*F11)/5,IF(E3=\"Second Level\",(15*F11)/5,IF(E3=\"Executive/Managerial\",(35*F11)/5,\"\")))","v":""},null,null,null,"Highest Educational Attainment:",null,null,null,null,null,null,null,null,null,null,null,null,"Total Score:"]
[]
[null,null,"Last Rating Period",null,null,null,null,{"$f":"IFERROR(IF(AND(A7=TRUE,E3=\"First Level\"),G9,IF(AND(A7=TRUE,E3=\"Second Level\"),H7,H9)),\"\")","v":""},null,null,null,"First Level:",null,null,null,null,null,null,null,null,null,null,null,{"$f":"VLOOKUP(P11,Educ_2!$A$11:$B$26,2,FALSE)","v":{"$error":"#N/A"}},{"$f":"IFERROR(VLOOKUP($L$7,Educ_2!$A$1:$Q$8,X11+1,FALSE),\"\")","v":""}]
[]
[false,null,"Total Score",null,":",{"$f":"IF(H11=FALSE,0,H11)","v":""},"pts.",null,null,null,null,"Second Level:",null,null,null,null,null,null,null,null,null,null,null,{"$f":"VLOOKUP(P13,Educ_2!$A$11:$B$26,2,FALSE)","v":{"$error":"#N/A"}},{"$f":"IFERROR(VLOOKUP($L$7,Educ_2!$A$1:$Q$8,X13+1,FALSE),\"\")","v":""}]
[]
[null,null,null,null,null,null,null,null,null,null,null,"Executive/Managerial:",null,null,null,null,null,null,null,null,null,null,null,{"$f":"VLOOKUP(P15,Educ_2!$A$11:$B$26,2,FALSE)","v":{"$error":"#N/A"}},{"$f":"IFERROR(VLOOKUP($L$7,Educ_2!$A$1:$Q$8,X15+1,FALSE),\"\")","v":""}]
[]
[null,null,null,null,null,null,null,null,null,null,null,null,null,null,null,null,null,null,null,null,null,null,null,null,{"$f":"SUM(Y11,Y13,Y15)","v":0}]
[]
[null,null,"C. Training (10 pts.)",null,null,null,null,null,null,null,null,null,null,null,null,null,null,null,null,null,null,null,null,null,{"$f":"IF(E3=\"Executive/Managerial\",\"D. Experience (10 pts)\",\"D. Experience (25 pts)\")","v":"D. Experience (25 pts)"}]
[null,null,null,null,null,null,null,null,null,null,null,null,null,null,null,null,null,null,null,"Coversion to YEAR"]
[true,null,null,null,{"$f":"IF(Vacancy!$R$10=\"None required\",0,IF(Vacancy!$R$10=\"\",\"\",Vacancy!$R$10))","v":""},"Required (hrs.)",null,null,null,null,null,null,null,null,null,null,null,null,null,null,"Year",null,{"$f":"T21","v":0},null,null,{"$f":"IF(Vacancy!$AA$10=\"None required\",0,IF(Vacancy!$AA$10=\"\",\"\",Vacancy!$AA$10))","v":""},"Required Exp."]
[]
[null,null,null,{"$f":"E23-E21","v":{"$error":"#VALUE!"}},null,"Relevant training hrs. acquired",null,null,null,null,null,null,null,null,null,null,null,null,null,null,"Month",null,{"$f":"T23/12","v":0},null,{"$f":"Z23-Z21","v":{"$error":"#VALUE!"}},{"$f":"SUM(W21,W23,W25)","v":0},"Relevant years of experience"]
[]
[null,null,null,null,{"$f":"IF(N3=\"\",0,IFERROR(IF(E21=E23,5,IF(E23>=E21,((5*D23)/Trg_Exp!$D$2)+5,0)),0))","v":0},"Total",null,null,null,null,null,null,null,null,null,null,null,null,null,null,"Day",null,{"$f":"T25/365","v":0},null,{"$f":"IFERROR(IF(AND(Z21=Z23),10,IF(Vacancy!E6=\"Executive/Managerial\",((10*Y23)/Trg_Exp!$K$2),IF(Z23>=Z21,((15*Y23)/Trg_Exp!$K$2)+10,0))),0)","v":0},{"$f":"IF(N3=\"\",0,IF(Y25<0,0,Y25))","v":0},"Total Score:"]
[]
[null,null,{"$f":"IF(Vacancy!E6=\"Second Level\",\"E. Accomplishment (15 pts.)\",\"E. Accomplishment (10 pts.)\")","v":"E. Accomplishment (10 pts.)"}]
[]
[null,null,null,null,"E.1  Awards/Citations/Commendations"]
[]
[false,null,null,null,"E.1.1. Unit Level",null,null,null,null,{"$f":"IF(A31=TRUE,1,\"\")","v":""}]
[]
[false,null,null,null,"E.1.2. University Level",null,null,null,null,{"$f":"IF(A33=TRUE,3,\"\")","v":""}]
[]
[false,null,null,null,"E.1.3. National/CSC Level",null,null,null,null,{"$f":"IF(A35=TRUE,5,\"\")","v":""}]
[null,null,null,null,"E.2. Innovations/ Systems Improvement"]
[false,null,null,null,null,null,null,null,null,{"$f":"IF(A37=TRUE,IF(Vacancy!E6=\"Second Level\",4,3),\"\")","v":""}]
[null,null,null,null,null,null,null,null,null,null,{"$f":"IF(E3=\"Second Level\",((SUM(J31,J33,J35)*11)/9),((SUM(J31,J33,J35)*7)/9))","v":0}]
[]
[null,null,null,null,"C.2. Total Score:",null,null,null,null,{"$f":"IF(E3=\"Second Level\",(15*SUM(K38,J37)/15),(10*SUM(K38,J37)/10))","v":0}]
[]
[null,null,{"$f":"IF(E3=\"Executive/Managerial\",\"F. Physical Characteristics and Personality Traits (10 pts.)\",\"F. Physical Characteristics and Personality Traits (5 pts.)\")","v":"F. Physical Characteristics and Personality Traits (5 pts.)"}]
[]
[null,null,null,null,"Supervisor",null,"Co-worker 1",null,"Co-worker 2",null,"Co-worker 3",null,null,"Supervisor",null,"Co-worker 1",null,"Co-worker 2",null,"Co-worker 3",null,null,"Supervisor",null,"Co-worker 1",null,"Co-worker 2",null,"Co-worker 3"]
[null,null,null,null,"ATTITUDE",null,null,null,null,null,null,null,null,"COMMITMENT",null,null,null,null,null,null,null,null,"APPEARANCE"]
[null,null,null,"F.1.1. ",null,null,null,null,null,null,null,null,"F.2.1. ",null,null,null,null,null,null,null,null,"F.3.1. "]
[null,null,null,"F.1.2. ",null,null,null,null,null,null,null,null,"F.2.2. ",null,null,null,null,null,null,null,null,"F.3.2. "]
[null,null,null,"F.1.3. ",null,null,null,null,null,null,null,null,"F.2.3. "]
[null,null,null,null,{"$f":"IF($E$3=\"Executive/Managerial\",(4*(SUM(E46:F48)/12)),(2*(SUM(E46:F48)/12)))","v":0},null,{"$f":"IF($E$3=\"Executive/Managerial\",(4*(SUM(G46:H48)/12)),(2*(SUM(G46:H48)/12)))","v":0},null,{"$f":"IF($E$3=\"Executive/Managerial\",(4*(SUM(I46:J48)/12)),(2*(SUM(I46:J48)/12)))","v":0},null,{"$f":"IF($E$3=\"Executive/Managerial\",(4*(SUM(K46:L48)/12)),(2*(SUM(K46:L48)/12)))","v":0},null,null,{"$f":"IF($E$3=\"Executive/Managerial\",(4*(SUM(N46:O48)/12)),(2*(SUM(N46:O48)/12)))","v":0},null,{"$f":"IF($E$3=\"Executive/Managerial\",(4*(SUM(P46:Q48)/12)),(2*(SUM(P46:Q48)/12)))","v":0},null,{"$f":"IF($E$3=\"Executive/Managerial\",(4*(SUM(R46:S48)/12)),(2*(SUM(R46:S48)/12)))","v":0},null,{"$f":"IF($E$3=\"Executive/Managerial\",(4*(SUM(T46:U48)/12)),(2*(SUM(T46:U48)/12)))","v":0},null,null,{"$f":"IF($E$3=\"Executive/Managerial\",(2*(SUM(W46:X48))/8),(1*(SUM(W46:X48))/8))","v":0},null,{"$f":"IF($E$3=\"Executive/Managerial\",(2*(SUM(Y46:Z48))/8),(1*(SUM(Y46:Z48))/8))","v":0},null,{"$f":"IF($E$3=\"Executive/Managerial\",(2*(SUM(AA46:AB48))/8),(1*(SUM(AA46:AB48))/8))","v":0},null,{"$f":"IF($E$3=\"Executive/Managerial\",(2*(SUM(AC46:AD48))/8),(1*(SUM(AC46:AD48))/8))","v":0}]
[null,null,null,null,null,null,"Supervisor",null,"Co-worker"]
[null,null,null,null,"Attitude",null,{"$f":"E49","v":0},null,{"$f":"SUM(G49:L49)/3","v":0},null,null,null,null,"Total Score PCPT:",null,null,{"$f":"IF(E3=\"Executive/Managerial\",SUM(G54:J54),SUM(G54:J54))","v":0}]
[null,null,null,null,"Commitment",null,{"$f":"N49","v":0},null,{"$f":"SUM(P49:U49)/3","v":0}]
[null,null,null,null,"Appearance",null,{"$f":"W49","v":0},null,{"$f":"SUM(Y49:AD49)/3","v":0}]
[null,null,null,null,null,null,{"$f":"SUM(G51:G53)*0.6","v":0},null,{"$f":"SUM(I51:I53)*0.4","v":0}]
[null,null,{"$f":"IF(E3=\"First Level\",\"G. Potential [Assessment Form No. 2] (3 pts.)\",\"G. Potential [Assessment Form No. 2] (5 pts.)\")","v":"G. Potential [Assessment Form No. 2] (5 pts.)"}]
[]
[null,null,null,"INTERVIEW"]
[]
[null,null,null,null,"G.1.1. Sound judgement",null,null,null,null,null,null,{"$f":"IF($E$3=\"First Level\",\"Not Applicable for First Level position\",\"\")","v":""}]
[null,null,null,null,"G.1.2. Analytical mind",null,null,null,null,null,null,{"$f":"IF($E$3=\"First Level\",\"Not Applicable for First Level position\",\"\")","v":""}]
[null,null,null,null,"G.1.3. The ability to motivate co-workers",null,null,null,null,null,null,{"$f":"IF($E$3=\"First Level\",\"Not Applicable for First Level position\",\"\")","v":""}]
[null,null,null,null,"G.1.4. Unifying Factor",null,null,null,null,null,null,{"$f":"IF($E$3=\"First Level\",\"Not Applicable for First Level position\",\"\")","v":""}]
[null,null,null,null,"G.1.5. Vision/foresight",null,null,null,null,null,null,{"$f":"IF($E$3=\"First Level\",\"Not Applicable for First Level position\",\"\")","v":""}]
[null,null,null,null,"G.2. Resourcefulness"]
[null,null,null,null,"G.3. Creativity/ Ingenuity "]
[]
[null,null,null,"TOTAL POINTS FOR POTENTIAL",null,null,null,null,null,null,{"$f":"IF(E3=\"First Level\",(3*(SUM(K64:K65)/8)),(5*(SUM(K59:K65)/28)))","v":0}]
[]
[null,null,{"$f":"IF(E3=\"First Level\",\"H. Written/ Skills Examination (12 pts.)\",\"H. Written/ Skills Examination (15 pts.)\")","v":"H. Written/ Skills Examination (15 pts.)"}]
[null,null,null,null,null,null,null,null,null,null,{"$f":"IFERROR(SUM(K59:K65)/7,0)","v":0}]
[null,null,null,"WRITTEN/SKILLS EXAMINATION"]
[]
[null,null,null,null,"Perfect/Entire Score",null,null,"="]
[null,null,null,null,"Raw Score",null,null,"="]
[]
[]
[null,null,null,"TOTAL FOR EXAMINATION",null,null,null,null,null,null,{"$f":"IFERROR(IF(E3=\"First Level\",IF(K74>K73,0,(K74*12)/K73),IF(K74>K73,0,(K74*15)/K73)),0)","v":0}]
[]
[null,null,"I. Public Service"]
[]
[null,null,null,null,"Additional Pts. in excess of Total Score"]

{"sheet":"AP31","index":38,"n_rows":81,"n_cols":33,"rows_kept":81,"cut":false,"hidden":false,"merged":[[1,2,1,29],[2,4,2,9],[2,13,2,22],[2,27,2,30],[2,32,2,33],[45,4,45,5],[45,6,45,7],[45,8,45,9],[45,10,45,11],[45,13,45,14],[10,15,10,22],[12,15,12,22],[14,15,14,22],[19,19,19,22],[35,4,37,7],[45,28,45,29],[45,24,45,25],[45,26,45,27],[6,11,6,22],[46,4,46,5],[46,6,46,7],[46,8,46,9],[46,10,46,11],[46,13,46,14],[46,17,46,18],[46,19,46,20],[46,22,46,23],[45,15,45,16],[45,17,45,18],[45,19,45,20],[45,22,45,23],[46,24,46,25],[46,26,46,27],[46,28,46,29],[47,4,47,5],[47,6,47,7],[47,8,47,9],[47,10,47,11],[47,13,47,14],[47,15,47,16],[47,17,47,18],[47,19,47,20],[47,22,47,23],[47,24,47,25],[47,26,47,27],[47,28,47,29],[46,15,46,16],[48,4,48,5],[48,6,48,7],[48,8,48,9],[48,10,48,11],[48,13,48,14],[48,28,48,29],[50,16,50,17],[48,15,48,16],[48,17,48,18],[48,19,48,20],[48,22,48,23],[48,24,48,25],[48,26,48,27]]}
[]
[null,null,"MSP CALCULATOR"]
[null,null,"Levels",":",{"$f":"IF(Vacancy!E6=\"\",\"\",Vacancy!E6)","v":""},null,null,null,null,null,null,"Name",":",null,null,null,null,null,null,null,null,null,null,null,null,null,"Employment Category:",null,null,null,null,null,{"$f":"SUM(F13,Y11,Y13,Y15,E25,Z25,J40,Q51,K67,K77,D81)","v":0}]
[null,null,null,null,null,null,null,null,null,null,null,null,null,null,null,null,null,null,null,null,null,null,null,null,null,null,null,null,null,null,null,null,"TOTAL MATRIX POINTS"]
[null,null,{"$f":"IF(E3=\"First Level\",\"A. Performance Rating (20 pts)\",IF(E3=\"Second Level\",\"A. Performance Rating (15 pts)\",\"A. Performance Rating (35 pts)\"))","v":"A. Performance Rating (35 pts)"},null,null,null,null,null,null,null,null,{"$f":"IF(E3=\"First Level\",\"B. Education (15 pts.)\",IF(E3=\"Second Level\",\"B. Education (10 pts.)\",\"B. Education (5 pts.)\"))","v":"B. Education (5 pts.)"}]
[null,null,"New Graduates (No previous work experience)",null,null,null,null,null,null,null,null,"Required:"]
[false,null,null,null,null,null,null,{"$f":"IF(F9>=2.75,1,IF(F9>=2.5,3,IF(F9>=2.25,5,IF(F9>=2,7,IF(F9>=1.75,9,IF(F9>=1.5,11,IF(F9>=1.25,13,IF(F9>=1,15))))))))","v":false},null,null,null,{"$f":"IF(Vacancy!E10=\"\",\"\",Vacancy!E10)","v":""}]
[]
[null,null,"GWA",null,null,null,{"$f":"IF(F9>=2.75,2,IF(F9>=2.5,5,IF(F9>=2.25,8,IF(F9>=2,11,IF(F9>=1.75,14,IF(F9>=1.5,16,IF(F9>=1.25,18,IF(F9>=1,20))))))))","v":false},{"$f":"IF(E3=\"First Level\",(20*F11)/5,IF(E3=\"Second Level\",(15*F11)/5,IF(E3=\"Executive/Managerial\",(35*F11)/5,\"\")))","v":""},null,null,null,"Highest Educational Attainment:",null,null,null,null,null,null,null,null,null,null,null,null,"Total Score:"]
[]
[null,null,"Last Rating Period",null,null,null,null,{"$f":"IFERROR(IF(AND(A7=TRUE,E3=\"First Level\"),G9,IF(AND(A7=TRUE,E3=\"Second Level\"),H7,H9)),\"\")","v":""},null,null,null,"First Level:",null,null,null,null,null,null,null,null,null,null,null,{"$f":"VLOOKUP(P11,Educ_2!$A$11:$B$26,2,FALSE)","v":{"$error":"#N/A"}},{"$f":"IFERROR(VLOOKUP($L$7,Educ_2!$A$1:$Q$8,X11+1,FALSE),\"\")","v":""}]
[]
[false,null,"Total Score",null,":",{"$f":"IF(H11=FALSE,0,H11)","v":""},"pts.",null,null,null,null,"Second Level:",null,null,null,null,null,null,null,null,null,null,null,{"$f":"VLOOKUP(P13,Educ_2!$A$11:$B$26,2,FALSE)","v":{"$error":"#N/A"}},{"$f":"IFERROR(VLOOKUP($L$7,Educ_2!$A$1:$Q$8,X13+1,FALSE),\"\")","v":""}]
[]
[null,null,null,null,null,null,null,null,null,null,null,"Executive/Managerial:",null,null,null,null,null,null,null,null,null,null,null,{"$f":"VLOOKUP(P15,Educ_2!$A$11:$B$26,2,FALSE)","v":{"$error":"#N/A"}},{"$f":"IFERROR(VLOOKUP($L$7,Educ_2!$A$1:$Q$8,X15+1,FALSE),\"\")","v":""}]
[]
[null,null,null,null,null,null,null,null,null,null,null,null,null,null,null,null,null,null,null,null,null,null,null,null,{"$f":"SUM(Y11,Y13,Y15)","v":0}]
[]
[null,null,"C. Training (10 pts.)",null,null,null,null,null,null,null,null,null,null,null,null,null,null,null,null,null,null,null,null,null,{"$f":"IF(E3=\"Executive/Managerial\",\"D. Experience (10 pts)\",\"D. Experience (25 pts)\")","v":"D. Experience (25 pts)"}]
[null,null,null,null,null,null,null,null,null,null,null,null,null,null,null,null,null,null,null,"Coversion to YEAR"]
[true,null,null,null,{"$f":"IF(Vacancy!$R$10=\"None required\",0,IF(Vacancy!$R$10=\"\",\"\",Vacancy!$R$10))","v":""},"Required (hrs.)",null,null,null,null,null,null,null,null,null,null,null,null,null,null,"Year",null,{"$f":"T21","v":0},null,null,{"$f":"IF(Vacancy!$AA$10=\"None required\",0,IF(Vacancy!$AA$10=\"\",\"\",Vacancy!$AA$10))","v":""},"Required Exp."]
[]
[null,null,null,{"$f":"E23-E21","v":{"$error":"#VALUE!"}},null,"Relevant training hrs. acquired",null,null,null,null,null,null,null,null,null,null,null,null,null,null,"Month",null,{"$f":"T23/12","v":0},null,{"$f":"Z23-Z21","v":{"$error":"#VALUE!"}},{"$f":"SUM(W21,W23,W25)","v":0},"Relevant years of experience"]
[]
[null,null,null,null,{"$f":"IF(N3=\"\",0,IFERROR(IF(E21=E23,5,IF(E23>=E21,((5*D23)/Trg_Exp!$D$2)+5,0)),0))","v":0},"Total",null,null,null,null,null,null,null,null,null,null,null,null,null,null,"Day",null,{"$f":"T25/365","v":0},null,{"$f":"IFERROR(IF(AND(Z21=Z23),10,IF(Vacancy!E6=\"Executive/Managerial\",((10*Y23)/Trg_Exp!$K$2),IF(Z23>=Z21,((15*Y23)/Trg_Exp!$K$2)+10,0))),0)","v":0},{"$f":"IF(N3=\"\",0,IF(Y25<0,0,Y25))","v":0},"Total Score:"]
[]
[null,null,{"$f":"IF(Vacancy!E6=\"Second Level\",\"E. Accomplishment (15 pts.)\",\"E. Accomplishment (10 pts.)\")","v":"E. Accomplishment (10 pts.)"}]
[]
[null,null,null,null,"E.1  Awards/Citations/Commendations"]
[]
[false,null,null,null,"E.1.1. Unit Level",null,null,null,null,{"$f":"IF(A31=TRUE,1,\"\")","v":""}]
[]
[false,null,null,null,"E.1.2. University Level",null,null,null,null,{"$f":"IF(A33=TRUE,3,\"\")","v":""}]
[]
[false,null,null,null,"E.1.3. National/CSC Level",null,null,null,null,{"$f":"IF(A35=TRUE,5,\"\")","v":""}]
[null,null,null,null,"E.2. Innovations/ Systems Improvement"]
[false,null,null,null,null,null,null,null,null,{"$f":"IF(A37=TRUE,IF(Vacancy!E6=\"Second Level\",4,3),\"\")","v":""}]
[null,null,null,null,null,null,null,null,null,null,{"$f":"IF(E3=\"Second Level\",((SUM(J31,J33,J35)*11)/9),((SUM(J31,J33,J35)*7)/9))","v":0}]
[]
[null,null,null,null,"C.2. Total Score:",null,null,null,null,{"$f":"IF(E3=\"Second Level\",(15*SUM(K38,J37)/15),(10*SUM(K38,J37)/10))","v":0}]
[]
[null,null,{"$f":"IF(E3=\"Executive/Managerial\",\"F. Physical Characteristics and Personality Traits (10 pts.)\",\"F. Physical Characteristics and Personality Traits (5 pts.)\")","v":"F. Physical Characteristics and Personality Traits (5 pts.)"}]
[]
[null,null,null,null,"Supervisor",null,"Co-worker 1",null,"Co-worker 2",null,"Co-worker 3",null,null,"Supervisor",null,"Co-worker 1",null,"Co-worker 2",null,"Co-worker 3",null,null,"Supervisor",null,"Co-worker 1",null,"Co-worker 2",null,"Co-worker 3"]
[null,null,null,null,"ATTITUDE",null,null,null,null,null,null,null,null,"COMMITMENT",null,null,null,null,null,null,null,null,"APPEARANCE"]
[null,null,null,"F.1.1. ",null,null,null,null,null,null,null,null,"F.2.1. ",null,null,null,null,null,null,null,null,"F.3.1. "]
[null,null,null,"F.1.2. ",null,null,null,null,null,null,null,null,"F.2.2. ",null,null,null,null,null,null,null,null,"F.3.2. "]
[null,null,null,"F.1.3. ",null,null,null,null,null,null,null,null,"F.2.3. "]
[null,null,null,null,{"$f":"IF($E$3=\"Executive/Managerial\",(4*(SUM(E46:F48)/12)),(2*(SUM(E46:F48)/12)))","v":0},null,{"$f":"IF($E$3=\"Executive/Managerial\",(4*(SUM(G46:H48)/12)),(2*(SUM(G46:H48)/12)))","v":0},null,{"$f":"IF($E$3=\"Executive/Managerial\",(4*(SUM(I46:J48)/12)),(2*(SUM(I46:J48)/12)))","v":0},null,{"$f":"IF($E$3=\"Executive/Managerial\",(4*(SUM(K46:L48)/12)),(2*(SUM(K46:L48)/12)))","v":0},null,null,{"$f":"IF($E$3=\"Executive/Managerial\",(4*(SUM(N46:O48)/12)),(2*(SUM(N46:O48)/12)))","v":0},null,{"$f":"IF($E$3=\"Executive/Managerial\",(4*(SUM(P46:Q48)/12)),(2*(SUM(P46:Q48)/12)))","v":0},null,{"$f":"IF($E$3=\"Executive/Managerial\",(4*(SUM(R46:S48)/12)),(2*(SUM(R46:S48)/12)))","v":0},null,{"$f":"IF($E$3=\"Executive/Managerial\",(4*(SUM(T46:U48)/12)),(2*(SUM(T46:U48)/12)))","v":0},null,null,{"$f":"IF($E$3=\"Executive/Managerial\",(2*(SUM(W46:X48))/8),(1*(SUM(W46:X48))/8))","v":0},null,{"$f":"IF($E$3=\"Executive/Managerial\",(2*(SUM(Y46:Z48))/8),(1*(SUM(Y46:Z48))/8))","v":0},null,{"$f":"IF($E$3=\"Executive/Managerial\",(2*(SUM(AA46:AB48))/8),(1*(SUM(AA46:AB48))/8))","v":0},null,{"$f":"IF($E$3=\"Executive/Managerial\",(2*(SUM(AC46:AD48))/8),(1*(SUM(AC46:AD48))/8))","v":0}]
[null,null,null,null,null,null,"Supervisor",null,"Co-worker"]
[null,null,null,null,"Attitude",null,{"$f":"E49","v":0},null,{"$f":"SUM(G49:L49)/3","v":0},null,null,null,null,"Total Score PCPT:",null,null,{"$f":"IF(E3=\"Executive/Managerial\",SUM(G54:J54),SUM(G54:J54))","v":0}]
[null,null,null,null,"Commitment",null,{"$f":"N49","v":0},null,{"$f":"SUM(P49:U49)/3","v":0}]
[null,null,null,null,"Appearance",null,{"$f":"W49","v":0},null,{"$f":"SUM(Y49:AD49)/3","v":0}]
[null,null,null,null,null,null,{"$f":"SUM(G51:G53)*0.6","v":0},null,{"$f":"SUM(I51:I53)*0.4","v":0}]
[null,null,{"$f":"IF(E3=\"First Level\",\"G. Potential [Assessment Form No. 2] (3 pts.)\",\"G. Potential [Assessment Form No. 2] (5 pts.)\")","v":"G. Potential [Assessment Form No. 2] (5 pts.)"}]
[]
[null,null,null,"INTERVIEW"]
[]
[null,null,null,null,"G.1.1. Sound judgement",null,null,null,null,null,null,{"$f":"IF($E$3=\"First Level\",\"Not Applicable for First Level position\",\"\")","v":""}]
[null,null,null,null,"G.1.2. Analytical mind",null,null,null,null,null,null,{"$f":"IF($E$3=\"First Level\",\"Not Applicable for First Level position\",\"\")","v":""}]
[null,null,null,null,"G.1.3. The ability to motivate co-workers",null,null,null,null,null,null,{"$f":"IF($E$3=\"First Level\",\"Not Applicable for First Level position\",\"\")","v":""}]
[null,null,null,null,"G.1.4. Unifying Factor",null,null,null,null,null,null,{"$f":"IF($E$3=\"First Level\",\"Not Applicable for First Level position\",\"\")","v":""}]
[null,null,null,null,"G.1.5. Vision/foresight",null,null,null,null,null,null,{"$f":"IF($E$3=\"First Level\",\"Not Applicable for First Level position\",\"\")","v":""}]
[null,null,null,null,"G.2. Resourcefulness"]
[null,null,null,null,"G.3. Creativity/ Ingenuity "]
[]
[null,null,null,"TOTAL POINTS FOR POTENTIAL",null,null,null,null,null,null,{"$f":"IF(E3=\"First Level\",(3*(SUM(K64:K65)/8)),(5*(SUM(K59:K65)/28)))","v":0}]
[]
[null,null,{"$f":"IF(E3=\"First Level\",\"H. Written/ Skills Examination (12 pts.)\",\"H. Written/ Skills Examination (15 pts.)\")","v":"H. Written/ Skills Examination (15 pts.)"}]
[null,null,null,null,null,null,null,null,null,null,{"$f":"IFERROR(SUM(K59:K65)/7,0)","v":0}]
[null,null,null,"WRITTEN/SKILLS EXAMINATION"]
[]
[null,null,null,null,"Perfect/Entire Score",null,null,"="]
[null,null,null,null,"Raw Score",null,null,"="]
[]
[]
[null,null,null,"TOTAL FOR EXAMINATION",null,null,null,null,null,null,{"$f":"IFERROR(IF(E3=\"First Level\",IF(K74>K73,0,(K74*12)/K73),IF(K74>K73,0,(K74*15)/K73)),0)","v":0}]
[]
[null,null,"I. Public Service"]
[]
[null,null,null,null,"Additional Pts. in excess of Total Score"]

{"sheet":"AP32","index":39,"n_rows":81,"n_cols":33,"rows_kept":81,"cut":false,"hidden":false,"merged":[[1,2,1,29],[2,4,2,9],[2,13,2,22],[2,27,2,30],[2,32,2,33],[45,4,45,5],[45,6,45,7],[45,8,45,9],[45,10,45,11],[45,13,45,14],[10,15,10,22],[12,15,12,22],[14,15,14,22],[19,19,19,22],[35,4,37,7],[45,28,45,29],[45,24,45,25],[45,26,45,27],[6,11,6,22],[46,4,46,5],[46,6,46,7],[46,8,46,9],[46,10,46,11],[46,13,46,14],[46,17,46,18],[46,19,46,20],[46,22,46,23],[45,15,45,16],[45,17,45,18],[45,19,45,20],[45,22,45,23],[46,24,46,25],[46,26,46,27],[46,28,46,29],[47,4,47,5],[47,6,47,7],[47,8,47,9],[47,10,47,11],[47,13,47,14],[47,15,47,16],[47,17,47,18],[47,19,47,20],[47,22,47,23],[47,24,47,25],[47,26,47,27],[47,28,47,29],[46,15,46,16],[48,4,48,5],[48,6,48,7],[48,8,48,9],[48,10,48,11],[48,13,48,14],[48,28,48,29],[50,16,50,17],[48,15,48,16],[48,17,48,18],[48,19,48,20],[48,22,48,23],[48,24,48,25],[48,26,48,27]]}
[]
[null,null,"MSP CALCULATOR"]
[null,null,"Levels",":",{"$f":"IF(Vacancy!E6=\"\",\"\",Vacancy!E6)","v":""},null,null,null,null,null,null,"Name",":",null,null,null,null,null,null,null,null,null,null,null,null,null,"Employment Category:",null,null,null,null,null,{"$f":"SUM(F13,Y11,Y13,Y15,E25,Z25,J40,Q51,K67,K77,D81)","v":0}]
[null,null,null,null,null,null,null,null,null,null,null,null,null,null,null,null,null,null,null,null,null,null,null,null,null,null,null,null,null,null,null,null,"TOTAL MATRIX POINTS"]
[null,null,{"$f":"IF(E3=\"First Level\",\"A. Performance Rating (20 pts)\",IF(E3=\"Second Level\",\"A. Performance Rating (15 pts)\",\"A. Performance Rating (35 pts)\"))","v":"A. Performance Rating (35 pts)"},null,null,null,null,null,null,null,null,{"$f":"IF(E3=\"First Level\",\"B. Education (15 pts.)\",IF(E3=\"Second Level\",\"B. Education (10 pts.)\",\"B. Education (5 pts.)\"))","v":"B. Education (5 pts.)"}]
[null,null,"New Graduates (No previous work experience)",null,null,null,null,null,null,null,null,"Required:"]
[false,null,null,null,null,null,null,{"$f":"IF(F9>=2.75,1,IF(F9>=2.5,3,IF(F9>=2.25,5,IF(F9>=2,7,IF(F9>=1.75,9,IF(F9>=1.5,11,IF(F9>=1.25,13,IF(F9>=1,15))))))))","v":false},null,null,null,{"$f":"IF(Vacancy!E10=\"\",\"\",Vacancy!E10)","v":""}]
[]
[null,null,"GWA",null,null,null,{"$f":"IF(F9>=2.75,2,IF(F9>=2.5,5,IF(F9>=2.25,8,IF(F9>=2,11,IF(F9>=1.75,14,IF(F9>=1.5,16,IF(F9>=1.25,18,IF(F9>=1,20))))))))","v":false},{"$f":"IF(E3=\"First Level\",(20*F11)/5,IF(E3=\"Second Level\",(15*F11)/5,IF(E3=\"Executive/Managerial\",(35*F11)/5,\"\")))","v":""},null,null,null,"Highest Educational Attainment:",null,null,null,null,null,null,null,null,null,null,null,null,"Total Score:"]
[]
[null,null,"Last Rating Period",null,null,null,null,{"$f":"IFERROR(IF(AND(A7=TRUE,E3=\"First Level\"),G9,IF(AND(A7=TRUE,E3=\"Second Level\"),H7,H9)),\"\")","v":""},null,null,null,"First Level:",null,null,null,null,null,null,null,null,null,null,null,{"$f":"VLOOKUP(P11,Educ_2!$A$11:$B$26,2,FALSE)","v":{"$error":"#N/A"}},{"$f":"IFERROR(VLOOKUP($L$7,Educ_2!$A$1:$Q$8,X11+1,FALSE),\"\")","v":""}]
[]
[false,null,"Total Score",null,":",{"$f":"IF(H11=FALSE,0,H11)","v":""},"pts.",null,null,null,null,"Second Level:",null,null,null,null,null,null,null,null,null,null,null,{"$f":"VLOOKUP(P13,Educ_2!$A$11:$B$26,2,FALSE)","v":{"$error":"#N/A"}},{"$f":"IFERROR(VLOOKUP($L$7,Educ_2!$A$1:$Q$8,X13+1,FALSE),\"\")","v":""}]
[]
[null,null,null,null,null,null,null,null,null,null,null,"Executive/Managerial:",null,null,null,null,null,null,null,null,null,null,null,{"$f":"VLOOKUP(P15,Educ_2!$A$11:$B$26,2,FALSE)","v":{"$error":"#N/A"}},{"$f":"IFERROR(VLOOKUP($L$7,Educ_2!$A$1:$Q$8,X15+1,FALSE),\"\")","v":""}]
[]
[null,null,null,null,null,null,null,null,null,null,null,null,null,null,null,null,null,null,null,null,null,null,null,null,{"$f":"SUM(Y11,Y13,Y15)","v":0}]
[]
[null,null,"C. Training (10 pts.)",null,null,null,null,null,null,null,null,null,null,null,null,null,null,null,null,null,null,null,null,null,{"$f":"IF(E3=\"Executive/Managerial\",\"D. Experience (10 pts)\",\"D. Experience (25 pts)\")","v":"D. Experience (25 pts)"}]
[null,null,null,null,null,null,null,null,null,null,null,null,null,null,null,null,null,null,null,"Coversion to YEAR"]
[true,null,null,null,{"$f":"IF(Vacancy!$R$10=\"None required\",0,IF(Vacancy!$R$10=\"\",\"\",Vacancy!$R$10))","v":""},"Required (hrs.)",null,null,null,null,null,null,null,null,null,null,null,null,null,null,"Year",null,{"$f":"T21","v":0},null,null,{"$f":"IF(Vacancy!$AA$10=\"None required\",0,IF(Vacancy!$AA$10=\"\",\"\",Vacancy!$AA$10))","v":""},"Required Exp."]
[]
[null,null,null,{"$f":"E23-E21","v":{"$error":"#VALUE!"}},null,"Relevant training hrs. acquired",null,null,null,null,null,null,null,null,null,null,null,null,null,null,"Month",null,{"$f":"T23/12","v":0},null,{"$f":"Z23-Z21","v":{"$error":"#VALUE!"}},{"$f":"SUM(W21,W23,W25)","v":0},"Relevant years of experience"]
[]
[null,null,null,null,{"$f":"IF(N3=\"\",0,IFERROR(IF(E21=E23,5,IF(E23>=E21,((5*D23)/Trg_Exp!$D$2)+5,0)),0))","v":0},"Total",null,null,null,null,null,null,null,null,null,null,null,null,null,null,"Day",null,{"$f":"T25/365","v":0},null,{"$f":"IFERROR(IF(AND(Z21=Z23),10,IF(Vacancy!E6=\"Executive/Managerial\",((10*Y23)/Trg_Exp!$K$2),IF(Z23>=Z21,((15*Y23)/Trg_Exp!$K$2)+10,0))),0)","v":0},{"$f":"IF(N3=\"\",0,IF(Y25<0,0,Y25))","v":0},"Total Score:"]
[]
[null,null,{"$f":"IF(Vacancy!E6=\"Second Level\",\"E. Accomplishment (15 pts.)\",\"E. Accomplishment (10 pts.)\")","v":"E. Accomplishment (10 pts.)"}]
[]
[null,null,null,null,"E.1  Awards/Citations/Commendations"]
[]
[false,null,null,null,"E.1.1. Unit Level",null,null,null,null,{"$f":"IF(A31=TRUE,1,\"\")","v":""}]
[]
[false,null,null,null,"E.1.2. University Level",null,null,null,null,{"$f":"IF(A33=TRUE,3,\"\")","v":""}]
[]
[false,null,null,null,"E.1.3. National/CSC Level",null,null,null,null,{"$f":"IF(A35=TRUE,5,\"\")","v":""}]
[null,null,null,null,"E.2. Innovations/ Systems Improvement"]
[false,null,null,null,null,null,null,null,null,{"$f":"IF(A37=TRUE,IF(Vacancy!E6=\"Second Level\",4,3),\"\")","v":""}]
[null,null,null,null,null,null,null,null,null,null,{"$f":"IF(E3=\"Second Level\",((SUM(J31,J33,J35)*11)/9),((SUM(J31,J33,J35)*7)/9))","v":0}]
[]
[null,null,null,null,"C.2. Total Score:",null,null,null,null,{"$f":"IF(E3=\"Second Level\",(15*SUM(K38,J37)/15),(10*SUM(K38,J37)/10))","v":0}]
[]
[null,null,{"$f":"IF(E3=\"Executive/Managerial\",\"F. Physical Characteristics and Personality Traits (10 pts.)\",\"F. Physical Characteristics and Personality Traits (5 pts.)\")","v":"F. Physical Characteristics and Personality Traits (5 pts.)"}]
[]
[null,null,null,null,"Supervisor",null,"Co-worker 1",null,"Co-worker 2",null,"Co-worker 3",null,null,"Supervisor",null,"Co-worker 1",null,"Co-worker 2",null,"Co-worker 3",null,null,"Supervisor",null,"Co-worker 1",null,"Co-worker 2",null,"Co-worker 3"]
[null,null,null,null,"ATTITUDE",null,null,null,null,null,null,null,null,"COMMITMENT",null,null,null,null,null,null,null,null,"APPEARANCE"]
[null,null,null,"F.1.1. ",null,null,null,null,null,null,null,null,"F.2.1. ",null,null,null,null,null,null,null,null,"F.3.1. "]
[null,null,null,"F.1.2. ",null,null,null,null,null,null,null,null,"F.2.2. ",null,null,null,null,null,null,null,null,"F.3.2. "]
[null,null,null,"F.1.3. ",null,null,null,null,null,null,null,null,"F.2.3. "]
[null,null,null,null,{"$f":"IF($E$3=\"Executive/Managerial\",(4*(SUM(E46:F48)/12)),(2*(SUM(E46:F48)/12)))","v":0},null,{"$f":"IF($E$3=\"Executive/Managerial\",(4*(SUM(G46:H48)/12)),(2*(SUM(G46:H48)/12)))","v":0},null,{"$f":"IF($E$3=\"Executive/Managerial\",(4*(SUM(I46:J48)/12)),(2*(SUM(I46:J48)/12)))","v":0},null,{"$f":"IF($E$3=\"Executive/Managerial\",(4*(SUM(K46:L48)/12)),(2*(SUM(K46:L48)/12)))","v":0},null,null,{"$f":"IF($E$3=\"Executive/Managerial\",(4*(SUM(N46:O48)/12)),(2*(SUM(N46:O48)/12)))","v":0},null,{"$f":"IF($E$3=\"Executive/Managerial\",(4*(SUM(P46:Q48)/12)),(2*(SUM(P46:Q48)/12)))","v":0},null,{"$f":"IF($E$3=\"Executive/Managerial\",(4*(SUM(R46:S48)/12)),(2*(SUM(R46:S48)/12)))","v":0},null,{"$f":"IF($E$3=\"Executive/Managerial\",(4*(SUM(T46:U48)/12)),(2*(SUM(T46:U48)/12)))","v":0},null,null,{"$f":"IF($E$3=\"Executive/Managerial\",(2*(SUM(W46:X48))/8),(1*(SUM(W46:X48))/8))","v":0},null,{"$f":"IF($E$3=\"Executive/Managerial\",(2*(SUM(Y46:Z48))/8),(1*(SUM(Y46:Z48))/8))","v":0},null,{"$f":"IF($E$3=\"Executive/Managerial\",(2*(SUM(AA46:AB48))/8),(1*(SUM(AA46:AB48))/8))","v":0},null,{"$f":"IF($E$3=\"Executive/Managerial\",(2*(SUM(AC46:AD48))/8),(1*(SUM(AC46:AD48))/8))","v":0}]
[null,null,null,null,null,null,"Supervisor",null,"Co-worker"]
[null,null,null,null,"Attitude",null,{"$f":"E49","v":0},null,{"$f":"SUM(G49:L49)/3","v":0},null,null,null,null,"Total Score PCPT:",null,null,{"$f":"IF(E3=\"Executive/Managerial\",SUM(G54:J54),SUM(G54:J54))","v":0}]
[null,null,null,null,"Commitment",null,{"$f":"N49","v":0},null,{"$f":"SUM(P49:U49)/3","v":0}]
[null,null,null,null,"Appearance",null,{"$f":"W49","v":0},null,{"$f":"SUM(Y49:AD49)/3","v":0}]
[null,null,null,null,null,null,{"$f":"SUM(G51:G53)*0.6","v":0},null,{"$f":"SUM(I51:I53)*0.4","v":0}]
[null,null,{"$f":"IF(E3=\"First Level\",\"G. Potential [Assessment Form No. 2] (3 pts.)\",\"G. Potential [Assessment Form No. 2] (5 pts.)\")","v":"G. Potential [Assessment Form No. 2] (5 pts.)"}]
[]
[null,null,null,"INTERVIEW"]
[]
[null,null,null,null,"G.1.1. Sound judgement",null,null,null,null,null,null,{"$f":"IF($E$3=\"First Level\",\"Not Applicable for First Level position\",\"\")","v":""}]
[null,null,null,null,"G.1.2. Analytical mind",null,null,null,null,null,null,{"$f":"IF($E$3=\"First Level\",\"Not Applicable for First Level position\",\"\")","v":""}]
[null,null,null,null,"G.1.3. The ability to motivate co-workers",null,null,null,null,null,null,{"$f":"IF($E$3=\"First Level\",\"Not Applicable for First Level position\",\"\")","v":""}]
[null,null,null,null,"G.1.4. Unifying Factor",null,null,null,null,null,null,{"$f":"IF($E$3=\"First Level\",\"Not Applicable for First Level position\",\"\")","v":""}]
[null,null,null,null,"G.1.5. Vision/foresight",null,null,null,null,null,null,{"$f":"IF($E$3=\"First Level\",\"Not Applicable for First Level position\",\"\")","v":""}]
[null,null,null,null,"G.2. Resourcefulness"]
[null,null,null,null,"G.3. Creativity/ Ingenuity "]
[]
[null,null,null,"TOTAL POINTS FOR POTENTIAL",null,null,null,null,null,null,{"$f":"IF(E3=\"First Level\",(3*(SUM(K64:K65)/8)),(5*(SUM(K59:K65)/28)))","v":0}]
[]
[null,null,{"$f":"IF(E3=\"First Level\",\"H. Written/ Skills Examination (12 pts.)\",\"H. Written/ Skills Examination (15 pts.)\")","v":"H. Written/ Skills Examination (15 pts.)"}]
[null,null,null,null,null,null,null,null,null,null,{"$f":"IFERROR(SUM(K59:K65)/7,0)","v":0}]
[null,null,null,"WRITTEN/SKILLS EXAMINATION"]
[]
[null,null,null,null,"Perfect/Entire Score",null,null,"="]
[null,null,null,null,"Raw Score",null,null,"="]
[]
[]
[null,null,null,"TOTAL FOR EXAMINATION",null,null,null,null,null,null,{"$f":"IFERROR(IF(E3=\"First Level\",IF(K74>K73,0,(K74*12)/K73),IF(K74>K73,0,(K74*15)/K73)),0)","v":0}]
[]
[null,null,"I. Public Service"]
[]
[null,null,null,null,"Additional Pts. in excess of Total Score"]

{"sheet":"AP33","index":40,"n_rows":81,"n_cols":33,"rows_kept":81,"cut":false,"hidden":false,"merged":[[1,2,1,29],[2,4,2,9],[2,13,2,22],[2,27,2,30],[2,32,2,33],[45,4,45,5],[45,6,45,7],[45,8,45,9],[45,10,45,11],[45,13,45,14],[10,15,10,22],[12,15,12,22],[14,15,14,22],[19,19,19,22],[35,4,37,7],[45,28,45,29],[45,24,45,25],[45,26,45,27],[6,11,6,22],[46,4,46,5],[46,6,46,7],[46,8,46,9],[46,10,46,11],[46,13,46,14],[46,17,46,18],[46,19,46,20],[46,22,46,23],[45,15,45,16],[45,17,45,18],[45,19,45,20],[45,22,45,23],[46,24,46,25],[46,26,46,27],[46,28,46,29],[47,4,47,5],[47,6,47,7],[47,8,47,9],[47,10,47,11],[47,13,47,14],[47,15,47,16],[47,17,47,18],[47,19,47,20],[47,22,47,23],[47,24,47,25],[47,26,47,27],[47,28,47,29],[46,15,46,16],[48,4,48,5],[48,6,48,7],[48,8,48,9],[48,10,48,11],[48,13,48,14],[48,28,48,29],[50,16,50,17],[48,15,48,16],[48,17,48,18],[48,19,48,20],[48,22,48,23],[48,24,48,25],[48,26,48,27]]}
[]
[null,null,"MSP CALCULATOR"]
[null,null,"Levels",":",{"$f":"IF(Vacancy!E6=\"\",\"\",Vacancy!E6)","v":""},null,null,null,null,null,null,"Name",":",null,null,null,null,null,null,null,null,null,null,null,null,null,"Employment Category:",null,null,null,null,null,{"$f":"SUM(F13,Y11,Y13,Y15,E25,Z25,J40,Q51,K67,K77,D81)","v":0}]
[null,null,null,null,null,null,null,null,null,null,null,null,null,null,null,null,null,null,null,null,null,null,null,null,null,null,null,null,null,null,null,null,"TOTAL MATRIX POINTS"]
[null,null,{"$f":"IF(E3=\"First Level\",\"A. Performance Rating (20 pts)\",IF(E3=\"Second Level\",\"A. Performance Rating (15 pts)\",\"A. Performance Rating (35 pts)\"))","v":"A. Performance Rating (35 pts)"},null,null,null,null,null,null,null,null,{"$f":"IF(E3=\"First Level\",\"B. Education (15 pts.)\",IF(E3=\"Second Level\",\"B. Education (10 pts.)\",\"B. Education (5 pts.)\"))","v":"B. Education (5 pts.)"}]
[null,null,"New Graduates (No previous work experience)",null,null,null,null,null,null,null,null,"Required:"]
[false,null,null,null,null,null,null,{"$f":"IF(F9>=2.75,1,IF(F9>=2.5,3,IF(F9>=2.25,5,IF(F9>=2,7,IF(F9>=1.75,9,IF(F9>=1.5,11,IF(F9>=1.25,13,IF(F9>=1,15))))))))","v":false},null,null,null,{"$f":"IF(Vacancy!E10=\"\",\"\",Vacancy!E10)","v":""}]
[]
[null,null,"GWA",null,null,null,{"$f":"IF(F9>=2.75,2,IF(F9>=2.5,5,IF(F9>=2.25,8,IF(F9>=2,11,IF(F9>=1.75,14,IF(F9>=1.5,16,IF(F9>=1.25,18,IF(F9>=1,20))))))))","v":false},{"$f":"IF(E3=\"First Level\",(20*F11)/5,IF(E3=\"Second Level\",(15*F11)/5,IF(E3=\"Executive/Managerial\",(35*F11)/5,\"\")))","v":""},null,null,null,"Highest Educational Attainment:",null,null,null,null,null,null,null,null,null,null,null,null,"Total Score:"]
[]
[null,null,"Last Rating Period",null,null,null,null,{"$f":"IFERROR(IF(AND(A7=TRUE,E3=\"First Level\"),G9,IF(AND(A7=TRUE,E3=\"Second Level\"),H7,H9)),\"\")","v":""},null,null,null,"First Level:",null,null,null,null,null,null,null,null,null,null,null,{"$f":"VLOOKUP(P11,Educ_2!$A$11:$B$26,2,FALSE)","v":{"$error":"#N/A"}},{"$f":"IFERROR(VLOOKUP($L$7,Educ_2!$A$1:$Q$8,X11+1,FALSE),\"\")","v":""}]
[]
[false,null,"Total Score",null,":",{"$f":"IF(H11=FALSE,0,H11)","v":""},"pts.",null,null,null,null,"Second Level:",null,null,null,null,null,null,null,null,null,null,null,{"$f":"VLOOKUP(P13,Educ_2!$A$11:$B$26,2,FALSE)","v":{"$error":"#N/A"}},{"$f":"IFERROR(VLOOKUP($L$7,Educ_2!$A$1:$Q$8,X13+1,FALSE),\"\")","v":""}]
[]
[null,null,null,null,null,null,null,null,null,null,null,"Executive/Managerial:",null,null,null,null,null,null,null,null,null,null,null,{"$f":"VLOOKUP(P15,Educ_2!$A$11:$B$26,2,FALSE)","v":{"$error":"#N/A"}},{"$f":"IFERROR(VLOOKUP($L$7,Educ_2!$A$1:$Q$8,X15+1,FALSE),\"\")","v":""}]
[]
[null,null,null,null,null,null,null,null,null,null,null,null,null,null,null,null,null,null,null,null,null,null,null,null,{"$f":"SUM(Y11,Y13,Y15)","v":0}]
[]
[null,null,"C. Training (10 pts.)",null,null,null,null,null,null,null,null,null,null,null,null,null,null,null,null,null,null,null,null,null,{"$f":"IF(E3=\"Executive/Managerial\",\"D. Experience (10 pts)\",\"D. Experience (25 pts)\")","v":"D. Experience (25 pts)"}]
[null,null,null,null,null,null,null,null,null,null,null,null,null,null,null,null,null,null,null,"Coversion to YEAR"]
[true,null,null,null,{"$f":"IF(Vacancy!$R$10=\"None required\",0,IF(Vacancy!$R$10=\"\",\"\",Vacancy!$R$10))","v":""},"Required (hrs.)",null,null,null,null,null,null,null,null,null,null,null,null,null,null,"Year",null,{"$f":"T21","v":0},null,null,{"$f":"IF(Vacancy!$AA$10=\"None required\",0,IF(Vacancy!$AA$10=\"\",\"\",Vacancy!$AA$10))","v":""},"Required Exp."]
[]
[null,null,null,{"$f":"E23-E21","v":{"$error":"#VALUE!"}},null,"Relevant training hrs. acquired",null,null,null,null,null,null,null,null,null,null,null,null,null,null,"Month",null,{"$f":"T23/12","v":0},null,{"$f":"Z23-Z21","v":{"$error":"#VALUE!"}},{"$f":"SUM(W21,W23,W25)","v":0},"Relevant years of experience"]
[]
[null,null,null,null,{"$f":"IF(N3=\"\",0,IFERROR(IF(E21=E23,5,IF(E23>=E21,((5*D23)/Trg_Exp!$D$2)+5,0)),0))","v":0},"Total",null,null,null,null,null,null,null,null,null,null,null,null,null,null,"Day",null,{"$f":"T25/365","v":0},null,{"$f":"IFERROR(IF(AND(Z21=Z23),10,IF(Vacancy!E6=\"Executive/Managerial\",((10*Y23)/Trg_Exp!$K$2),IF(Z23>=Z21,((15*Y23)/Trg_Exp!$K$2)+10,0))),0)","v":0},{"$f":"IF(N3=\"\",0,IF(Y25<0,0,Y25))","v":0},"Total Score:"]
[]
[null,null,{"$f":"IF(Vacancy!E6=\"Second Level\",\"E. Accomplishment (15 pts.)\",\"E. Accomplishment (10 pts.)\")","v":"E. Accomplishment (10 pts.)"}]
[]
[null,null,null,null,"E.1  Awards/Citations/Commendations"]
[]
[false,null,null,null,"E.1.1. Unit Level",null,null,null,null,{"$f":"IF(A31=TRUE,1,\"\")","v":""}]
[]
[false,null,null,null,"E.1.2. University Level",null,null,null,null,{"$f":"IF(A33=TRUE,3,\"\")","v":""}]
[]
[false,null,null,null,"E.1.3. National/CSC Level",null,null,null,null,{"$f":"IF(A35=TRUE,5,\"\")","v":""}]
[null,null,null,null,"E.2. Innovations/ Systems Improvement"]
[false,null,null,null,null,null,null,null,null,{"$f":"IF(A37=TRUE,IF(Vacancy!E6=\"Second Level\",4,3),\"\")","v":""}]
[null,null,null,null,null,null,null,null,null,null,{"$f":"IF(E3=\"Second Level\",((SUM(J31,J33,J35)*11)/9),((SUM(J31,J33,J35)*7)/9))","v":0}]
[]
[null,null,null,null,"C.2. Total Score:",null,null,null,null,{"$f":"IF(E3=\"Second Level\",(15*SUM(K38,J37)/15),(10*SUM(K38,J37)/10))","v":0}]
[]
[null,null,{"$f":"IF(E3=\"Executive/Managerial\",\"F. Physical Characteristics and Personality Traits (10 pts.)\",\"F. Physical Characteristics and Personality Traits (5 pts.)\")","v":"F. Physical Characteristics and Personality Traits (5 pts.)"}]
[]
[null,null,null,null,"Supervisor",null,"Co-worker 1",null,"Co-worker 2",null,"Co-worker 3",null,null,"Supervisor",null,"Co-worker 1",null,"Co-worker 2",null,"Co-worker 3",null,null,"Supervisor",null,"Co-worker 1",null,"Co-worker 2",null,"Co-worker 3"]
[null,null,null,null,"ATTITUDE",null,null,null,null,null,null,null,null,"COMMITMENT",null,null,null,null,null,null,null,null,"APPEARANCE"]
[null,null,null,"F.1.1. ",null,null,null,null,null,null,null,null,"F.2.1. ",null,null,null,null,null,null,null,null,"F.3.1. "]
[null,null,null,"F.1.2. ",null,null,null,null,null,null,null,null,"F.2.2. ",null,null,null,null,null,null,null,null,"F.3.2. "]
[null,null,null,"F.1.3. ",null,null,null,null,null,null,null,null,"F.2.3. "]
[null,null,null,null,{"$f":"IF($E$3=\"Executive/Managerial\",(4*(SUM(E46:F48)/12)),(2*(SUM(E46:F48)/12)))","v":0},null,{"$f":"IF($E$3=\"Executive/Managerial\",(4*(SUM(G46:H48)/12)),(2*(SUM(G46:H48)/12)))","v":0},null,{"$f":"IF($E$3=\"Executive/Managerial\",(4*(SUM(I46:J48)/12)),(2*(SUM(I46:J48)/12)))","v":0},null,{"$f":"IF($E$3=\"Executive/Managerial\",(4*(SUM(K46:L48)/12)),(2*(SUM(K46:L48)/12)))","v":0},null,null,{"$f":"IF($E$3=\"Executive/Managerial\",(4*(SUM(N46:O48)/12)),(2*(SUM(N46:O48)/12)))","v":0},null,{"$f":"IF($E$3=\"Executive/Managerial\",(4*(SUM(P46:Q48)/12)),(2*(SUM(P46:Q48)/12)))","v":0},null,{"$f":"IF($E$3=\"Executive/Managerial\",(4*(SUM(R46:S48)/12)),(2*(SUM(R46:S48)/12)))","v":0},null,{"$f":"IF($E$3=\"Executive/Managerial\",(4*(SUM(T46:U48)/12)),(2*(SUM(T46:U48)/12)))","v":0},null,null,{"$f":"IF($E$3=\"Executive/Managerial\",(2*(SUM(W46:X48))/8),(1*(SUM(W46:X48))/8))","v":0},null,{"$f":"IF($E$3=\"Executive/Managerial\",(2*(SUM(Y46:Z48))/8),(1*(SUM(Y46:Z48))/8))","v":0},null,{"$f":"IF($E$3=\"Executive/Managerial\",(2*(SUM(AA46:AB48))/8),(1*(SUM(AA46:AB48))/8))","v":0},null,{"$f":"IF($E$3=\"Executive/Managerial\",(2*(SUM(AC46:AD48))/8),(1*(SUM(AC46:AD48))/8))","v":0}]
[null,null,null,null,null,null,"Supervisor",null,"Co-worker"]
[null,null,null,null,"Attitude",null,{"$f":"E49","v":0},null,{"$f":"SUM(G49:L49)/3","v":0},null,null,null,null,"Total Score PCPT:",null,null,{"$f":"IF(E3=\"Executive/Managerial\",SUM(G54:J54),SUM(G54:J54))","v":0}]
[null,null,null,null,"Commitment",null,{"$f":"N49","v":0},null,{"$f":"SUM(P49:U49)/3","v":0}]
[null,null,null,null,"Appearance",null,{"$f":"W49","v":0},null,{"$f":"SUM(Y49:AD49)/3","v":0}]
[null,null,null,null,null,null,{"$f":"SUM(G51:G53)*0.6","v":0},null,{"$f":"SUM(I51:I53)*0.4","v":0}]
[null,null,{"$f":"IF(E3=\"First Level\",\"G. Potential [Assessment Form No. 2] (3 pts.)\",\"G. Potential [Assessment Form No. 2] (5 pts.)\")","v":"G. Potential [Assessment Form No. 2] (5 pts.)"}]
[]
[null,null,null,"INTERVIEW"]
[]
[null,null,null,null,"G.1.1. Sound judgement",null,null,null,null,null,null,{"$f":"IF($E$3=\"First Level\",\"Not Applicable for First Level position\",\"\")","v":""}]
[null,null,null,null,"G.1.2. Analytical mind",null,null,null,null,null,null,{"$f":"IF($E$3=\"First Level\",\"Not Applicable for First Level position\",\"\")","v":""}]
[null,null,null,null,"G.1.3. The ability to motivate co-workers",null,null,null,null,null,null,{"$f":"IF($E$3=\"First Level\",\"Not Applicable for First Level position\",\"\")","v":""}]
[null,null,null,null,"G.1.4. Unifying Factor",null,null,null,null,null,null,{"$f":"IF($E$3=\"First Level\",\"Not Applicable for First Level position\",\"\")","v":""}]
[null,null,null,null,"G.1.5. Vision/foresight",null,null,null,null,null,null,{"$f":"IF($E$3=\"First Level\",\"Not Applicable for First Level position\",\"\")","v":""}]
[null,null,null,null,"G.2. Resourcefulness"]
[null,null,null,null,"G.3. Creativity/ Ingenuity "]
[]
[null,null,null,"TOTAL POINTS FOR POTENTIAL",null,null,null,null,null,null,{"$f":"IF(E3=\"First Level\",(3*(SUM(K64:K65)/8)),(5*(SUM(K59:K65)/28)))","v":0}]
[]
[null,null,{"$f":"IF(E3=\"First Level\",\"H. Written/ Skills Examination (12 pts.)\",\"H. Written/ Skills Examination (15 pts.)\")","v":"H. Written/ Skills Examination (15 pts.)"}]
[null,null,null,null,null,null,null,null,null,null,{"$f":"IFERROR(SUM(K59:K65)/7,0)","v":0}]
[null,null,null,"WRITTEN/SKILLS EXAMINATION"]
[]
[null,null,null,null,"Perfect/Entire Score",null,null,"="]
[null,null,null,null,"Raw Score",null,null,"="]
[]
[]
[null,null,null,"TOTAL FOR EXAMINATION",null,null,null,null,null,null,{"$f":"IFERROR(IF(E3=\"First Level\",IF(K74>K73,0,(K74*12)/K73),IF(K74>K73,0,(K74*15)/K73)),0)","v":0}]
[]
[null,null,"I. Public Service"]
[]
[null,null,null,null,"Additional Pts. in excess of Total Score"]

{"sheet":"AP34","index":41,"n_rows":81,"n_cols":33,"rows_kept":81,"cut":false,"hidden":false,"merged":[[1,2,1,29],[2,4,2,9],[2,13,2,22],[2,27,2,30],[2,32,2,33],[45,4,45,5],[45,6,45,7],[45,8,45,9],[45,10,45,11],[45,13,45,14],[10,15,10,22],[12,15,12,22],[14,15,14,22],[19,19,19,22],[35,4,37,7],[45,28,45,29],[45,24,45,25],[45,26,45,27],[6,11,6,22],[46,4,46,5],[46,6,46,7],[46,8,46,9],[46,10,46,11],[46,13,46,14],[46,17,46,18],[46,19,46,20],[46,22,46,23],[45,15,45,16],[45,17,45,18],[45,19,45,20],[45,22,45,23],[46,24,46,25],[46,26,46,27],[46,28,46,29],[47,4,47,5],[47,6,47,7],[47,8,47,9],[47,10,47,11],[47,13,47,14],[47,15,47,16],[47,17,47,18],[47,19,47,20],[47,22,47,23],[47,24,47,25],[47,26,47,27],[47,28,47,29],[46,15,46,16],[48,4,48,5],[48,6,48,7],[48,8,48,9],[48,10,48,11],[48,13,48,14],[48,28,48,29],[50,16,50,17],[48,15,48,16],[48,17,48,18],[48,19,48,20],[48,22,48,23],[48,24,48,25],[48,26,48,27]]}
[]
[null,null,"MSP CALCULATOR"]
[null,null,"Levels",":",{"$f":"IF(Vacancy!E6=\"\",\"\",Vacancy!E6)","v":""},null,null,null,null,null,null,"Name",":",null,null,null,null,null,null,null,null,null,null,null,null,null,"Employment Category:",null,null,null,null,null,{"$f":"SUM(F13,Y11,Y13,Y15,E25,Z25,J40,Q51,K67,K77,D81)","v":0}]
[null,null,null,null,null,null,null,null,null,null,null,null,null,null,null,null,null,null,null,null,null,null,null,null,null,null,null,null,null,null,null,null,"TOTAL MATRIX POINTS"]
[null,null,{"$f":"IF(E3=\"First Level\",\"A. Performance Rating (20 pts)\",IF(E3=\"Second Level\",\"A. Performance Rating (15 pts)\",\"A. Performance Rating (35 pts)\"))","v":"A. Performance Rating (35 pts)"},null,null,null,null,null,null,null,null,{"$f":"IF(E3=\"First Level\",\"B. Education (15 pts.)\",IF(E3=\"Second Level\",\"B. Education (10 pts.)\",\"B. Education (5 pts.)\"))","v":"B. Education (5 pts.)"}]
[null,null,"New Graduates (No previous work experience)",null,null,null,null,null,null,null,null,"Required:"]
[false,null,null,null,null,null,null,{"$f":"IF(F9>=2.75,1,IF(F9>=2.5,3,IF(F9>=2.25,5,IF(F9>=2,7,IF(F9>=1.75,9,IF(F9>=1.5,11,IF(F9>=1.25,13,IF(F9>=1,15))))))))","v":false},null,null,null,{"$f":"IF(Vacancy!E10=\"\",\"\",Vacancy!E10)","v":""}]
[]
[null,null,"GWA",null,null,null,{"$f":"IF(F9>=2.75,2,IF(F9>=2.5,5,IF(F9>=2.25,8,IF(F9>=2,11,IF(F9>=1.75,14,IF(F9>=1.5,16,IF(F9>=1.25,18,IF(F9>=1,20))))))))","v":false},{"$f":"IF(E3=\"First Level\",(20*F11)/5,IF(E3=\"Second Level\",(15*F11)/5,IF(E3=\"Executive/Managerial\",(35*F11)/5,\"\")))","v":""},null,null,null,"Highest Educational Attainment:",null,null,null,null,null,null,null,null,null,null,null,null,"Total Score:"]
[]
[null,null,"Last Rating Period",null,null,null,null,{"$f":"IFERROR(IF(AND(A7=TRUE,E3=\"First Level\"),G9,IF(AND(A7=TRUE,E3=\"Second Level\"),H7,H9)),\"\")","v":""},null,null,null,"First Level:",null,null,null,null,null,null,null,null,null,null,null,{"$f":"VLOOKUP(P11,Educ_2!$A$11:$B$26,2,FALSE)","v":{"$error":"#N/A"}},{"$f":"IFERROR(VLOOKUP($L$7,Educ_2!$A$1:$Q$8,X11+1,FALSE),\"\")","v":""}]
[]
[false,null,"Total Score",null,":",{"$f":"IF(H11=FALSE,0,H11)","v":""},"pts.",null,null,null,null,"Second Level:",null,null,null,null,null,null,null,null,null,null,null,{"$f":"VLOOKUP(P13,Educ_2!$A$11:$B$26,2,FALSE)","v":{"$error":"#N/A"}},{"$f":"IFERROR(VLOOKUP($L$7,Educ_2!$A$1:$Q$8,X13+1,FALSE),\"\")","v":""}]
[]
[null,null,null,null,null,null,null,null,null,null,null,"Executive/Managerial:",null,null,null,null,null,null,null,null,null,null,null,{"$f":"VLOOKUP(P15,Educ_2!$A$11:$B$26,2,FALSE)","v":{"$error":"#N/A"}},{"$f":"IFERROR(VLOOKUP($L$7,Educ_2!$A$1:$Q$8,X15+1,FALSE),\"\")","v":""}]
[]
[null,null,null,null,null,null,null,null,null,null,null,null,null,null,null,null,null,null,null,null,null,null,null,null,{"$f":"SUM(Y11,Y13,Y15)","v":0}]
[]
[null,null,"C. Training (10 pts.)",null,null,null,null,null,null,null,null,null,null,null,null,null,null,null,null,null,null,null,null,null,{"$f":"IF(E3=\"Executive/Managerial\",\"D. Experience (10 pts)\",\"D. Experience (25 pts)\")","v":"D. Experience (25 pts)"}]
[null,null,null,null,null,null,null,null,null,null,null,null,null,null,null,null,null,null,null,"Coversion to YEAR"]
[true,null,null,null,{"$f":"IF(Vacancy!$R$10=\"None required\",0,IF(Vacancy!$R$10=\"\",\"\",Vacancy!$R$10))","v":""},"Required (hrs.)",null,null,null,null,null,null,null,null,null,null,null,null,null,null,"Year",null,{"$f":"T21","v":0},null,null,{"$f":"IF(Vacancy!$AA$10=\"None required\",0,IF(Vacancy!$AA$10=\"\",\"\",Vacancy!$AA$10))","v":""},"Required Exp."]
[]
[null,null,null,{"$f":"E23-E21","v":{"$error":"#VALUE!"}},null,"Relevant training hrs. acquired",null,null,null,null,null,null,null,null,null,null,null,null,null,null,"Month",null,{"$f":"T23/12","v":0},null,{"$f":"Z23-Z21","v":{"$error":"#VALUE!"}},{"$f":"SUM(W21,W23,W25)","v":0},"Relevant years of experience"]
[]
[null,null,null,null,{"$f":"IF(N3=\"\",0,IFERROR(IF(E21=E23,5,IF(E23>=E21,((5*D23)/Trg_Exp!$D$2)+5,0)),0))","v":0},"Total",null,null,null,null,null,null,null,null,null,null,null,null,null,null,"Day",null,{"$f":"T25/365","v":0},null,{"$f":"IFERROR(IF(AND(Z21=Z23),10,IF(Vacancy!E6=\"Executive/Managerial\",((10*Y23)/Trg_Exp!$K$2),IF(Z23>=Z21,((15*Y23)/Trg_Exp!$K$2)+10,0))),0)","v":0},{"$f":"IF(N3=\"\",0,IF(Y25<0,0,Y25))","v":0},"Total Score:"]
[]
[null,null,{"$f":"IF(Vacancy!E6=\"Second Level\",\"E. Accomplishment (15 pts.)\",\"E. Accomplishment (10 pts.)\")","v":"E. Accomplishment (10 pts.)"}]
[]
[null,null,null,null,"E.1  Awards/Citations/Commendations"]
[]
[false,null,null,null,"E.1.1. Unit Level",null,null,null,null,{"$f":"IF(A31=TRUE,1,\"\")","v":""}]
[]
[false,null,null,null,"E.1.2. University Level",null,null,null,null,{"$f":"IF(A33=TRUE,3,\"\")","v":""}]
[]
[false,null,null,null,"E.1.3. National/CSC Level",null,null,null,null,{"$f":"IF(A35=TRUE,5,\"\")","v":""}]
[null,null,null,null,"E.2. Innovations/ Systems Improvement"]
[false,null,null,null,null,null,null,null,null,{"$f":"IF(A37=TRUE,IF(Vacancy!E6=\"Second Level\",4,3),\"\")","v":""}]
[null,null,null,null,null,null,null,null,null,null,{"$f":"IF(E3=\"Second Level\",((SUM(J31,J33,J35)*11)/9),((SUM(J31,J33,J35)*7)/9))","v":0}]
[]
[null,null,null,null,"C.2. Total Score:",null,null,null,null,{"$f":"IF(E3=\"Second Level\",(15*SUM(K38,J37)/15),(10*SUM(K38,J37)/10))","v":0}]
[]
[null,null,{"$f":"IF(E3=\"Executive/Managerial\",\"F. Physical Characteristics and Personality Traits (10 pts.)\",\"F. Physical Characteristics and Personality Traits (5 pts.)\")","v":"F. Physical Characteristics and Personality Traits (5 pts.)"}]
[]
[null,null,null,null,"Supervisor",null,"Co-worker 1",null,"Co-worker 2",null,"Co-worker 3",null,null,"Supervisor",null,"Co-worker 1",null,"Co-worker 2",null,"Co-worker 3",null,null,"Supervisor",null,"Co-worker 1",null,"Co-worker 2",null,"Co-worker 3"]
[null,null,null,null,"ATTITUDE",null,null,null,null,null,null,null,null,"COMMITMENT",null,null,null,null,null,null,null,null,"APPEARANCE"]
[null,null,null,"F.1.1. ",null,null,null,null,null,null,null,null,"F.2.1. ",null,null,null,null,null,null,null,null,"F.3.1. "]
[null,null,null,"F.1.2. ",null,null,null,null,null,null,null,null,"F.2.2. ",null,null,null,null,null,null,null,null,"F.3.2. "]
[null,null,null,"F.1.3. ",null,null,null,null,null,null,null,null,"F.2.3. "]
[null,null,null,null,{"$f":"IF($E$3=\"Executive/Managerial\",(4*(SUM(E46:F48)/12)),(2*(SUM(E46:F48)/12)))","v":0},null,{"$f":"IF($E$3=\"Executive/Managerial\",(4*(SUM(G46:H48)/12)),(2*(SUM(G46:H48)/12)))","v":0},null,{"$f":"IF($E$3=\"Executive/Managerial\",(4*(SUM(I46:J48)/12)),(2*(SUM(I46:J48)/12)))","v":0},null,{"$f":"IF($E$3=\"Executive/Managerial\",(4*(SUM(K46:L48)/12)),(2*(SUM(K46:L48)/12)))","v":0},null,null,{"$f":"IF($E$3=\"Executive/Managerial\",(4*(SUM(N46:O48)/12)),(2*(SUM(N46:O48)/12)))","v":0},null,{"$f":"IF($E$3=\"Executive/Managerial\",(4*(SUM(P46:Q48)/12)),(2*(SUM(P46:Q48)/12)))","v":0},null,{"$f":"IF($E$3=\"Executive/Managerial\",(4*(SUM(R46:S48)/12)),(2*(SUM(R46:S48)/12)))","v":0},null,{"$f":"IF($E$3=\"Executive/Managerial\",(4*(SUM(T46:U48)/12)),(2*(SUM(T46:U48)/12)))","v":0},null,null,{"$f":"IF($E$3=\"Executive/Managerial\",(2*(SUM(W46:X48))/8),(1*(SUM(W46:X48))/8))","v":0},null,{"$f":"IF($E$3=\"Executive/Managerial\",(2*(SUM(Y46:Z48))/8),(1*(SUM(Y46:Z48))/8))","v":0},null,{"$f":"IF($E$3=\"Executive/Managerial\",(2*(SUM(AA46:AB48))/8),(1*(SUM(AA46:AB48))/8))","v":0},null,{"$f":"IF($E$3=\"Executive/Managerial\",(2*(SUM(AC46:AD48))/8),(1*(SUM(AC46:AD48))/8))","v":0}]
[null,null,null,null,null,null,"Supervisor",null,"Co-worker"]
[null,null,null,null,"Attitude",null,{"$f":"E49","v":0},null,{"$f":"SUM(G49:L49)/3","v":0},null,null,null,null,"Total Score PCPT:",null,null,{"$f":"IF(E3=\"Executive/Managerial\",SUM(G54:J54),SUM(G54:J54))","v":0}]
[null,null,null,null,"Commitment",null,{"$f":"N49","v":0},null,{"$f":"SUM(P49:U49)/3","v":0}]
[null,null,null,null,"Appearance",null,{"$f":"W49","v":0},null,{"$f":"SUM(Y49:AD49)/3","v":0}]
[null,null,null,null,null,null,{"$f":"SUM(G51:G53)*0.6","v":0},null,{"$f":"SUM(I51:I53)*0.4","v":0}]
[null,null,{"$f":"IF(E3=\"First Level\",\"G. Potential [Assessment Form No. 2] (3 pts.)\",\"G. Potential [Assessment Form No. 2] (5 pts.)\")","v":"G. Potential [Assessment Form No. 2] (5 pts.)"}]
[]
[null,null,null,"INTERVIEW"]
[]
[null,null,null,null,"G.1.1. Sound judgement",null,null,null,null,null,null,{"$f":"IF($E$3=\"First Level\",\"Not Applicable for First Level position\",\"\")","v":""}]
[null,null,null,null,"G.1.2. Analytical mind",null,null,null,null,null,null,{"$f":"IF($E$3=\"First Level\",\"Not Applicable for First Level position\",\"\")","v":""}]
[null,null,null,null,"G.1.3. The ability to motivate co-workers",null,null,null,null,null,null,{"$f":"IF($E$3=\"First Level\",\"Not Applicable for First Level position\",\"\")","v":""}]
[null,null,null,null,"G.1.4. Unifying Factor",null,null,null,null,null,null,{"$f":"IF($E$3=\"First Level\",\"Not Applicable for First Level position\",\"\")","v":""}]
[null,null,null,null,"G.1.5. Vision/foresight",null,null,null,null,null,null,{"$f":"IF($E$3=\"First Level\",\"Not Applicable for First Level position\",\"\")","v":""}]
[null,null,null,null,"G.2. Resourcefulness"]
[null,null,null,null,"G.3. Creativity/ Ingenuity "]
[]
[null,null,null,"TOTAL POINTS FOR POTENTIAL",null,null,null,null,null,null,{"$f":"IF(E3=\"First Level\",(3*(SUM(K64:K65)/8)),(5*(SUM(K59:K65)/28)))","v":0}]
[]
[null,null,{"$f":"IF(E3=\"First Level\",\"H. Written/ Skills Examination (12 pts.)\",\"H. Written/ Skills Examination (15 pts.)\")","v":"H. Written/ Skills Examination (15 pts.)"}]
[null,null,null,null,null,null,null,null,null,null,{"$f":"IFERROR(SUM(K59:K65)/7,0)","v":0}]
[null,null,null,"WRITTEN/SKILLS EXAMINATION"]
[]
[null,null,null,null,"Perfect/Entire Score",null,null,"="]
[null,null,null,null,"Raw Score",null,null,"="]
[]
[]
[null,null,null,"TOTAL FOR EXAMINATION",null,null,null,null,null,null,{"$f":"IFERROR(IF(E3=\"First Level\",IF(K74>K73,0,(K74*12)/K73),IF(K74>K73,0,(K74*15)/K73)),0)","v":0}]
[]
[null,null,"I. Public Service"]
[]
[null,null,null,null,"Additional Pts. in excess of Total Score"]

{"sheet":"AP35","index":42,"n_rows":81,"n_cols":33,"rows_kept":81,"cut":false,"hidden":false,"merged":[[1,2,1,29],[2,4,2,9],[2,13,2,22],[2,27,2,30],[2,32,2,33],[45,4,45,5],[45,6,45,7],[45,8,45,9],[45,10,45,11],[45,13,45,14],[10,15,10,22],[12,15,12,22],[14,15,14,22],[19,19,19,22],[35,4,37,7],[45,28,45,29],[45,24,45,25],[45,26,45,27],[6,11,6,22],[46,4,46,5],[46,6,46,7],[46,8,46,9],[46,10,46,11],[46,13,46,14],[46,17,46,18],[46,19,46,20],[46,22,46,23],[45,15,45,16],[45,17,45,18],[45,19,45,20],[45,22,45,23],[46,24,46,25],[46,26,46,27],[46,28,46,29],[47,4,47,5],[47,6,47,7],[47,8,47,9],[47,10,47,11],[47,13,47,14],[47,15,47,16],[47,17,47,18],[47,19,47,20],[47,22,47,23],[47,24,47,25],[47,26,47,27],[47,28,47,29],[46,15,46,16],[48,4,48,5],[48,6,48,7],[48,8,48,9],[48,10,48,11],[48,13,48,14],[48,28,48,29],[50,16,50,17],[48,15,48,16],[48,17,48,18],[48,19,48,20],[48,22,48,23],[48,24,48,25],[48,26,48,27]]}
[]
[null,null,"MSP CALCULATOR"]
[null,null,"Levels",":",{"$f":"IF(Vacancy!E6=\"\",\"\",Vacancy!E6)","v":""},null,null,null,null,null,null,"Name",":",null,null,null,null,null,null,null,null,null,null,null,null,null,"Employment Category:",null,null,null,null,null,{"$f":"SUM(F13,Y11,Y13,Y15,E25,Z25,J40,Q51,K67,K77,D81)","v":0}]
[null,null,null,null,null,null,null,null,null,null,null,null,null,null,null,null,null,null,null,null,null,null,null,null,null,null,null,null,null,null,null,null,"TOTAL MATRIX POINTS"]
[null,null,{"$f":"IF(E3=\"First Level\",\"A. Performance Rating (20 pts)\",IF(E3=\"Second Level\",\"A. Performance Rating (15 pts)\",\"A. Performance Rating (35 pts)\"))","v":"A. Performance Rating (35 pts)"},null,null,null,null,null,null,null,null,{"$f":"IF(E3=\"First Level\",\"B. Education (15 pts.)\",IF(E3=\"Second Level\",\"B. Education (10 pts.)\",\"B. Education (5 pts.)\"))","v":"B. Education (5 pts.)"}]
[null,null,"New Graduates (No previous work experience)",null,null,null,null,null,null,null,null,"Required:"]
[false,null,null,null,null,null,null,{"$f":"IF(F9>=2.75,1,IF(F9>=2.5,3,IF(F9>=2.25,5,IF(F9>=2,7,IF(F9>=1.75,9,IF(F9>=1.5,11,IF(F9>=1.25,13,IF(F9>=1,15))))))))","v":false},null,null,null,{"$f":"IF(Vacancy!E10=\"\",\"\",Vacancy!E10)","v":""}]
[]
[null,null,"GWA",null,null,null,{"$f":"IF(F9>=2.75,2,IF(F9>=2.5,5,IF(F9>=2.25,8,IF(F9>=2,11,IF(F9>=1.75,14,IF(F9>=1.5,16,IF(F9>=1.25,18,IF(F9>=1,20))))))))","v":false},{"$f":"IF(E3=\"First Level\",(20*F11)/5,IF(E3=\"Second Level\",(15*F11)/5,IF(E3=\"Executive/Managerial\",(35*F11)/5,\"\")))","v":""},null,null,null,"Highest Educational Attainment:",null,null,null,null,null,null,null,null,null,null,null,null,"Total Score:"]
[]
[null,null,"Last Rating Period",null,null,null,null,{"$f":"IFERROR(IF(AND(A7=TRUE,E3=\"First Level\"),G9,IF(AND(A7=TRUE,E3=\"Second Level\"),H7,H9)),\"\")","v":""},null,null,null,"First Level:",null,null,null,null,null,null,null,null,null,null,null,{"$f":"VLOOKUP(P11,Educ_2!$A$11:$B$26,2,FALSE)","v":{"$error":"#N/A"}},{"$f":"IFERROR(VLOOKUP($L$7,Educ_2!$A$1:$Q$8,X11+1,FALSE),\"\")","v":""}]
[]
[false,null,"Total Score",null,":",{"$f":"IF(H11=FALSE,0,H11)","v":""},"pts.",null,null,null,null,"Second Level:",null,null,null,null,null,null,null,null,null,null,null,{"$f":"VLOOKUP(P13,Educ_2!$A$11:$B$26,2,FALSE)","v":{"$error":"#N/A"}},{"$f":"IFERROR(VLOOKUP($L$7,Educ_2!$A$1:$Q$8,X13+1,FALSE),\"\")","v":""}]
[]
[null,null,null,null,null,null,null,null,null,null,null,"Executive/Managerial:",null,null,null,null,null,null,null,null,null,null,null,{"$f":"VLOOKUP(P15,Educ_2!$A$11:$B$26,2,FALSE)","v":{"$error":"#N/A"}},{"$f":"IFERROR(VLOOKUP($L$7,Educ_2!$A$1:$Q$8,X15+1,FALSE),\"\")","v":""}]
[]
[null,null,null,null,null,null,null,null,null,null,null,null,null,null,null,null,null,null,null,null,null,null,null,null,{"$f":"SUM(Y11,Y13,Y15)","v":0}]
[]
[null,null,"C. Training (10 pts.)",null,null,null,null,null,null,null,null,null,null,null,null,null,null,null,null,null,null,null,null,null,{"$f":"IF(E3=\"Executive/Managerial\",\"D. Experience (10 pts)\",\"D. Experience (25 pts)\")","v":"D. Experience (25 pts)"}]
[null,null,null,null,null,null,null,null,null,null,null,null,null,null,null,null,null,null,null,"Coversion to YEAR"]
[true,null,null,null,{"$f":"IF(Vacancy!$R$10=\"None required\",0,IF(Vacancy!$R$10=\"\",\"\",Vacancy!$R$10))","v":""},"Required (hrs.)",null,null,null,null,null,null,null,null,null,null,null,null,null,null,"Year",null,{"$f":"T21","v":0},null,null,{"$f":"IF(Vacancy!$AA$10=\"None required\",0,IF(Vacancy!$AA$10=\"\",\"\",Vacancy!$AA$10))","v":""},"Required Exp."]
[]
[null,null,null,{"$f":"E23-E21","v":{"$error":"#VALUE!"}},null,"Relevant training hrs. acquired",null,null,null,null,null,null,null,null,null,null,null,null,null,null,"Month",null,{"$f":"T23/12","v":0},null,{"$f":"Z23-Z21","v":{"$error":"#VALUE!"}},{"$f":"SUM(W21,W23,W25)","v":0},"Relevant years of experience"]
[]
[null,null,null,null,{"$f":"IF(N3=\"\",0,IFERROR(IF(E21=E23,5,IF(E23>=E21,((5*D23)/Trg_Exp!$D$2)+5,0)),0))","v":0},"Total",null,null,null,null,null,null,null,null,null,null,null,null,null,null,"Day",null,{"$f":"T25/365","v":0},null,{"$f":"IFERROR(IF(AND(Z21=Z23),10,IF(Vacancy!E6=\"Executive/Managerial\",((10*Y23)/Trg_Exp!$K$2),IF(Z23>=Z21,((15*Y23)/Trg_Exp!$K$2)+10,0))),0)","v":0},{"$f":"IF(N3=\"\",0,IF(Y25<0,0,Y25))","v":0},"Total Score:"]
[]
[null,null,{"$f":"IF(Vacancy!E6=\"Second Level\",\"E. Accomplishment (15 pts.)\",\"E. Accomplishment (10 pts.)\")","v":"E. Accomplishment (10 pts.)"}]
[]
[null,null,null,null,"E.1  Awards/Citations/Commendations"]
[]
[false,null,null,null,"E.1.1. Unit Level",null,null,null,null,{"$f":"IF(A31=TRUE,1,\"\")","v":""}]
[]
[false,null,null,null,"E.1.2. University Level",null,null,null,null,{"$f":"IF(A33=TRUE,3,\"\")","v":""}]
[]
[false,null,null,null,"E.1.3. National/CSC Level",null,null,null,null,{"$f":"IF(A35=TRUE,5,\"\")","v":""}]
[null,null,null,null,"E.2. Innovations/ Systems Improvement"]
[false,null,null,null,null,null,null,null,null,{"$f":"IF(A37=TRUE,IF(Vacancy!E6=\"Second Level\",4,3),\"\")","v":""}]
[null,null,null,null,null,null,null,null,null,null,{"$f":"IF(E3=\"Second Level\",((SUM(J31,J33,J35)*11)/9),((SUM(J31,J33,J35)*7)/9))","v":0}]
[]
[null,null,null,null,"C.2. Total Score:",null,null,null,null,{"$f":"IF(E3=\"Second Level\",(15*SUM(K38,J37)/15),(10*SUM(K38,J37)/10))","v":0}]
[]
[null,null,{"$f":"IF(E3=\"Executive/Managerial\",\"F. Physical Characteristics and Personality Traits (10 pts.)\",\"F. Physical Characteristics and Personality Traits (5 pts.)\")","v":"F. Physical Characteristics and Personality Traits (5 pts.)"}]
[]
[null,null,null,null,"Supervisor",null,"Co-worker 1",null,"Co-worker 2",null,"Co-worker 3",null,null,"Supervisor",null,"Co-worker 1",null,"Co-worker 2",null,"Co-worker 3",null,null,"Supervisor",null,"Co-worker 1",null,"Co-worker 2",null,"Co-worker 3"]
[null,null,null,null,"ATTITUDE",null,null,null,null,null,null,null,null,"COMMITMENT",null,null,null,null,null,null,null,null,"APPEARANCE"]
[null,null,null,"F.1.1. ",null,null,null,null,null,null,null,null,"F.2.1. ",null,null,null,null,null,null,null,null,"F.3.1. "]
[null,null,null,"F.1.2. ",null,null,null,null,null,null,null,null,"F.2.2. ",null,null,null,null,null,null,null,null,"F.3.2. "]
[null,null,null,"F.1.3. ",null,null,null,null,null,null,null,null,"F.2.3. "]
[null,null,null,null,{"$f":"IF($E$3=\"Executive/Managerial\",(4*(SUM(E46:F48)/12)),(2*(SUM(E46:F48)/12)))","v":0},null,{"$f":"IF($E$3=\"Executive/Managerial\",(4*(SUM(G46:H48)/12)),(2*(SUM(G46:H48)/12)))","v":0},null,{"$f":"IF($E$3=\"Executive/Managerial\",(4*(SUM(I46:J48)/12)),(2*(SUM(I46:J48)/12)))","v":0},null,{"$f":"IF($E$3=\"Executive/Managerial\",(4*(SUM(K46:L48)/12)),(2*(SUM(K46:L48)/12)))","v":0},null,null,{"$f":"IF($E$3=\"Executive/Managerial\",(4*(SUM(N46:O48)/12)),(2*(SUM(N46:O48)/12)))","v":0},null,{"$f":"IF($E$3=\"Executive/Managerial\",(4*(SUM(P46:Q48)/12)),(2*(SUM(P46:Q48)/12)))","v":0},null,{"$f":"IF($E$3=\"Executive/Managerial\",(4*(SUM(R46:S48)/12)),(2*(SUM(R46:S48)/12)))","v":0},null,{"$f":"IF($E$3=\"Executive/Managerial\",(4*(SUM(T46:U48)/12)),(2*(SUM(T46:U48)/12)))","v":0},null,null,{"$f":"IF($E$3=\"Executive/Managerial\",(2*(SUM(W46:X48))/8),(1*(SUM(W46:X48))/8))","v":0},null,{"$f":"IF($E$3=\"Executive/Managerial\",(2*(SUM(Y46:Z48))/8),(1*(SUM(Y46:Z48))/8))","v":0},null,{"$f":"IF($E$3=\"Executive/Managerial\",(2*(SUM(AA46:AB48))/8),(1*(SUM(AA46:AB48))/8))","v":0},null,{"$f":"IF($E$3=\"Executive/Managerial\",(2*(SUM(AC46:AD48))/8),(1*(SUM(AC46:AD48))/8))","v":0}]
[null,null,null,null,null,null,"Supervisor",null,"Co-worker"]
[null,null,null,null,"Attitude",null,{"$f":"E49","v":0},null,{"$f":"SUM(G49:L49)/3","v":0},null,null,null,null,"Total Score PCPT:",null,null,{"$f":"IF(E3=\"Executive/Managerial\",SUM(G54:J54),SUM(G54:J54))","v":0}]
[null,null,null,null,"Commitment",null,{"$f":"N49","v":0},null,{"$f":"SUM(P49:U49)/3","v":0}]
[null,null,null,null,"Appearance",null,{"$f":"W49","v":0},null,{"$f":"SUM(Y49:AD49)/3","v":0}]
[null,null,null,null,null,null,{"$f":"SUM(G51:G53)*0.6","v":0},null,{"$f":"SUM(I51:I53)*0.4","v":0}]
[null,null,{"$f":"IF(E3=\"First Level\",\"G. Potential [Assessment Form No. 2] (3 pts.)\",\"G. Potential [Assessment Form No. 2] (5 pts.)\")","v":"G. Potential [Assessment Form No. 2] (5 pts.)"}]
[]
[null,null,null,"INTERVIEW"]
[]
[null,null,null,null,"G.1.1. Sound judgement",null,null,null,null,null,null,{"$f":"IF($E$3=\"First Level\",\"Not Applicable for First Level position\",\"\")","v":""}]
[null,null,null,null,"G.1.2. Analytical mind",null,null,null,null,null,null,{"$f":"IF($E$3=\"First Level\",\"Not Applicable for First Level position\",\"\")","v":""}]
[null,null,null,null,"G.1.3. The ability to motivate co-workers",null,null,null,null,null,null,{"$f":"IF($E$3=\"First Level\",\"Not Applicable for First Level position\",\"\")","v":""}]
[null,null,null,null,"G.1.4. Unifying Factor",null,null,null,null,null,null,{"$f":"IF($E$3=\"First Level\",\"Not Applicable for First Level position\",\"\")","v":""}]
[null,null,null,null,"G.1.5. Vision/foresight",null,null,null,null,null,null,{"$f":"IF($E$3=\"First Level\",\"Not Applicable for First Level position\",\"\")","v":""}]
[null,null,null,null,"G.2. Resourcefulness"]
[null,null,null,null,"G.3. Creativity/ Ingenuity "]
[]
[null,null,null,"TOTAL POINTS FOR POTENTIAL",null,null,null,null,null,null,{"$f":"IF(E3=\"First Level\",(3*(SUM(K64:K65)/8)),(5*(SUM(K59:K65)/28)))","v":0}]
[]
[null,null,{"$f":"IF(E3=\"First Level\",\"H. Written/ Skills Examination (12 pts.)\",\"H. Written/ Skills Examination (15 pts.)\")","v":"H. Written/ Skills Examination (15 pts.)"}]
[null,null,null,null,null,null,null,null,null,null,{"$f":"IFERROR(SUM(K59:K65)/7,0)","v":0}]
[null,null,null,"WRITTEN/SKILLS EXAMINATION"]
[]
[null,null,null,null,"Perfect/Entire Score",null,null,"="]
[null,null,null,null,"Raw Score",null,null,"="]
[]
[]
[null,null,null,"TOTAL FOR EXAMINATION",null,null,null,null,null,null,{"$f":"IFERROR(IF(E3=\"First Level\",IF(K74>K73,0,(K74*12)/K73),IF(K74>K73,0,(K74*15)/K73)),0)","v":0}]
[]
[null,null,"I. Public Service"]
[]
[null,null,null,null,"Additional Pts. in excess of Total Score"]

{"sheet":"AP36","index":43,"n_rows":81,"n_cols":33,"rows_kept":81,"cut":false,"hidden":false,"merged":[[1,2,1,29],[2,4,2,9],[2,13,2,22],[2,27,2,30],[2,32,2,33],[45,4,45,5],[45,6,45,7],[45,8,45,9],[45,10,45,11],[45,13,45,14],[10,15,10,22],[12,15,12,22],[14,15,14,22],[19,19,19,22],[35,4,37,7],[45,28,45,29],[45,24,45,25],[45,26,45,27],[6,11,6,22],[46,4,46,5],[46,6,46,7],[46,8,46,9],[46,10,46,11],[46,13,46,14],[46,17,46,18],[46,19,46,20],[46,22,46,23],[45,15,45,16],[45,17,45,18],[45,19,45,20],[45,22,45,23],[46,24,46,25],[46,26,46,27],[46,28,46,29],[47,4,47,5],[47,6,47,7],[47,8,47,9],[47,10,47,11],[47,13,47,14],[47,15,47,16],[47,17,47,18],[47,19,47,20],[47,22,47,23],[47,24,47,25],[47,26,47,27],[47,28,47,29],[46,15,46,16],[48,4,48,5],[48,6,48,7],[48,8,48,9],[48,10,48,11],[48,13,48,14],[48,28,48,29],[50,16,50,17],[48,15,48,16],[48,17,48,18],[48,19,48,20],[48,22,48,23],[48,24,48,25],[48,26,48,27]]}
[]
[null,null,"MSP CALCULATOR"]
[null,null,"Levels",":",{"$f":"IF(Vacancy!E6=\"\",\"\",Vacancy!E6)","v":""},null,null,null,null,null,null,"Name",":",null,null,null,null,null,null,null,null,null,null,null,null,null,"Employment Category:",null,null,null,null,null,{"$f":"SUM(F13,Y11,Y13,Y15,E25,Z25,J40,Q51,K67,K77,D81)","v":0}]
[null,null,null,null,null,null,null,null,null,null,null,null,null,null,null,null,null,null,null,null,null,null,null,null,null,null,null,null,null,null,null,null,"TOTAL MATRIX POINTS"]
[null,null,{"$f":"IF(E3=\"First Level\",\"A. Performance Rating (20 pts)\",IF(E3=\"Second Level\",\"A. Performance Rating (15 pts)\",\"A. Performance Rating (35 pts)\"))","v":"A. Performance Rating (35 pts)"},null,null,null,null,null,null,null,null,{"$f":"IF(E3=\"First Level\",\"B. Education (15 pts.)\",IF(E3=\"Second Level\",\"B. Education (10 pts.)\",\"B. Education (5 pts.)\"))","v":"B. Education (5 pts.)"}]
[null,null,"New Graduates (No previous work experience)",null,null,null,null,null,null,null,null,"Required:"]
[false,null,null,null,null,null,null,{"$f":"IF(F9>=2.75,1,IF(F9>=2.5,3,IF(F9>=2.25,5,IF(F9>=2,7,IF(F9>=1.75,9,IF(F9>=1.5,11,IF(F9>=1.25,13,IF(F9>=1,15))))))))","v":false},null,null,null,{"$f":"IF(Vacancy!E10=\"\",\"\",Vacancy!E10)","v":""}]
[]
[null,null,"GWA",null,null,null,{"$f":"IF(F9>=2.75,2,IF(F9>=2.5,5,IF(F9>=2.25,8,IF(F9>=2,11,IF(F9>=1.75,14,IF(F9>=1.5,16,IF(F9>=1.25,18,IF(F9>=1,20))))))))","v":false},{"$f":"IF(E3=\"First Level\",(20*F11)/5,IF(E3=\"Second Level\",(15*F11)/5,IF(E3=\"Executive/Managerial\",(35*F11)/5,\"\")))","v":""},null,null,null,"Highest Educational Attainment:",null,null,null,null,null,null,null,null,null,null,null,null,"Total Score:"]
[]
[null,null,"Last Rating Period",null,null,null,null,{"$f":"IFERROR(IF(AND(A7=TRUE,E3=\"First Level\"),G9,IF(AND(A7=TRUE,E3=\"Second Level\"),H7,H9)),\"\")","v":""},null,null,null,"First Level:",null,null,null,null,null,null,null,null,null,null,null,{"$f":"VLOOKUP(P11,Educ_2!$A$11:$B$26,2,FALSE)","v":{"$error":"#N/A"}},{"$f":"IFERROR(VLOOKUP($L$7,Educ_2!$A$1:$Q$8,X11+1,FALSE),\"\")","v":""}]
[]
[false,null,"Total Score",null,":",{"$f":"IF(H11=FALSE,0,H11)","v":""},"pts.",null,null,null,null,"Second Level:",null,null,null,null,null,null,null,null,null,null,null,{"$f":"VLOOKUP(P13,Educ_2!$A$11:$B$26,2,FALSE)","v":{"$error":"#N/A"}},{"$f":"IFERROR(VLOOKUP($L$7,Educ_2!$A$1:$Q$8,X13+1,FALSE),\"\")","v":""}]
[]
[null,null,null,null,null,null,null,null,null,null,null,"Executive/Managerial:",null,null,null,null,null,null,null,null,null,null,null,{"$f":"VLOOKUP(P15,Educ_2!$A$11:$B$26,2,FALSE)","v":{"$error":"#N/A"}},{"$f":"IFERROR(VLOOKUP($L$7,Educ_2!$A$1:$Q$8,X15+1,FALSE),\"\")","v":""}]
[]
[null,null,null,null,null,null,null,null,null,null,null,null,null,null,null,null,null,null,null,null,null,null,null,null,{"$f":"SUM(Y11,Y13,Y15)","v":0}]
[]
[null,null,"C. Training (10 pts.)",null,null,null,null,null,null,null,null,null,null,null,null,null,null,null,null,null,null,null,null,null,{"$f":"IF(E3=\"Executive/Managerial\",\"D. Experience (10 pts)\",\"D. Experience (25 pts)\")","v":"D. Experience (25 pts)"}]
[null,null,null,null,null,null,null,null,null,null,null,null,null,null,null,null,null,null,null,"Coversion to YEAR"]
[true,null,null,null,{"$f":"IF(Vacancy!$R$10=\"None required\",0,IF(Vacancy!$R$10=\"\",\"\",Vacancy!$R$10))","v":""},"Required (hrs.)",null,null,null,null,null,null,null,null,null,null,null,null,null,null,"Year",null,{"$f":"T21","v":0},null,null,{"$f":"IF(Vacancy!$AA$10=\"None required\",0,IF(Vacancy!$AA$10=\"\",\"\",Vacancy!$AA$10))","v":""},"Required Exp."]
[]
[null,null,null,{"$f":"E23-E21","v":{"$error":"#VALUE!"}},null,"Relevant training hrs. acquired",null,null,null,null,null,null,null,null,null,null,null,null,null,null,"Month",null,{"$f":"T23/12","v":0},null,{"$f":"Z23-Z21","v":{"$error":"#VALUE!"}},{"$f":"SUM(W21,W23,W25)","v":0},"Relevant years of experience"]
[]
[null,null,null,null,{"$f":"IF(N3=\"\",0,IFERROR(IF(E21=E23,5,IF(E23>=E21,((5*D23)/Trg_Exp!$D$2)+5,0)),0))","v":0},"Total",null,null,null,null,null,null,null,null,null,null,null,null,null,null,"Day",null,{"$f":"T25/365","v":0},null,{"$f":"IFERROR(IF(AND(Z21=Z23),10,IF(Vacancy!E6=\"Executive/Managerial\",((10*Y23)/Trg_Exp!$K$2),IF(Z23>=Z21,((15*Y23)/Trg_Exp!$K$2)+10,0))),0)","v":0},{"$f":"IF(N3=\"\",0,IF(Y25<0,0,Y25))","v":0},"Total Score:"]
[]
[null,null,{"$f":"IF(Vacancy!E6=\"Second Level\",\"E. Accomplishment (15 pts.)\",\"E. Accomplishment (10 pts.)\")","v":"E. Accomplishment (10 pts.)"}]
[]
[null,null,null,null,"E.1  Awards/Citations/Commendations"]
[]
[false,null,null,null,"E.1.1. Unit Level",null,null,null,null,{"$f":"IF(A31=TRUE,1,\"\")","v":""}]
[]
[false,null,null,null,"E.1.2. University Level",null,null,null,null,{"$f":"IF(A33=TRUE,3,\"\")","v":""}]
[]
[false,null,null,null,"E.1.3. National/CSC Level",null,null,null,null,{"$f":"IF(A35=TRUE,5,\"\")","v":""}]
[null,null,null,null,"E.2. Innovations/ Systems Improvement"]
[false,null,null,null,null,null,null,null,null,{"$f":"IF(A37=TRUE,IF(Vacancy!E6=\"Second Level\",4,3),\"\")","v":""}]
[null,null,null,null,null,null,null,null,null,null,{"$f":"IF(E3=\"Second Level\",((SUM(J31,J33,J35)*11)/9),((SUM(J31,J33,J35)*7)/9))","v":0}]
[]
[null,null,null,null,"C.2. Total Score:",null,null,null,null,{"$f":"IF(E3=\"Second Level\",(15*SUM(K38,J37)/15),(10*SUM(K38,J37)/10))","v":0}]
[]
[null,null,{"$f":"IF(E3=\"Executive/Managerial\",\"F. Physical Characteristics and Personality Traits (10 pts.)\",\"F. Physical Characteristics and Personality Traits (5 pts.)\")","v":"F. Physical Characteristics and Personality Traits (5 pts.)"}]
[]
[null,null,null,null,"Supervisor",null,"Co-worker 1",null,"Co-worker 2",null,"Co-worker 3",null,null,"Supervisor",null,"Co-worker 1",null,"Co-worker 2",null,"Co-worker 3",null,null,"Supervisor",null,"Co-worker 1",null,"Co-worker 2",null,"Co-worker 3"]
[null,null,null,null,"ATTITUDE",null,null,null,null,null,null,null,null,"COMMITMENT",null,null,null,null,null,null,null,null,"APPEARANCE"]
[null,null,null,"F.1.1. ",null,null,null,null,null,null,null,null,"F.2.1. ",null,null,null,null,null,null,null,null,"F.3.1. "]
[null,null,null,"F.1.2. ",null,null,null,null,null,null,null,null,"F.2.2. ",null,null,null,null,null,null,null,null,"F.3.2. "]
[null,null,null,"F.1.3. ",null,null,null,null,null,null,null,null,"F.2.3. "]
[null,null,null,null,{"$f":"IF($E$3=\"Executive/Managerial\",(4*(SUM(E46:F48)/12)),(2*(SUM(E46:F48)/12)))","v":0},null,{"$f":"IF($E$3=\"Executive/Managerial\",(4*(SUM(G46:H48)/12)),(2*(SUM(G46:H48)/12)))","v":0},null,{"$f":"IF($E$3=\"Executive/Managerial\",(4*(SUM(I46:J48)/12)),(2*(SUM(I46:J48)/12)))","v":0},null,{"$f":"IF($E$3=\"Executive/Managerial\",(4*(SUM(K46:L48)/12)),(2*(SUM(K46:L48)/12)))","v":0},null,null,{"$f":"IF($E$3=\"Executive/Managerial\",(4*(SUM(N46:O48)/12)),(2*(SUM(N46:O48)/12)))","v":0},null,{"$f":"IF($E$3=\"Executive/Managerial\",(4*(SUM(P46:Q48)/12)),(2*(SUM(P46:Q48)/12)))","v":0},null,{"$f":"IF($E$3=\"Executive/Managerial\",(4*(SUM(R46:S48)/12)),(2*(SUM(R46:S48)/12)))","v":0},null,{"$f":"IF($E$3=\"Executive/Managerial\",(4*(SUM(T46:U48)/12)),(2*(SUM(T46:U48)/12)))","v":0},null,null,{"$f":"IF($E$3=\"Executive/Managerial\",(2*(SUM(W46:X48))/8),(1*(SUM(W46:X48))/8))","v":0},null,{"$f":"IF($E$3=\"Executive/Managerial\",(2*(SUM(Y46:Z48))/8),(1*(SUM(Y46:Z48))/8))","v":0},null,{"$f":"IF($E$3=\"Executive/Managerial\",(2*(SUM(AA46:AB48))/8),(1*(SUM(AA46:AB48))/8))","v":0},null,{"$f":"IF($E$3=\"Executive/Managerial\",(2*(SUM(AC46:AD48))/8),(1*(SUM(AC46:AD48))/8))","v":0}]
[null,null,null,null,null,null,"Supervisor",null,"Co-worker"]
[null,null,null,null,"Attitude",null,{"$f":"E49","v":0},null,{"$f":"SUM(G49:L49)/3","v":0},null,null,null,null,"Total Score PCPT:",null,null,{"$f":"IF(E3=\"Executive/Managerial\",SUM(G54:J54),SUM(G54:J54))","v":0}]
[null,null,null,null,"Commitment",null,{"$f":"N49","v":0},null,{"$f":"SUM(P49:U49)/3","v":0}]
[null,null,null,null,"Appearance",null,{"$f":"W49","v":0},null,{"$f":"SUM(Y49:AD49)/3","v":0}]
[null,null,null,null,null,null,{"$f":"SUM(G51:G53)*0.6","v":0},null,{"$f":"SUM(I51:I53)*0.4","v":0}]
[null,null,{"$f":"IF(E3=\"First Level\",\"G. Potential [Assessment Form No. 2] (3 pts.)\",\"G. Potential [Assessment Form No. 2] (5 pts.)\")","v":"G. Potential [Assessment Form No. 2] (5 pts.)"}]
[]
[null,null,null,"INTERVIEW"]
[]
[null,null,null,null,"G.1.1. Sound judgement",null,null,null,null,null,null,{"$f":"IF($E$3=\"First Level\",\"Not Applicable for First Level position\",\"\")","v":""}]
[null,null,null,null,"G.1.2. Analytical mind",null,null,null,null,null,null,{"$f":"IF($E$3=\"First Level\",\"Not Applicable for First Level position\",\"\")","v":""}]
[null,null,null,null,"G.1.3. The ability to motivate co-workers",null,null,null,null,null,null,{"$f":"IF($E$3=\"First Level\",\"Not Applicable for First Level position\",\"\")","v":""}]
[null,null,null,null,"G.1.4. Unifying Factor",null,null,null,null,null,null,{"$f":"IF($E$3=\"First Level\",\"Not Applicable for First Level position\",\"\")","v":""}]
[null,null,null,null,"G.1.5. Vision/foresight",null,null,null,null,null,null,{"$f":"IF($E$3=\"First Level\",\"Not Applicable for First Level position\",\"\")","v":""}]
[null,null,null,null,"G.2. Resourcefulness"]
[null,null,null,null,"G.3. Creativity/ Ingenuity "]
[]
[null,null,null,"TOTAL POINTS FOR POTENTIAL",null,null,null,null,null,null,{"$f":"IF(E3=\"First Level\",(3*(SUM(K64:K65)/8)),(5*(SUM(K59:K65)/28)))","v":0}]
[]
[null,null,{"$f":"IF(E3=\"First Level\",\"H. Written/ Skills Examination (12 pts.)\",\"H. Written/ Skills Examination (15 pts.)\")","v":"H. Written/ Skills Examination (15 pts.)"}]
[null,null,null,null,null,null,null,null,null,null,{"$f":"IFERROR(SUM(K59:K65)/7,0)","v":0}]
[null,null,null,"WRITTEN/SKILLS EXAMINATION"]
[]
[null,null,null,null,"Perfect/Entire Score",null,null,"="]
[null,null,null,null,"Raw Score",null,null,"="]
[]
[]
[null,null,null,"TOTAL FOR EXAMINATION",null,null,null,null,null,null,{"$f":"IFERROR(IF(E3=\"First Level\",IF(K74>K73,0,(K74*12)/K73),IF(K74>K73,0,(K74*15)/K73)),0)","v":0}]
[]
[null,null,"I. Public Service"]
[]
[null,null,null,null,"Additional Pts. in excess of Total Score"]

{"sheet":"AP37","index":44,"n_rows":81,"n_cols":33,"rows_kept":81,"cut":false,"hidden":false,"merged":[[1,2,1,29],[2,4,2,9],[2,13,2,22],[2,27,2,30],[2,32,2,33],[45,4,45,5],[45,6,45,7],[45,8,45,9],[45,10,45,11],[45,13,45,14],[10,15,10,22],[12,15,12,22],[14,15,14,22],[19,19,19,22],[35,4,37,7],[45,28,45,29],[45,24,45,25],[45,26,45,27],[6,11,6,22],[46,4,46,5],[46,6,46,7],[46,8,46,9],[46,10,46,11],[46,13,46,14],[46,17,46,18],[46,19,46,20],[46,22,46,23],[45,15,45,16],[45,17,45,18],[45,19,45,20],[45,22,45,23],[46,24,46,25],[46,26,46,27],[46,28,46,29],[47,4,47,5],[47,6,47,7],[47,8,47,9],[47,10,47,11],[47,13,47,14],[47,15,47,16],[47,17,47,18],[47,19,47,20],[47,22,47,23],[47,24,47,25],[47,26,47,27],[47,28,47,29],[46,15,46,16],[48,4,48,5],[48,6,48,7],[48,8,48,9],[48,10,48,11],[48,13,48,14],[48,28,48,29],[50,16,50,17],[48,15,48,16],[48,17,48,18],[48,19,48,20],[48,22,48,23],[48,24,48,25],[48,26,48,27]]}
[]
[null,null,"MSP CALCULATOR"]
[null,null,"Levels",":",{"$f":"IF(Vacancy!E6=\"\",\"\",Vacancy!E6)","v":""},null,null,null,null,null,null,"Name",":",null,null,null,null,null,null,null,null,null,null,null,null,null,"Employment Category:",null,null,null,null,null,{"$f":"SUM(F13,Y11,Y13,Y15,E25,Z25,J40,Q51,K67,K77,D81)","v":0}]
[null,null,null,null,null,null,null,null,null,null,null,null,null,null,null,null,null,null,null,null,null,null,null,null,null,null,null,null,null,null,null,null,"TOTAL MATRIX POINTS"]
[null,null,{"$f":"IF(E3=\"First Level\",\"A. Performance Rating (20 pts)\",IF(E3=\"Second Level\",\"A. Performance Rating (15 pts)\",\"A. Performance Rating (35 pts)\"))","v":"A. Performance Rating (35 pts)"},null,null,null,null,null,null,null,null,{"$f":"IF(E3=\"First Level\",\"B. Education (15 pts.)\",IF(E3=\"Second Level\",\"B. Education (10 pts.)\",\"B. Education (5 pts.)\"))","v":"B. Education (5 pts.)"}]
[null,null,"New Graduates (No previous work experience)",null,null,null,null,null,null,null,null,"Required:"]
[false,null,null,null,null,null,null,{"$f":"IF(F9>=2.75,1,IF(F9>=2.5,3,IF(F9>=2.25,5,IF(F9>=2,7,IF(F9>=1.75,9,IF(F9>=1.5,11,IF(F9>=1.25,13,IF(F9>=1,15))))))))","v":false},null,null,null,{"$f":"IF(Vacancy!E10=\"\",\"\",Vacancy!E10)","v":""}]
[]
[null,null,"GWA",null,null,null,{"$f":"IF(F9>=2.75,2,IF(F9>=2.5,5,IF(F9>=2.25,8,IF(F9>=2,11,IF(F9>=1.75,14,IF(F9>=1.5,16,IF(F9>=1.25,18,IF(F9>=1,20))))))))","v":false},{"$f":"IF(E3=\"First Level\",(20*F11)/5,IF(E3=\"Second Level\",(15*F11)/5,IF(E3=\"Executive/Managerial\",(35*F11)/5,\"\")))","v":""},null,null,null,"Highest Educational Attainment:",null,null,null,null,null,null,null,null,null,null,null,null,"Total Score:"]
[]
[null,null,"Last Rating Period",null,null,null,null,{"$f":"IFERROR(IF(AND(A7=TRUE,E3=\"First Level\"),G9,IF(AND(A7=TRUE,E3=\"Second Level\"),H7,H9)),\"\")","v":""},null,null,null,"First Level:",null,null,null,null,null,null,null,null,null,null,null,{"$f":"VLOOKUP(P11,Educ_2!$A$11:$B$26,2,FALSE)","v":{"$error":"#N/A"}},{"$f":"IFERROR(VLOOKUP($L$7,Educ_2!$A$1:$Q$8,X11+1,FALSE),\"\")","v":""}]
[]
[false,null,"Total Score",null,":",{"$f":"IF(H11=FALSE,0,H11)","v":""},"pts.",null,null,null,null,"Second Level:",null,null,null,null,null,null,null,null,null,null,null,{"$f":"VLOOKUP(P13,Educ_2!$A$11:$B$26,2,FALSE)","v":{"$error":"#N/A"}},{"$f":"IFERROR(VLOOKUP($L$7,Educ_2!$A$1:$Q$8,X13+1,FALSE),\"\")","v":""}]
[]
[null,null,null,null,null,null,null,null,null,null,null,"Executive/Managerial:",null,null,null,null,null,null,null,null,null,null,null,{"$f":"VLOOKUP(P15,Educ_2!$A$11:$B$26,2,FALSE)","v":{"$error":"#N/A"}},{"$f":"IFERROR(VLOOKUP($L$7,Educ_2!$A$1:$Q$8,X15+1,FALSE),\"\")","v":""}]
[]
[null,null,null,null,null,null,null,null,null,null,null,null,null,null,null,null,null,null,null,null,null,null,null,null,{"$f":"SUM(Y11,Y13,Y15)","v":0}]
[]
[null,null,"C. Training (10 pts.)",null,null,null,null,null,null,null,null,null,null,null,null,null,null,null,null,null,null,null,null,null,{"$f":"IF(E3=\"Executive/Managerial\",\"D. Experience (10 pts)\",\"D. Experience (25 pts)\")","v":"D. Experience (25 pts)"}]
[null,null,null,null,null,null,null,null,null,null,null,null,null,null,null,null,null,null,null,"Coversion to YEAR"]
[true,null,null,null,{"$f":"IF(Vacancy!$R$10=\"None required\",0,IF(Vacancy!$R$10=\"\",\"\",Vacancy!$R$10))","v":""},"Required (hrs.)",null,null,null,null,null,null,null,null,null,null,null,null,null,null,"Year",null,{"$f":"T21","v":0},null,null,{"$f":"IF(Vacancy!$AA$10=\"None required\",0,IF(Vacancy!$AA$10=\"\",\"\",Vacancy!$AA$10))","v":""},"Required Exp."]
[]
[null,null,null,{"$f":"E23-E21","v":{"$error":"#VALUE!"}},null,"Relevant training hrs. acquired",null,null,null,null,null,null,null,null,null,null,null,null,null,null,"Month",null,{"$f":"T23/12","v":0},null,{"$f":"Z23-Z21","v":{"$error":"#VALUE!"}},{"$f":"SUM(W21,W23,W25)","v":0},"Relevant years of experience"]
[]
[null,null,null,null,{"$f":"IF(N3=\"\",0,IFERROR(IF(E21=E23,5,IF(E23>=E21,((5*D23)/Trg_Exp!$D$2)+5,0)),0))","v":0},"Total",null,null,null,null,null,null,null,null,null,null,null,null,null,null,"Day",null,{"$f":"T25/365","v":0},null,{"$f":"IFERROR(IF(AND(Z21=Z23),10,IF(Vacancy!E6=\"Executive/Managerial\",((10*Y23)/Trg_Exp!$K$2),IF(Z23>=Z21,((15*Y23)/Trg_Exp!$K$2)+10,0))),0)","v":0},{"$f":"IF(N3=\"\",0,IF(Y25<0,0,Y25))","v":0},"Total Score:"]
[]
[null,null,{"$f":"IF(Vacancy!E6=\"Second Level\",\"E. Accomplishment (15 pts.)\",\"E. Accomplishment (10 pts.)\")","v":"E. Accomplishment (10 pts.)"}]
[]
[null,null,null,null,"E.1  Awards/Citations/Commendations"]
[]
[false,null,null,null,"E.1.1. Unit Level",null,null,null,null,{"$f":"IF(A31=TRUE,1,\"\")","v":""}]
[]
[false,null,null,null,"E.1.2. University Level",null,null,null,null,{"$f":"IF(A33=TRUE,3,\"\")","v":""}]
[]
[false,null,null,null,"E.1.3. National/CSC Level",null,null,null,null,{"$f":"IF(A35=TRUE,5,\"\")","v":""}]
[null,null,null,null,"E.2. Innovations/ Systems Improvement"]
[false,null,null,null,null,null,null,null,null,{"$f":"IF(A37=TRUE,IF(Vacancy!E6=\"Second Level\",4,3),\"\")","v":""}]
[null,null,null,null,null,null,null,null,null,null,{"$f":"IF(E3=\"Second Level\",((SUM(J31,J33,J35)*11)/9),((SUM(J31,J33,J35)*7)/9))","v":0}]
[]
[null,null,null,null,"C.2. Total Score:",null,null,null,null,{"$f":"IF(E3=\"Second Level\",(15*SUM(K38,J37)/15),(10*SUM(K38,J37)/10))","v":0}]
[]
[null,null,{"$f":"IF(E3=\"Executive/Managerial\",\"F. Physical Characteristics and Personality Traits (10 pts.)\",\"F. Physical Characteristics and Personality Traits (5 pts.)\")","v":"F. Physical Characteristics and Personality Traits (5 pts.)"}]
[]
[null,null,null,null,"Supervisor",null,"Co-worker 1",null,"Co-worker 2",null,"Co-worker 3",null,null,"Supervisor",null,"Co-worker 1",null,"Co-worker 2",null,"Co-worker 3",null,null,"Supervisor",null,"Co-worker 1",null,"Co-worker 2",null,"Co-worker 3"]
[null,null,null,null,"ATTITUDE",null,null,null,null,null,null,null,null,"COMMITMENT",null,null,null,null,null,null,null,null,"APPEARANCE"]
[null,null,null,"F.1.1. ",null,null,null,null,null,null,null,null,"F.2.1. ",null,null,null,null,null,null,null,null,"F.3.1. "]
[null,null,null,"F.1.2. ",null,null,null,null,null,null,null,null,"F.2.2. ",null,null,null,null,null,null,null,null,"F.3.2. "]
[null,null,null,"F.1.3. ",null,null,null,null,null,null,null,null,"F.2.3. "]
[null,null,null,null,{"$f":"IF($E$3=\"Executive/Managerial\",(4*(SUM(E46:F48)/12)),(2*(SUM(E46:F48)/12)))","v":0},null,{"$f":"IF($E$3=\"Executive/Managerial\",(4*(SUM(G46:H48)/12)),(2*(SUM(G46:H48)/12)))","v":0},null,{"$f":"IF($E$3=\"Executive/Managerial\",(4*(SUM(I46:J48)/12)),(2*(SUM(I46:J48)/12)))","v":0},null,{"$f":"IF($E$3=\"Executive/Managerial\",(4*(SUM(K46:L48)/12)),(2*(SUM(K46:L48)/12)))","v":0},null,null,{"$f":"IF($E$3=\"Executive/Managerial\",(4*(SUM(N46:O48)/12)),(2*(SUM(N46:O48)/12)))","v":0},null,{"$f":"IF($E$3=\"Executive/Managerial\",(4*(SUM(P46:Q48)/12)),(2*(SUM(P46:Q48)/12)))","v":0},null,{"$f":"IF($E$3=\"Executive/Managerial\",(4*(SUM(R46:S48)/12)),(2*(SUM(R46:S48)/12)))","v":0},null,{"$f":"IF($E$3=\"Executive/Managerial\",(4*(SUM(T46:U48)/12)),(2*(SUM(T46:U48)/12)))","v":0},null,null,{"$f":"IF($E$3=\"Executive/Managerial\",(2*(SUM(W46:X48))/8),(1*(SUM(W46:X48))/8))","v":0},null,{"$f":"IF($E$3=\"Executive/Managerial\",(2*(SUM(Y46:Z48))/8),(1*(SUM(Y46:Z48))/8))","v":0},null,{"$f":"IF($E$3=\"Executive/Managerial\",(2*(SUM(AA46:AB48))/8),(1*(SUM(AA46:AB48))/8))","v":0},null,{"$f":"IF($E$3=\"Executive/Managerial\",(2*(SUM(AC46:AD48))/8),(1*(SUM(AC46:AD48))/8))","v":0}]
[null,null,null,null,null,null,"Supervisor",null,"Co-worker"]
[null,null,null,null,"Attitude",null,{"$f":"E49","v":0},null,{"$f":"SUM(G49:L49)/3","v":0},null,null,null,null,"Total Score PCPT:",null,null,{"$f":"IF(E3=\"Executive/Managerial\",SUM(G54:J54),SUM(G54:J54))","v":0}]
[null,null,null,null,"Commitment",null,{"$f":"N49","v":0},null,{"$f":"SUM(P49:U49)/3","v":0}]
[null,null,null,null,"Appearance",null,{"$f":"W49","v":0},null,{"$f":"SUM(Y49:AD49)/3","v":0}]
[null,null,null,null,null,null,{"$f":"SUM(G51:G53)*0.6","v":0},null,{"$f":"SUM(I51:I53)*0.4","v":0}]
[null,null,{"$f":"IF(E3=\"First Level\",\"G. Potential [Assessment Form No. 2] (3 pts.)\",\"G. Potential [Assessment Form No. 2] (5 pts.)\")","v":"G. Potential [Assessment Form No. 2] (5 pts.)"}]
[]
[null,null,null,"INTERVIEW"]
[]
[null,null,null,null,"G.1.1. Sound judgement",null,null,null,null,null,null,{"$f":"IF($E$3=\"First Level\",\"Not Applicable for First Level position\",\"\")","v":""}]
[null,null,null,null,"G.1.2. Analytical mind",null,null,null,null,null,null,{"$f":"IF($E$3=\"First Level\",\"Not Applicable for First Level position\",\"\")","v":""}]
[null,null,null,null,"G.1.3. The ability to motivate co-workers",null,null,null,null,null,null,{"$f":"IF($E$3=\"First Level\",\"Not Applicable for First Level position\",\"\")","v":""}]
[null,null,null,null,"G.1.4. Unifying Factor",null,null,null,null,null,null,{"$f":"IF($E$3=\"First Level\",\"Not Applicable for First Level position\",\"\")","v":""}]
[null,null,null,null,"G.1.5. Vision/foresight",null,null,null,null,null,null,{"$f":"IF($E$3=\"First Level\",\"Not Applicable for First Level position\",\"\")","v":""}]
[null,null,null,null,"G.2. Resourcefulness"]
[null,null,null,null,"G.3. Creativity/ Ingenuity "]
[]
[null,null,null,"TOTAL POINTS FOR POTENTIAL",null,null,null,null,null,null,{"$f":"IF(E3=\"First Level\",(3*(SUM(K64:K65)/8)),(5*(SUM(K59:K65)/28)))","v":0}]
[]
[null,null,{"$f":"IF(E3=\"First Level\",\"H. Written/ Skills Examination (12 pts.)\",\"H. Written/ Skills Examination (15 pts.)\")","v":"H. Written/ Skills Examination (15 pts.)"}]
[null,null,null,null,null,null,null,null,null,null,{"$f":"IFERROR(SUM(K59:K65)/7,0)","v":0}]
[null,null,null,"WRITTEN/SKILLS EXAMINATION"]
[]
[null,null,null,null,"Perfect/Entire Score",null,null,"="]
[null,null,null,null,"Raw Score",null,null,"="]
[]
[]
[null,null,null,"TOTAL FOR EXAMINATION",null,null,null,null,null,null,{"$f":"IFERROR(IF(E3=\"First Level\",IF(K74>K73,0,(K74*12)/K73),IF(K74>K73,0,(K74*15)/K73)),0)","v":0}]
[]
[null,null,"I. Public Service"]
[]
[null,null,null,null,"Additional Pts. in excess of Total Score"]

{"sheet":"AP38","index":45,"n_rows":81,"n_cols":33,"rows_kept":81,"cut":false,"hidden":false,"merged":[[1,2,1,29],[2,4,2,9],[2,13,2,22],[2,27,2,30],[2,32,2,33],[45,4,45,5],[45,6,45,7],[45,8,45,9],[45,10,45,11],[45,13,45,14],[10,15,10,22],[12,15,12,22],[14,15,14,22],[19,19,19,22],[35,4,37,7],[45,28,45,29],[45,24,45,25],[45,26,45,27],[6,11,6,22],[46,4,46,5],[46,6,46,7],[46,8,46,9],[46,10,46,11],[46,13,46,14],[46,17,46,18],[46,19,46,20],[46,22,46,23],[45,15,45,16],[45,17,45,18],[45,19,45,20],[45,22,45,23],[46,24,46,25],[46,26,46,27],[46,28,46,29],[47,4,47,5],[47,6,47,7],[47,8,47,9],[47,10,47,11],[47,13,47,14],[47,15,47,16],[47,17,47,18],[47,19,47,20],[47,22,47,23],[47,24,47,25],[47,26,47,27],[47,28,47,29],[46,15,46,16],[48,4,48,5],[48,6,48,7],[48,8,48,9],[48,10,48,11],[48,13,48,14],[48,28,48,29],[50,16,50,17],[48,15,48,16],[48,17,48,18],[48,19,48,20],[48,22,48,23],[48,24,48,25],[48,26,48,27]]}
[]
[null,null,"MSP CALCULATOR"]
[null,null,"Levels",":",{"$f":"IF(Vacancy!E6=\"\",\"\",Vacancy!E6)","v":""},null,null,null,null,null,null,"Name",":",null,null,null,null,null,null,null,null,null,null,null,null,null,"Employment Category:",null,null,null,null,null,{"$f":"SUM(F13,Y11,Y13,Y15,E25,Z25,J40,Q51,K67,K77,D81)","v":0}]
[null,null,null,null,null,null,null,null,null,null,null,null,null,null,null,null,null,null,null,null,null,null,null,null,null,null,null,null,null,null,null,null,"TOTAL MATRIX POINTS"]
[null,null,{"$f":"IF(E3=\"First Level\",\"A. Performance Rating (20 pts)\",IF(E3=\"Second Level\",\"A. Performance Rating (15 pts)\",\"A. Performance Rating (35 pts)\"))","v":"A. Performance Rating (35 pts)"},null,null,null,null,null,null,null,null,{"$f":"IF(E3=\"First Level\",\"B. Education (15 pts.)\",IF(E3=\"Second Level\",\"B. Education (10 pts.)\",\"B. Education (5 pts.)\"))","v":"B. Education (5 pts.)"}]
[null,null,"New Graduates (No previous work experience)",null,null,null,null,null,null,null,null,"Required:"]
[false,null,null,null,null,null,null,{"$f":"IF(F9>=2.75,1,IF(F9>=2.5,3,IF(F9>=2.25,5,IF(F9>=2,7,IF(F9>=1.75,9,IF(F9>=1.5,11,IF(F9>=1.25,13,IF(F9>=1,15))))))))","v":false},null,null,null,{"$f":"IF(Vacancy!E10=\"\",\"\",Vacancy!E10)","v":""}]
[]
[null,null,"GWA",null,null,null,{"$f":"IF(F9>=2.75,2,IF(F9>=2.5,5,IF(F9>=2.25,8,IF(F9>=2,11,IF(F9>=1.75,14,IF(F9>=1.5,16,IF(F9>=1.25,18,IF(F9>=1,20))))))))","v":false},{"$f":"IF(E3=\"First Level\",(20*F11)/5,IF(E3=\"Second Level\",(15*F11)/5,IF(E3=\"Executive/Managerial\",(35*F11)/5,\"\")))","v":""},null,null,null,"Highest Educational Attainment:",null,null,null,null,null,null,null,null,null,null,null,null,"Total Score:"]
[]
[null,null,"Last Rating Period",null,null,null,null,{"$f":"IFERROR(IF(AND(A7=TRUE,E3=\"First Level\"),G9,IF(AND(A7=TRUE,E3=\"Second Level\"),H7,H9)),\"\")","v":""},null,null,null,"First Level:",null,null,null,null,null,null,null,null,null,null,null,{"$f":"VLOOKUP(P11,Educ_2!$A$11:$B$26,2,FALSE)","v":{"$error":"#N/A"}},{"$f":"IFERROR(VLOOKUP($L$7,Educ_2!$A$1:$Q$8,X11+1,FALSE),\"\")","v":""}]
[]
[false,null,"Total Score",null,":",{"$f":"IF(H11=FALSE,0,H11)","v":""},"pts.",null,null,null,null,"Second Level:",null,null,null,null,null,null,null,null,null,null,null,{"$f":"VLOOKUP(P13,Educ_2!$A$11:$B$26,2,FALSE)","v":{"$error":"#N/A"}},{"$f":"IFERROR(VLOOKUP($L$7,Educ_2!$A$1:$Q$8,X13+1,FALSE),\"\")","v":""}]
[]
[null,null,null,null,null,null,null,null,null,null,null,"Executive/Managerial:",null,null,null,null,null,null,null,null,null,null,null,{"$f":"VLOOKUP(P15,Educ_2!$A$11:$B$26,2,FALSE)","v":{"$error":"#N/A"}},{"$f":"IFERROR(VLOOKUP($L$7,Educ_2!$A$1:$Q$8,X15+1,FALSE),\"\")","v":""}]
[]
[null,null,null,null,null,null,null,null,null,null,null,null,null,null,null,null,null,null,null,null,null,null,null,null,{"$f":"SUM(Y11,Y13,Y15)","v":0}]
[]
[null,null,"C. Training (10 pts.)",null,null,null,null,null,null,null,null,null,null,null,null,null,null,null,null,null,null,null,null,null,{"$f":"IF(E3=\"Executive/Managerial\",\"D. Experience (10 pts)\",\"D. Experience (25 pts)\")","v":"D. Experience (25 pts)"}]
[null,null,null,null,null,null,null,null,null,null,null,null,null,null,null,null,null,null,null,"Coversion to YEAR"]
[true,null,null,null,{"$f":"IF(Vacancy!$R$10=\"None required\",0,IF(Vacancy!$R$10=\"\",\"\",Vacancy!$R$10))","v":""},"Required (hrs.)",null,null,null,null,null,null,null,null,null,null,null,null,null,null,"Year",null,{"$f":"T21","v":0},null,null,{"$f":"IF(Vacancy!$AA$10=\"None required\",0,IF(Vacancy!$AA$10=\"\",\"\",Vacancy!$AA$10))","v":""},"Required Exp."]
[]
[null,null,null,{"$f":"E23-E21","v":{"$error":"#VALUE!"}},null,"Relevant training hrs. acquired",null,null,null,null,null,null,null,null,null,null,null,null,null,null,"Month",null,{"$f":"T23/12","v":0},null,{"$f":"Z23-Z21","v":{"$error":"#VALUE!"}},{"$f":"SUM(W21,W23,W25)","v":0},"Relevant years of experience"]
[]
[null,null,null,null,{"$f":"IF(N3=\"\",0,IFERROR(IF(E21=E23,5,IF(E23>=E21,((5*D23)/Trg_Exp!$D$2)+5,0)),0))","v":0},"Total",null,null,null,null,null,null,null,null,null,null,null,null,null,null,"Day",null,{"$f":"T25/365","v":0},null,{"$f":"IFERROR(IF(AND(Z21=Z23),10,IF(Vacancy!E6=\"Executive/Managerial\",((10*Y23)/Trg_Exp!$K$2),IF(Z23>=Z21,((15*Y23)/Trg_Exp!$K$2)+10,0))),0)","v":0},{"$f":"IF(N3=\"\",0,IF(Y25<0,0,Y25))","v":0},"Total Score:"]
[]
[null,null,{"$f":"IF(Vacancy!E6=\"Second Level\",\"E. Accomplishment (15 pts.)\",\"E. Accomplishment (10 pts.)\")","v":"E. Accomplishment (10 pts.)"}]
[]
[null,null,null,null,"E.1  Awards/Citations/Commendations"]
[]
[false,null,null,null,"E.1.1. Unit Level",null,null,null,null,{"$f":"IF(A31=TRUE,1,\"\")","v":""}]
[]
[false,null,null,null,"E.1.2. University Level",null,null,null,null,{"$f":"IF(A33=TRUE,3,\"\")","v":""}]
[]
[false,null,null,null,"E.1.3. National/CSC Level",null,null,null,null,{"$f":"IF(A35=TRUE,5,\"\")","v":""}]
[null,null,null,null,"E.2. Innovations/ Systems Improvement"]
[false,null,null,null,null,null,null,null,null,{"$f":"IF(A37=TRUE,IF(Vacancy!E6=\"Second Level\",4,3),\"\")","v":""}]
[null,null,null,null,null,null,null,null,null,null,{"$f":"IF(E3=\"Second Level\",((SUM(J31,J33,J35)*11)/9),((SUM(J31,J33,J35)*7)/9))","v":0}]
[]
[null,null,null,null,"C.2. Total Score:",null,null,null,null,{"$f":"IF(E3=\"Second Level\",(15*SUM(K38,J37)/15),(10*SUM(K38,J37)/10))","v":0}]
[]
[null,null,{"$f":"IF(E3=\"Executive/Managerial\",\"F. Physical Characteristics and Personality Traits (10 pts.)\",\"F. Physical Characteristics and Personality Traits (5 pts.)\")","v":"F. Physical Characteristics and Personality Traits (5 pts.)"}]
[]
[null,null,null,null,"Supervisor",null,"Co-worker 1",null,"Co-worker 2",null,"Co-worker 3",null,null,"Supervisor",null,"Co-worker 1",null,"Co-worker 2",null,"Co-worker 3",null,null,"Supervisor",null,"Co-worker 1",null,"Co-worker 2",null,"Co-worker 3"]
[null,null,null,null,"ATTITUDE",null,null,null,null,null,null,null,null,"COMMITMENT",null,null,null,null,null,null,null,null,"APPEARANCE"]
[null,null,null,"F.1.1. ",null,null,null,null,null,null,null,null,"F.2.1. ",null,null,null,null,null,null,null,null,"F.3.1. "]
[null,null,null,"F.1.2. ",null,null,null,null,null,null,null,null,"F.2.2. ",null,null,null,null,null,null,null,null,"F.3.2. "]
[null,null,null,"F.1.3. ",null,null,null,null,null,null,null,null,"F.2.3. "]
[null,null,null,null,{"$f":"IF($E$3=\"Executive/Managerial\",(4*(SUM(E46:F48)/12)),(2*(SUM(E46:F48)/12)))","v":0},null,{"$f":"IF($E$3=\"Executive/Managerial\",(4*(SUM(G46:H48)/12)),(2*(SUM(G46:H48)/12)))","v":0},null,{"$f":"IF($E$3=\"Executive/Managerial\",(4*(SUM(I46:J48)/12)),(2*(SUM(I46:J48)/12)))","v":0},null,{"$f":"IF($E$3=\"Executive/Managerial\",(4*(SUM(K46:L48)/12)),(2*(SUM(K46:L48)/12)))","v":0},null,null,{"$f":"IF($E$3=\"Executive/Managerial\",(4*(SUM(N46:O48)/12)),(2*(SUM(N46:O48)/12)))","v":0},null,{"$f":"IF($E$3=\"Executive/Managerial\",(4*(SUM(P46:Q48)/12)),(2*(SUM(P46:Q48)/12)))","v":0},null,{"$f":"IF($E$3=\"Executive/Managerial\",(4*(SUM(R46:S48)/12)),(2*(SUM(R46:S48)/12)))","v":0},null,{"$f":"IF($E$3=\"Executive/Managerial\",(4*(SUM(T46:U48)/12)),(2*(SUM(T46:U48)/12)))","v":0},null,null,{"$f":"IF($E$3=\"Executive/Managerial\",(2*(SUM(W46:X48))/8),(1*(SUM(W46:X48))/8))","v":0},null,{"$f":"IF($E$3=\"Executive/Managerial\",(2*(SUM(Y46:Z48))/8),(1*(SUM(Y46:Z48))/8))","v":0},null,{"$f":"IF($E$3=\"Executive/Managerial\",(2*(SUM(AA46:AB48))/8),(1*(SUM(AA46:AB48))/8))","v":0},null,{"$f":"IF($E$3=\"Executive/Managerial\",(2*(SUM(AC46:AD48))/8),(1*(SUM(AC46:AD48))/8))","v":0}]
[null,null,null,null,null,null,"Supervisor",null,"Co-worker"]
[null,null,null,null,"Attitude",null,{"$f":"E49","v":0},null,{"$f":"SUM(G49:L49)/3","v":0},null,null,null,null,"Total Score PCPT:",null,null,{"$f":"IF(E3=\"Executive/Managerial\",SUM(G54:J54),SUM(G54:J54))","v":0}]
[null,null,null,null,"Commitment",null,{"$f":"N49","v":0},null,{"$f":"SUM(P49:U49)/3","v":0}]
[null,null,null,null,"Appearance",null,{"$f":"W49","v":0},null,{"$f":"SUM(Y49:AD49)/3","v":0}]
[null,null,null,null,null,null,{"$f":"SUM(G51:G53)*0.6","v":0},null,{"$f":"SUM(I51:I53)*0.4","v":0}]
[null,null,{"$f":"IF(E3=\"First Level\",\"G. Potential [Assessment Form No. 2] (3 pts.)\",\"G. Potential [Assessment Form No. 2] (5 pts.)\")","v":"G. Potential [Assessment Form No. 2] (5 pts.)"}]
[]
[null,null,null,"INTERVIEW"]
[]
[null,null,null,null,"G.1.1. Sound judgement",null,null,null,null,null,null,{"$f":"IF($E$3=\"First Level\",\"Not Applicable for First Level position\",\"\")","v":""}]
[null,null,null,null,"G.1.2. Analytical mind",null,null,null,null,null,null,{"$f":"IF($E$3=\"First Level\",\"Not Applicable for First Level position\",\"\")","v":""}]
[null,null,null,null,"G.1.3. The ability to motivate co-workers",null,null,null,null,null,null,{"$f":"IF($E$3=\"First Level\",\"Not Applicable for First Level position\",\"\")","v":""}]
[null,null,null,null,"G.1.4. Unifying Factor",null,null,null,null,null,null,{"$f":"IF($E$3=\"First Level\",\"Not Applicable for First Level position\",\"\")","v":""}]
[null,null,null,null,"G.1.5. Vision/foresight",null,null,null,null,null,null,{"$f":"IF($E$3=\"First Level\",\"Not Applicable for First Level position\",\"\")","v":""}]
[null,null,null,null,"G.2. Resourcefulness"]
[null,null,null,null,"G.3. Creativity/ Ingenuity "]
[]
[null,null,null,"TOTAL POINTS FOR POTENTIAL",null,null,null,null,null,null,{"$f":"IF(E3=\"First Level\",(3*(SUM(K64:K65)/8)),(5*(SUM(K59:K65)/28)))","v":0}]
[]
[null,null,{"$f":"IF(E3=\"First Level\",\"H. Written/ Skills Examination (12 pts.)\",\"H. Written/ Skills Examination (15 pts.)\")","v":"H. Written/ Skills Examination (15 pts.)"}]
[null,null,null,null,null,null,null,null,null,null,{"$f":"IFERROR(SUM(K59:K65)/7,0)","v":0}]
[null,null,null,"WRITTEN/SKILLS EXAMINATION"]
[]
[null,null,null,null,"Perfect/Entire Score",null,null,"="]
[null,null,null,null,"Raw Score",null,null,"="]
[]
[]
[null,null,null,"TOTAL FOR EXAMINATION",null,null,null,null,null,null,{"$f":"IFERROR(IF(E3=\"First Level\",IF(K74>K73,0,(K74*12)/K73),IF(K74>K73,0,(K74*15)/K73)),0)","v":0}]
[]
[null,null,"I. Public Service"]
[]
[null,null,null,null,"Additional Pts. in excess of Total Score"]

{"sheet":"AP39","index":46,"n_rows":81,"n_cols":33,"rows_kept":81,"cut":false,"hidden":false,"merged":[[1,2,1,29],[2,4,2,9],[2,13,2,22],[2,27,2,30],[2,32,2,33],[45,4,45,5],[45,6,45,7],[45,8,45,9],[45,10,45,11],[45,13,45,14],[10,15,10,22],[12,15,12,22],[14,15,14,22],[19,19,19,22],[35,4,37,7],[45,28,45,29],[45,24,45,25],[45,26,45,27],[6,11,6,22],[46,4,46,5],[46,6,46,7],[46,8,46,9],[46,10,46,11],[46,13,46,14],[46,17,46,18],[46,19,46,20],[46,22,46,23],[45,15,45,16],[45,17,45,18],[45,19,45,20],[45,22,45,23],[46,24,46,25],[46,26,46,27],[46,28,46,29],[47,4,47,5],[47,6,47,7],[47,8,47,9],[47,10,47,11],[47,13,47,14],[47,15,47,16],[47,17,47,18],[47,19,47,20],[47,22,47,23],[47,24,47,25],[47,26,47,27],[47,28,47,29],[46,15,46,16],[48,4,48,5],[48,6,48,7],[48,8,48,9],[48,10,48,11],[48,13,48,14],[48,28,48,29],[50,16,50,17],[48,15,48,16],[48,17,48,18],[48,19,48,20],[48,22,48,23],[48,24,48,25],[48,26,48,27]]}
[]
[null,null,"MSP CALCULATOR"]
[null,null,"Levels",":",{"$f":"IF(Vacancy!E6=\"\",\"\",Vacancy!E6)","v":""},null,null,null,null,null,null,"Name",":",null,null,null,null,null,null,null,null,null,null,null,null,null,"Employment Category:",null,null,null,null,null,{"$f":"SUM(F13,Y11,Y13,Y15,E25,Z25,J40,Q51,K67,K77,D81)","v":0}]
[null,null,null,null,null,null,null,null,null,null,null,null,null,null,null,null,null,null,null,null,null,null,null,null,null,null,null,null,null,null,null,null,"TOTAL MATRIX POINTS"]
[null,null,{"$f":"IF(E3=\"First Level\",\"A. Performance Rating (20 pts)\",IF(E3=\"Second Level\",\"A. Performance Rating (15 pts)\",\"A. Performance Rating (35 pts)\"))","v":"A. Performance Rating (35 pts)"},null,null,null,null,null,null,null,null,{"$f":"IF(E3=\"First Level\",\"B. Education (15 pts.)\",IF(E3=\"Second Level\",\"B. Education (10 pts.)\",\"B. Education (5 pts.)\"))","v":"B. Education (5 pts.)"}]
[null,null,"New Graduates (No previous work experience)",null,null,null,null,null,null,null,null,"Required:"]
[false,null,null,null,null,null,null,{"$f":"IF(F9>=2.75,1,IF(F9>=2.5,3,IF(F9>=2.25,5,IF(F9>=2,7,IF(F9>=1.75,9,IF(F9>=1.5,11,IF(F9>=1.25,13,IF(F9>=1,15))))))))","v":false},null,null,null,{"$f":"IF(Vacancy!E10=\"\",\"\",Vacancy!E10)","v":""}]
[]
[null,null,"GWA",null,null,null,{"$f":"IF(F9>=2.75,2,IF(F9>=2.5,5,IF(F9>=2.25,8,IF(F9>=2,11,IF(F9>=1.75,14,IF(F9>=1.5,16,IF(F9>=1.25,18,IF(F9>=1,20))))))))","v":false},{"$f":"IF(E3=\"First Level\",(20*F11)/5,IF(E3=\"Second Level\",(15*F11)/5,IF(E3=\"Executive/Managerial\",(35*F11)/5,\"\")))","v":""},null,null,null,"Highest Educational Attainment:",null,null,null,null,null,null,null,null,null,null,null,null,"Total Score:"]
[]
[null,null,"Last Rating Period",null,null,null,null,{"$f":"IFERROR(IF(AND(A7=TRUE,E3=\"First Level\"),G9,IF(AND(A7=TRUE,E3=\"Second Level\"),H7,H9)),\"\")","v":""},null,null,null,"First Level:",null,null,null,null,null,null,null,null,null,null,null,{"$f":"VLOOKUP(P11,Educ_2!$A$11:$B$26,2,FALSE)","v":{"$error":"#N/A"}},{"$f":"IFERROR(VLOOKUP($L$7,Educ_2!$A$1:$Q$8,X11+1,FALSE),\"\")","v":""}]
[]
[false,null,"Total Score",null,":",{"$f":"IF(H11=FALSE,0,H11)","v":""},"pts.",null,null,null,null,"Second Level:",null,null,null,null,null,null,null,null,null,null,null,{"$f":"VLOOKUP(P13,Educ_2!$A$11:$B$26,2,FALSE)","v":{"$error":"#N/A"}},{"$f":"IFERROR(VLOOKUP($L$7,Educ_2!$A$1:$Q$8,X13+1,FALSE),\"\")","v":""}]
[]
[null,null,null,null,null,null,null,null,null,null,null,"Executive/Managerial:",null,null,null,null,null,null,null,null,null,null,null,{"$f":"VLOOKUP(P15,Educ_2!$A$11:$B$26,2,FALSE)","v":{"$error":"#N/A"}},{"$f":"IFERROR(VLOOKUP($L$7,Educ_2!$A$1:$Q$8,X15+1,FALSE),\"\")","v":""}]
[]
[null,null,null,null,null,null,null,null,null,null,null,null,null,null,null,null,null,null,null,null,null,null,null,null,{"$f":"SUM(Y11,Y13,Y15)","v":0}]
[]
[null,null,"C. Training (10 pts.)",null,null,null,null,null,null,null,null,null,null,null,null,null,null,null,null,null,null,null,null,null,{"$f":"IF(E3=\"Executive/Managerial\",\"D. Experience (10 pts)\",\"D. Experience (25 pts)\")","v":"D. Experience (25 pts)"}]
[null,null,null,null,null,null,null,null,null,null,null,null,null,null,null,null,null,null,null,"Coversion to YEAR"]
[true,null,null,null,{"$f":"IF(Vacancy!$R$10=\"None required\",0,IF(Vacancy!$R$10=\"\",\"\",Vacancy!$R$10))","v":""},"Required (hrs.)",null,null,null,null,null,null,null,null,null,null,null,null,null,null,"Year",null,{"$f":"T21","v":0},null,null,{"$f":"IF(Vacancy!$AA$10=\"None required\",0,IF(Vacancy!$AA$10=\"\",\"\",Vacancy!$AA$10))","v":""},"Required Exp."]
[]
[null,null,null,{"$f":"E23-E21","v":{"$error":"#VALUE!"}},null,"Relevant training hrs. acquired",null,null,null,null,null,null,null,null,null,null,null,null,null,null,"Month",null,{"$f":"T23/12","v":0},null,{"$f":"Z23-Z21","v":{"$error":"#VALUE!"}},{"$f":"SUM(W21,W23,W25)","v":0},"Relevant years of experience"]
[]
[null,null,null,null,{"$f":"IF(N3=\"\",0,IFERROR(IF(E21=E23,5,IF(E23>=E21,((5*D23)/Trg_Exp!$D$2)+5,0)),0))","v":0},"Total",null,null,null,null,null,null,null,null,null,null,null,null,null,null,"Day",null,{"$f":"T25/365","v":0},null,{"$f":"IFERROR(IF(AND(Z21=Z23),10,IF(Vacancy!E6=\"Executive/Managerial\",((10*Y23)/Trg_Exp!$K$2),IF(Z23>=Z21,((15*Y23)/Trg_Exp!$K$2)+10,0))),0)","v":0},{"$f":"IF(N3=\"\",0,IF(Y25<0,0,Y25))","v":0},"Total Score:"]
[]
[null,null,{"$f":"IF(Vacancy!E6=\"Second Level\",\"E. Accomplishment (15 pts.)\",\"E. Accomplishment (10 pts.)\")","v":"E. Accomplishment (10 pts.)"}]
[]
[null,null,null,null,"E.1  Awards/Citations/Commendations"]
[]
[false,null,null,null,"E.1.1. Unit Level",null,null,null,null,{"$f":"IF(A31=TRUE,1,\"\")","v":""}]
[]
[false,null,null,null,"E.1.2. University Level",null,null,null,null,{"$f":"IF(A33=TRUE,3,\"\")","v":""}]
[]
[false,null,null,null,"E.1.3. National/CSC Level",null,null,null,null,{"$f":"IF(A35=TRUE,5,\"\")","v":""}]
[null,null,null,null,"E.2. Innovations/ Systems Improvement"]
[false,null,null,null,null,null,null,null,null,{"$f":"IF(A37=TRUE,IF(Vacancy!E6=\"Second Level\",4,3),\"\")","v":""}]
[null,null,null,null,null,null,null,null,null,null,{"$f":"IF(E3=\"Second Level\",((SUM(J31,J33,J35)*11)/9),((SUM(J31,J33,J35)*7)/9))","v":0}]
[]
[null,null,null,null,"C.2. Total Score:",null,null,null,null,{"$f":"IF(E3=\"Second Level\",(15*SUM(K38,J37)/15),(10*SUM(K38,J37)/10))","v":0}]
[]
[null,null,{"$f":"IF(E3=\"Executive/Managerial\",\"F. Physical Characteristics and Personality Traits (10 pts.)\",\"F. Physical Characteristics and Personality Traits (5 pts.)\")","v":"F. Physical Characteristics and Personality Traits (5 pts.)"}]
[]
[null,null,null,null,"Supervisor",null,"Co-worker 1",null,"Co-worker 2",null,"Co-worker 3",null,null,"Supervisor",null,"Co-worker 1",null,"Co-worker 2",null,"Co-worker 3",null,null,"Supervisor",null,"Co-worker 1",null,"Co-worker 2",null,"Co-worker 3"]
[null,null,null,null,"ATTITUDE",null,null,null,null,null,null,null,null,"COMMITMENT",null,null,null,null,null,null,null,null,"APPEARANCE"]
[null,null,null,"F.1.1. ",null,null,null,null,null,null,null,null,"F.2.1. ",null,null,null,null,null,null,null,null,"F.3.1. "]
[null,null,null,"F.1.2. ",null,null,null,null,null,null,null,null,"F.2.2. ",null,null,null,null,null,null,null,null,"F.3.2. "]
[null,null,null,"F.1.3. ",null,null,null,null,null,null,null,null,"F.2.3. "]
[null,null,null,null,{"$f":"IF($E$3=\"Executive/Managerial\",(4*(SUM(E46:F48)/12)),(2*(SUM(E46:F48)/12)))","v":0},null,{"$f":"IF($E$3=\"Executive/Managerial\",(4*(SUM(G46:H48)/12)),(2*(SUM(G46:H48)/12)))","v":0},null,{"$f":"IF($E$3=\"Executive/Managerial\",(4*(SUM(I46:J48)/12)),(2*(SUM(I46:J48)/12)))","v":0},null,{"$f":"IF($E$3=\"Executive/Managerial\",(4*(SUM(K46:L48)/12)),(2*(SUM(K46:L48)/12)))","v":0},null,null,{"$f":"IF($E$3=\"Executive/Managerial\",(4*(SUM(N46:O48)/12)),(2*(SUM(N46:O48)/12)))","v":0},null,{"$f":"IF($E$3=\"Executive/Managerial\",(4*(SUM(P46:Q48)/12)),(2*(SUM(P46:Q48)/12)))","v":0},null,{"$f":"IF($E$3=\"Executive/Managerial\",(4*(SUM(R46:S48)/12)),(2*(SUM(R46:S48)/12)))","v":0},null,{"$f":"IF($E$3=\"Executive/Managerial\",(4*(SUM(T46:U48)/12)),(2*(SUM(T46:U48)/12)))","v":0},null,null,{"$f":"IF($E$3=\"Executive/Managerial\",(2*(SUM(W46:X48))/8),(1*(SUM(W46:X48))/8))","v":0},null,{"$f":"IF($E$3=\"Executive/Managerial\",(2*(SUM(Y46:Z48))/8),(1*(SUM(Y46:Z48))/8))","v":0},null,{"$f":"IF($E$3=\"Executive/Managerial\",(2*(SUM(AA46:AB48))/8),(1*(SUM(AA46:AB48))/8))","v":0},null,{"$f":"IF($E$3=\"Executive/Managerial\",(2*(SUM(AC46:AD48))/8),(1*(SUM(AC46:AD48))/8))","v":0}]
[null,null,null,null,null,null,"Supervisor",null,"Co-worker"]
[null,null,null,null,"Attitude",null,{"$f":"E49","v":0},null,{"$f":"SUM(G49:L49)/3","v":0},null,null,null,null,"Total Score PCPT:",null,null,{"$f":"IF(E3=\"Executive/Managerial\",SUM(G54:J54),SUM(G54:J54))","v":0}]
[null,null,null,null,"Commitment",null,{"$f":"N49","v":0},null,{"$f":"SUM(P49:U49)/3","v":0}]
[null,null,null,null,"Appearance",null,{"$f":"W49","v":0},null,{"$f":"SUM(Y49:AD49)/3","v":0}]
[null,null,null,null,null,null,{"$f":"SUM(G51:G53)*0.6","v":0},null,{"$f":"SUM(I51:I53)*0.4","v":0}]
[null,null,{"$f":"IF(E3=\"First Level\",\"G. Potential [Assessment Form No. 2] (3 pts.)\",\"G. Potential [Assessment Form No. 2] (5 pts.)\")","v":"G. Potential [Assessment Form No. 2] (5 pts.)"}]
[]
[null,null,null,"INTERVIEW"]
[]
[null,null,null,null,"G.1.1. Sound judgement",null,null,null,null,null,null,{"$f":"IF($E$3=\"First Level\",\"Not Applicable for First Level position\",\"\")","v":""}]
[null,null,null,null,"G.1.2. Analytical mind",null,null,null,null,null,null,{"$f":"IF($E$3=\"First Level\",\"Not Applicable for First Level position\",\"\")","v":""}]
[null,null,null,null,"G.1.3. The ability to motivate co-workers",null,null,null,null,null,null,{"$f":"IF($E$3=\"First Level\",\"Not Applicable for First Level position\",\"\")","v":""}]
[null,null,null,null,"G.1.4. Unifying Factor",null,null,null,null,null,null,{"$f":"IF($E$3=\"First Level\",\"Not Applicable for First Level position\",\"\")","v":""}]
[null,null,null,null,"G.1.5. Vision/foresight",null,null,null,null,null,null,{"$f":"IF($E$3=\"First Level\",\"Not Applicable for First Level position\",\"\")","v":""}]
[null,null,null,null,"G.2. Resourcefulness"]
[null,null,null,null,"G.3. Creativity/ Ingenuity "]
[]
[null,null,null,"TOTAL POINTS FOR POTENTIAL",null,null,null,null,null,null,{"$f":"IF(E3=\"First Level\",(3*(SUM(K64:K65)/8)),(5*(SUM(K59:K65)/28)))","v":0}]
[]
[null,null,{"$f":"IF(E3=\"First Level\",\"H. Written/ Skills Examination (12 pts.)\",\"H. Written/ Skills Examination (15 pts.)\")","v":"H. Written/ Skills Examination (15 pts.)"}]
[null,null,null,null,null,null,null,null,null,null,{"$f":"IFERROR(SUM(K59:K65)/7,0)","v":0}]
[null,null,null,"WRITTEN/SKILLS EXAMINATION"]
[]
[null,null,null,null,"Perfect/Entire Score",null,null,"="]
[null,null,null,null,"Raw Score",null,null,"="]
[]
[]
[null,null,null,"TOTAL FOR EXAMINATION",null,null,null,null,null,null,{"$f":"IFERROR(IF(E3=\"First Level\",IF(K74>K73,0,(K74*12)/K73),IF(K74>K73,0,(K74*15)/K73)),0)","v":0}]
[]
[null,null,"I. Public Service"]
[]
[null,null,null,null,"Additional Pts. in excess of Total Score"]

{"sheet":"AP40","index":47,"n_rows":81,"n_cols":33,"rows_kept":81,"cut":false,"hidden":false,"merged":[[1,2,1,29],[2,4,2,9],[2,13,2,22],[2,27,2,30],[2,32,2,33],[45,4,45,5],[45,6,45,7],[45,8,45,9],[45,10,45,11],[45,13,45,14],[10,15,10,22],[12,15,12,22],[14,15,14,22],[19,19,19,22],[35,4,37,7],[45,28,45,29],[45,24,45,25],[45,26,45,27],[6,11,6,22],[46,4,46,5],[46,6,46,7],[46,8,46,9],[46,10,46,11],[46,13,46,14],[46,17,46,18],[46,19,46,20],[46,22,46,23],[45,15,45,16],[45,17,45,18],[45,19,45,20],[45,22,45,23],[46,24,46,25],[46,26,46,27],[46,28,46,29],[47,4,47,5],[47,6,47,7],[47,8,47,9],[47,10,47,11],[47,13,47,14],[47,15,47,16],[47,17,47,18],[47,19,47,20],[47,22,47,23],[47,24,47,25],[47,26,47,27],[47,28,47,29],[46,15,46,16],[48,4,48,5],[48,6,48,7],[48,8,48,9],[48,10,48,11],[48,13,48,14],[48,28,48,29],[50,16,50,17],[48,15,48,16],[48,17,48,18],[48,19,48,20],[48,22,48,23],[48,24,48,25],[48,26,48,27]]}
[]
[null,null,"MSP CALCULATOR"]
[null,null,"Levels",":",{"$f":"IF(Vacancy!E6=\"\",\"\",Vacancy!E6)","v":""},null,null,null,null,null,null,"Name",":",null,null,null,null,null,null,null,null,null,null,null,null,null,"Employment Category:",null,null,null,null,null,{"$f":"SUM(F13,Y11,Y13,Y15,E25,Z25,J40,Q51,K67,K77,D81)","v":0}]
[null,null,null,null,null,null,null,null,null,null,null,null,null,null,null,null,null,null,null,null,null,null,null,null,null,null,null,null,null,null,null,null,"TOTAL MATRIX POINTS"]
[null,null,{"$f":"IF(E3=\"First Level\",\"A. Performance Rating (20 pts)\",IF(E3=\"Second Level\",\"A. Performance Rating (15 pts)\",\"A. Performance Rating (35 pts)\"))","v":"A. Performance Rating (35 pts)"},null,null,null,null,null,null,null,null,{"$f":"IF(E3=\"First Level\",\"B. Education (15 pts.)\",IF(E3=\"Second Level\",\"B. Education (10 pts.)\",\"B. Education (5 pts.)\"))","v":"B. Education (5 pts.)"}]
[null,null,"New Graduates (No previous work experience)",null,null,null,null,null,null,null,null,"Required:"]
[false,null,null,null,null,null,null,{"$f":"IF(F9>=2.75,1,IF(F9>=2.5,3,IF(F9>=2.25,5,IF(F9>=2,7,IF(F9>=1.75,9,IF(F9>=1.5,11,IF(F9>=1.25,13,IF(F9>=1,15))))))))","v":false},null,null,null,{"$f":"IF(Vacancy!E10=\"\",\"\",Vacancy!E10)","v":""}]
[]
[null,null,"GWA",null,null,null,{"$f":"IF(F9>=2.75,2,IF(F9>=2.5,5,IF(F9>=2.25,8,IF(F9>=2,11,IF(F9>=1.75,14,IF(F9>=1.5,16,IF(F9>=1.25,18,IF(F9>=1,20))))))))","v":false},{"$f":"IF(E3=\"First Level\",(20*F11)/5,IF(E3=\"Second Level\",(15*F11)/5,IF(E3=\"Executive/Managerial\",(35*F11)/5,\"\")))","v":""},null,null,null,"Highest Educational Attainment:",null,null,null,null,null,null,null,null,null,null,null,null,"Total Score:"]
[]
[null,null,"Last Rating Period",null,null,null,null,{"$f":"IFERROR(IF(AND(A7=TRUE,E3=\"First Level\"),G9,IF(AND(A7=TRUE,E3=\"Second Level\"),H7,H9)),\"\")","v":""},null,null,null,"First Level:",null,null,null,null,null,null,null,null,null,null,null,{"$f":"VLOOKUP(P11,Educ_2!$A$11:$B$26,2,FALSE)","v":{"$error":"#N/A"}},{"$f":"IFERROR(VLOOKUP($L$7,Educ_2!$A$1:$Q$8,X11+1,FALSE),\"\")","v":""}]
[]
[false,null,"Total Score",null,":",{"$f":"IF(H11=FALSE,0,H11)","v":""},"pts.",null,null,null,null,"Second Level:",null,null,null,null,null,null,null,null,null,null,null,{"$f":"VLOOKUP(P13,Educ_2!$A$11:$B$26,2,FALSE)","v":{"$error":"#N/A"}},{"$f":"IFERROR(VLOOKUP($L$7,Educ_2!$A$1:$Q$8,X13+1,FALSE),\"\")","v":""}]
[]
[null,null,null,null,null,null,null,null,null,null,null,"Executive/Managerial:",null,null,null,null,null,null,null,null,null,null,null,{"$f":"VLOOKUP(P15,Educ_2!$A$11:$B$26,2,FALSE)","v":{"$error":"#N/A"}},{"$f":"IFERROR(VLOOKUP($L$7,Educ_2!$A$1:$Q$8,X15+1,FALSE),\"\")","v":""}]
[]
[null,null,null,null,null,null,null,null,null,null,null,null,null,null,null,null,null,null,null,null,null,null,null,null,{"$f":"SUM(Y11,Y13,Y15)","v":0}]
[]
[null,null,"C. Training (10 pts.)",null,null,null,null,null,null,null,null,null,null,null,null,null,null,null,null,null,null,null,null,null,{"$f":"IF(E3=\"Executive/Managerial\",\"D. Experience (10 pts)\",\"D. Experience (25 pts)\")","v":"D. Experience (25 pts)"}]
[null,null,null,null,null,null,null,null,null,null,null,null,null,null,null,null,null,null,null,"Coversion to YEAR"]
[true,null,null,null,{"$f":"IF(Vacancy!$R$10=\"None required\",0,IF(Vacancy!$R$10=\"\",\"\",Vacancy!$R$10))","v":""},"Required (hrs.)",null,null,null,null,null,null,null,null,null,null,null,null,null,null,"Year",null,{"$f":"T21","v":0},null,null,{"$f":"IF(Vacancy!$AA$10=\"None required\",0,IF(Vacancy!$AA$10=\"\",\"\",Vacancy!$AA$10))","v":""},"Required Exp."]
[]
[null,null,null,{"$f":"E23-E21","v":{"$error":"#VALUE!"}},null,"Relevant training hrs. acquired",null,null,null,null,null,null,null,null,null,null,null,null,null,null,"Month",null,{"$f":"T23/12","v":0},null,{"$f":"Z23-Z21","v":{"$error":"#VALUE!"}},{"$f":"SUM(W21,W23,W25)","v":0},"Relevant years of experience"]
[]
[null,null,null,null,{"$f":"IF(N3=\"\",0,IFERROR(IF(E21=E23,5,IF(E23>=E21,((5*D23)/Trg_Exp!$D$2)+5,0)),0))","v":0},"Total",null,null,null,null,null,null,null,null,null,null,null,null,null,null,"Day",null,{"$f":"T25/365","v":0},null,{"$f":"IFERROR(IF(AND(Z21=Z23),10,IF(Vacancy!E6=\"Executive/Managerial\",((10*Y23)/Trg_Exp!$K$2),IF(Z23>=Z21,((15*Y23)/Trg_Exp!$K$2)+10,0))),0)","v":0},{"$f":"IF(N3=\"\",0,IF(Y25<0,0,Y25))","v":0},"Total Score:"]
[]
[null,null,{"$f":"IF(Vacancy!E6=\"Second Level\",\"E. Accomplishment (15 pts.)\",\"E. Accomplishment (10 pts.)\")","v":"E. Accomplishment (10 pts.)"}]
[]
[null,null,null,null,"E.1  Awards/Citations/Commendations"]
[]
[false,null,null,null,"E.1.1. Unit Level",null,null,null,null,{"$f":"IF(A31=TRUE,1,\"\")","v":""}]
[]
[false,null,null,null,"E.1.2. University Level",null,null,null,null,{"$f":"IF(A33=TRUE,3,\"\")","v":""}]
[]
[false,null,null,null,"E.1.3. National/CSC Level",null,null,null,null,{"$f":"IF(A35=TRUE,5,\"\")","v":""}]
[null,null,null,null,"E.2. Innovations/ Systems Improvement"]
[false,null,null,null,null,null,null,null,null,{"$f":"IF(A37=TRUE,IF(Vacancy!E6=\"Second Level\",4,3),\"\")","v":""}]
[null,null,null,null,null,null,null,null,null,null,{"$f":"IF(E3=\"Second Level\",((SUM(J31,J33,J35)*11)/9),((SUM(J31,J33,J35)*7)/9))","v":0}]
[]
[null,null,null,null,"C.2. Total Score:",null,null,null,null,{"$f":"IF(E3=\"Second Level\",(15*SUM(K38,J37)/15),(10*SUM(K38,J37)/10))","v":0}]
[]
[null,null,{"$f":"IF(E3=\"Executive/Managerial\",\"F. Physical Characteristics and Personality Traits (10 pts.)\",\"F. Physical Characteristics and Personality Traits (5 pts.)\")","v":"F. Physical Characteristics and Personality Traits (5 pts.)"}]
[]
[null,null,null,null,"Supervisor",null,"Co-worker 1",null,"Co-worker 2",null,"Co-worker 3",null,null,"Supervisor",null,"Co-worker 1",null,"Co-worker 2",null,"Co-worker 3",null,null,"Supervisor",null,"Co-worker 1",null,"Co-worker 2",null,"Co-worker 3"]
[null,null,null,null,"ATTITUDE",null,null,null,null,null,null,null,null,"COMMITMENT",null,null,null,null,null,null,null,null,"APPEARANCE"]
[null,null,null,"F.1.1. ",null,null,null,null,null,null,null,null,"F.2.1. ",null,null,null,null,null,null,null,null,"F.3.1. "]
[null,null,null,"F.1.2. ",null,null,null,null,null,null,null,null,"F.2.2. ",null,null,null,null,null,null,null,null,"F.3.2. "]
[null,null,null,"F.1.3. ",null,null,null,null,null,null,null,null,"F.2.3. "]
[null,null,null,null,{"$f":"IF($E$3=\"Executive/Managerial\",(4*(SUM(E46:F48)/12)),(2*(SUM(E46:F48)/12)))","v":0},null,{"$f":"IF($E$3=\"Executive/Managerial\",(4*(SUM(G46:H48)/12)),(2*(SUM(G46:H48)/12)))","v":0},null,{"$f":"IF($E$3=\"Executive/Managerial\",(4*(SUM(I46:J48)/12)),(2*(SUM(I46:J48)/12)))","v":0},null,{"$f":"IF($E$3=\"Executive/Managerial\",(4*(SUM(K46:L48)/12)),(2*(SUM(K46:L48)/12)))","v":0},null,null,{"$f":"IF($E$3=\"Executive/Managerial\",(4*(SUM(N46:O48)/12)),(2*(SUM(N46:O48)/12)))","v":0},null,{"$f":"IF($E$3=\"Executive/Managerial\",(4*(SUM(P46:Q48)/12)),(2*(SUM(P46:Q48)/12)))","v":0},null,{"$f":"IF($E$3=\"Executive/Managerial\",(4*(SUM(R46:S48)/12)),(2*(SUM(R46:S48)/12)))","v":0},null,{"$f":"IF($E$3=\"Executive/Managerial\",(4*(SUM(T46:U48)/12)),(2*(SUM(T46:U48)/12)))","v":0},null,null,{"$f":"IF($E$3=\"Executive/Managerial\",(2*(SUM(W46:X48))/8),(1*(SUM(W46:X48))/8))","v":0},null,{"$f":"IF($E$3=\"Executive/Managerial\",(2*(SUM(Y46:Z48))/8),(1*(SUM(Y46:Z48))/8))","v":0},null,{"$f":"IF($E$3=\"Executive/Managerial\",(2*(SUM(AA46:AB48))/8),(1*(SUM(AA46:AB48))/8))","v":0},null,{"$f":"IF($E$3=\"Executive/Managerial\",(2*(SUM(AC46:AD48))/8),(1*(SUM(AC46:AD48))/8))","v":0}]
[null,null,null,null,null,null,"Supervisor",null,"Co-worker"]
[null,null,null,null,"Attitude",null,{"$f":"E49","v":0},null,{"$f":"SUM(G49:L49)/3","v":0},null,null,null,null,"Total Score PCPT:",null,null,{"$f":"IF(E3=\"Executive/Managerial\",SUM(G54:J54),SUM(G54:J54))","v":0}]
[null,null,null,null,"Commitment",null,{"$f":"N49","v":0},null,{"$f":"SUM(P49:U49)/3","v":0}]
[null,null,null,null,"Appearance",null,{"$f":"W49","v":0},null,{"$f":"SUM(Y49:AD49)/3","v":0}]
[null,null,null,null,null,null,{"$f":"SUM(G51:G53)*0.6","v":0},null,{"$f":"SUM(I51:I53)*0.4","v":0}]
[null,null,{"$f":"IF(E3=\"First Level\",\"G. Potential [Assessment Form No. 2] (3 pts.)\",\"G. Potential [Assessment Form No. 2] (5 pts.)\")","v":"G. Potential [Assessment Form No. 2] (5 pts.)"}]
[]
[null,null,null,"INTERVIEW"]
[]
[null,null,null,null,"G.1.1. Sound judgement",null,null,null,null,null,null,{"$f":"IF($E$3=\"First Level\",\"Not Applicable for First Level position\",\"\")","v":""}]
[null,null,null,null,"G.1.2. Analytical mind",null,null,null,null,null,null,{"$f":"IF($E$3=\"First Level\",\"Not Applicable for First Level position\",\"\")","v":""}]
[null,null,null,null,"G.1.3. The ability to motivate co-workers",null,null,null,null,null,null,{"$f":"IF($E$3=\"First Level\",\"Not Applicable for First Level position\",\"\")","v":""}]
[null,null,null,null,"G.1.4. Unifying Factor",null,null,null,null,null,null,{"$f":"IF($E$3=\"First Level\",\"Not Applicable for First Level position\",\"\")","v":""}]
[null,null,null,null,"G.1.5. Vision/foresight",null,null,null,null,null,null,{"$f":"IF($E$3=\"First Level\",\"Not Applicable for First Level position\",\"\")","v":""}]
[null,null,null,null,"G.2. Resourcefulness"]
[null,null,null,null,"G.3. Creativity/ Ingenuity "]
[]
[null,null,null,"TOTAL POINTS FOR POTENTIAL",null,null,null,null,null,null,{"$f":"IF(E3=\"First Level\",(3*(SUM(K64:K65)/8)),(5*(SUM(K59:K65)/28)))","v":0}]
[]
[null,null,{"$f":"IF(E3=\"First Level\",\"H. Written/ Skills Examination (12 pts.)\",\"H. Written/ Skills Examination (15 pts.)\")","v":"H. Written/ Skills Examination (15 pts.)"}]
[null,null,null,null,null,null,null,null,null,null,{"$f":"IFERROR(SUM(K59:K65)/7,0)","v":0}]
[null,null,null,"WRITTEN/SKILLS EXAMINATION"]
[]
[null,null,null,null,"Perfect/Entire Score",null,null,"="]
[null,null,null,null,"Raw Score",null,null,"="]
[]
[]
[null,null,null,"TOTAL FOR EXAMINATION",null,null,null,null,null,null,{"$f":"IFERROR(IF(E3=\"First Level\",IF(K74>K73,0,(K74*12)/K73),IF(K74>K73,0,(K74*15)/K73)),0)","v":0}]
[]
[null,null,"I. Public Service"]
[]
[null,null,null,null,"Additional Pts. in excess of Total Score"]

{"sheet":"AP41","index":48,"n_rows":81,"n_cols":33,"rows_kept":81,"cut":false,"hidden":false,"merged":[[1,2,1,29],[2,4,2,9],[2,13,2,22],[2,27,2,30],[2,32,2,33],[45,4,45,5],[45,6,45,7],[45,8,45,9],[45,10,45,11],[45,13,45,14],[10,15,10,22],[12,15,12,22],[14,15,14,22],[19,19,19,22],[35,4,37,7],[45,28,45,29],[45,24,45,25],[45,26,45,27],[6,11,6,22],[46,4,46,5],[46,6,46,7],[46,8,46,9],[46,10,46,11],[46,13,46,14],[46,17,46,18],[46,19,46,20],[46,22,46,23],[45,15,45,16],[45,17,45,18],[45,19,45,20],[45,22,45,23],[46,24,46,25],[46,26,46,27],[46,28,46,29],[47,4,47,5],[47,6,47,7],[47,8,47,9],[47,10,47,11],[47,13,47,14],[47,15,47,16],[47,17,47,18],[47,19,47,20],[47,22,47,23],[47,24,47,25],[47,26,47,27],[47,28,47,29],[46,15,46,16],[48,4,48,5],[48,6,48,7],[48,8,48,9],[48,10,48,11],[48,13,48,14],[48,28,48,29],[50,16,50,17],[48,15,48,16],[48,17,48,18],[48,19,48,20],[48,22,48,23],[48,24,48,25],[48,26,48,27]]}
[]
[null,null,"MSP CALCULATOR"]
[null,null,"Levels",":",{"$f":"IF(Vacancy!E6=\"\",\"\",Vacancy!E6)","v":""},null,null,null,null,null,null,"Name",":",null,null,null,null,null,null,null,null,null,null,null,null,null,"Employment Category:",null,null,null,null,null,{"$f":"SUM(F13,Y11,Y13,Y15,E25,Z25,J40,Q51,K67,K77,D81)","v":0}]
[null,null,null,null,null,null,null,null,null,null,null,null,null,null,null,null,null,null,null,null,null,null,null,null,null,null,null,null,null,null,null,null,"TOTAL MATRIX POINTS"]
[null,null,{"$f":"IF(E3=\"First Level\",\"A. Performance Rating (20 pts)\",IF(E3=\"Second Level\",\"A. Performance Rating (15 pts)\",\"A. Performance Rating (35 pts)\"))","v":"A. Performance Rating (35 pts)"},null,null,null,null,null,null,null,null,{"$f":"IF(E3=\"First Level\",\"B. Education (15 pts.)\",IF(E3=\"Second Level\",\"B. Education (10 pts.)\",\"B. Education (5 pts.)\"))","v":"B. Education (5 pts.)"}]
[null,null,"New Graduates (No previous work experience)",null,null,null,null,null,null,null,null,"Required:"]
[false,null,null,null,null,null,null,{"$f":"IF(F9>=2.75,1,IF(F9>=2.5,3,IF(F9>=2.25,5,IF(F9>=2,7,IF(F9>=1.75,9,IF(F9>=1.5,11,IF(F9>=1.25,13,IF(F9>=1,15))))))))","v":false},null,null,null,{"$f":"IF(Vacancy!E10=\"\",\"\",Vacancy!E10)","v":""}]
[]
[null,null,"GWA",null,null,null,{"$f":"IF(F9>=2.75,2,IF(F9>=2.5,5,IF(F9>=2.25,8,IF(F9>=2,11,IF(F9>=1.75,14,IF(F9>=1.5,16,IF(F9>=1.25,18,IF(F9>=1,20))))))))","v":false},{"$f":"IF(E3=\"First Level\",(20*F11)/5,IF(E3=\"Second Level\",(15*F11)/5,IF(E3=\"Executive/Managerial\",(35*F11)/5,\"\")))","v":""},null,null,null,"Highest Educational Attainment:",null,null,null,null,null,null,null,null,null,null,null,null,"Total Score:"]
[]
[null,null,"Last Rating Period",null,null,null,null,{"$f":"IFERROR(IF(AND(A7=TRUE,E3=\"First Level\"),G9,IF(AND(A7=TRUE,E3=\"Second Level\"),H7,H9)),\"\")","v":""},null,null,null,"First Level:",null,null,null,null,null,null,null,null,null,null,null,{"$f":"VLOOKUP(P11,Educ_2!$A$11:$B$26,2,FALSE)","v":{"$error":"#N/A"}},{"$f":"IFERROR(VLOOKUP($L$7,Educ_2!$A$1:$Q$8,X11+1,FALSE),\"\")","v":""}]
[]
[false,null,"Total Score",null,":",{"$f":"IF(H11=FALSE,0,H11)","v":""},"pts.",null,null,null,null,"Second Level:",null,null,null,null,null,null,null,null,null,null,null,{"$f":"VLOOKUP(P13,Educ_2!$A$11:$B$26,2,FALSE)","v":{"$error":"#N/A"}},{"$f":"IFERROR(VLOOKUP($L$7,Educ_2!$A$1:$Q$8,X13+1,FALSE),\"\")","v":""}]
[]
[null,null,null,null,null,null,null,null,null,null,null,"Executive/Managerial:",null,null,null,null,null,null,null,null,null,null,null,{"$f":"VLOOKUP(P15,Educ_2!$A$11:$B$26,2,FALSE)","v":{"$error":"#N/A"}},{"$f":"IFERROR(VLOOKUP($L$7,Educ_2!$A$1:$Q$8,X15+1,FALSE),\"\")","v":""}]
[]
[null,null,null,null,null,null,null,null,null,null,null,null,null,null,null,null,null,null,null,null,null,null,null,null,{"$f":"SUM(Y11,Y13,Y15)","v":0}]
[]
[null,null,"C. Training (10 pts.)",null,null,null,null,null,null,null,null,null,null,null,null,null,null,null,null,null,null,null,null,null,{"$f":"IF(E3=\"Executive/Managerial\",\"D. Experience (10 pts)\",\"D. Experience (25 pts)\")","v":"D. Experience (25 pts)"}]
[null,null,null,null,null,null,null,null,null,null,null,null,null,null,null,null,null,null,null,"Coversion to YEAR"]
[true,null,null,null,{"$f":"IF(Vacancy!$R$10=\"None required\",0,IF(Vacancy!$R$10=\"\",\"\",Vacancy!$R$10))","v":""},"Required (hrs.)",null,null,null,null,null,null,null,null,null,null,null,null,null,null,"Year",null,{"$f":"T21","v":0},null,null,{"$f":"IF(Vacancy!$AA$10=\"None required\",0,IF(Vacancy!$AA$10=\"\",\"\",Vacancy!$AA$10))","v":""},"Required Exp."]
[]
[null,null,null,{"$f":"E23-E21","v":{"$error":"#VALUE!"}},null,"Relevant training hrs. acquired",null,null,null,null,null,null,null,null,null,null,null,null,null,null,"Month",null,{"$f":"T23/12","v":0},null,{"$f":"Z23-Z21","v":{"$error":"#VALUE!"}},{"$f":"SUM(W21,W23,W25)","v":0},"Relevant years of experience"]
[]
[null,null,null,null,{"$f":"IF(N3=\"\",0,IFERROR(IF(E21=E23,5,IF(E23>=E21,((5*D23)/Trg_Exp!$D$2)+5,0)),0))","v":0},"Total",null,null,null,null,null,null,null,null,null,null,null,null,null,null,"Day",null,{"$f":"T25/365","v":0},null,{"$f":"IFERROR(IF(AND(Z21=Z23),10,IF(Vacancy!E6=\"Executive/Managerial\",((10*Y23)/Trg_Exp!$K$2),IF(Z23>=Z21,((15*Y23)/Trg_Exp!$K$2)+10,0))),0)","v":0},{"$f":"IF(N3=\"\",0,IF(Y25<0,0,Y25))","v":0},"Total Score:"]
[]
[null,null,{"$f":"IF(Vacancy!E6=\"Second Level\",\"E. Accomplishment (15 pts.)\",\"E. Accomplishment (10 pts.)\")","v":"E. Accomplishment (10 pts.)"}]
[]
[null,null,null,null,"E.1  Awards/Citations/Commendations"]
[]
[false,null,null,null,"E.1.1. Unit Level",null,null,null,null,{"$f":"IF(A31=TRUE,1,\"\")","v":""}]
[]
[false,null,null,null,"E.1.2. University Level",null,null,null,null,{"$f":"IF(A33=TRUE,3,\"\")","v":""}]
[]
[false,null,null,null,"E.1.3. National/CSC Level",null,null,null,null,{"$f":"IF(A35=TRUE,5,\"\")","v":""}]
[null,null,null,null,"E.2. Innovations/ Systems Improvement"]
[false,null,null,null,null,null,null,null,null,{"$f":"IF(A37=TRUE,IF(Vacancy!E6=\"Second Level\",4,3),\"\")","v":""}]
[null,null,null,null,null,null,null,null,null,null,{"$f":"IF(E3=\"Second Level\",((SUM(J31,J33,J35)*11)/9),((SUM(J31,J33,J35)*7)/9))","v":0}]
[]
[null,null,null,null,"C.2. Total Score:",null,null,null,null,{"$f":"IF(E3=\"Second Level\",(15*SUM(K38,J37)/15),(10*SUM(K38,J37)/10))","v":0}]
[]
[null,null,{"$f":"IF(E3=\"Executive/Managerial\",\"F. Physical Characteristics and Personality Traits (10 pts.)\",\"F. Physical Characteristics and Personality Traits (5 pts.)\")","v":"F. Physical Characteristics and Personality Traits (5 pts.)"}]
[]
[null,null,null,null,"Supervisor",null,"Co-worker 1",null,"Co-worker 2",null,"Co-worker 3",null,null,"Supervisor",null,"Co-worker 1",null,"Co-worker 2",null,"Co-worker 3",null,null,"Supervisor",null,"Co-worker 1",null,"Co-worker 2",null,"Co-worker 3"]
[null,null,null,null,"ATTITUDE",null,null,null,null,null,null,null,null,"COMMITMENT",null,null,null,null,null,null,null,null,"APPEARANCE"]
[null,null,null,"F.1.1. ",null,null,null,null,null,null,null,null,"F.2.1. ",null,null,null,null,null,null,null,null,"F.3.1. "]
[null,null,null,"F.1.2. ",null,null,null,null,null,null,null,null,"F.2.2. ",null,null,null,null,null,null,null,null,"F.3.2. "]
[null,null,null,"F.1.3. ",null,null,null,null,null,null,null,null,"F.2.3. "]
[null,null,null,null,{"$f":"IF($E$3=\"Executive/Managerial\",(4*(SUM(E46:F48)/12)),(2*(SUM(E46:F48)/12)))","v":0},null,{"$f":"IF($E$3=\"Executive/Managerial\",(4*(SUM(G46:H48)/12)),(2*(SUM(G46:H48)/12)))","v":0},null,{"$f":"IF($E$3=\"Executive/Managerial\",(4*(SUM(I46:J48)/12)),(2*(SUM(I46:J48)/12)))","v":0},null,{"$f":"IF($E$3=\"Executive/Managerial\",(4*(SUM(K46:L48)/12)),(2*(SUM(K46:L48)/12)))","v":0},null,null,{"$f":"IF($E$3=\"Executive/Managerial\",(4*(SUM(N46:O48)/12)),(2*(SUM(N46:O48)/12)))","v":0},null,{"$f":"IF($E$3=\"Executive/Managerial\",(4*(SUM(P46:Q48)/12)),(2*(SUM(P46:Q48)/12)))","v":0},null,{"$f":"IF($E$3=\"Executive/Managerial\",(4*(SUM(R46:S48)/12)),(2*(SUM(R46:S48)/12)))","v":0},null,{"$f":"IF($E$3=\"Executive/Managerial\",(4*(SUM(T46:U48)/12)),(2*(SUM(T46:U48)/12)))","v":0},null,null,{"$f":"IF($E$3=\"Executive/Managerial\",(2*(SUM(W46:X48))/8),(1*(SUM(W46:X48))/8))","v":0},null,{"$f":"IF($E$3=\"Executive/Managerial\",(2*(SUM(Y46:Z48))/8),(1*(SUM(Y46:Z48))/8))","v":0},null,{"$f":"IF($E$3=\"Executive/Managerial\",(2*(SUM(AA46:AB48))/8),(1*(SUM(AA46:AB48))/8))","v":0},null,{"$f":"IF($E$3=\"Executive/Managerial\",(2*(SUM(AC46:AD48))/8),(1*(SUM(AC46:AD48))/8))","v":0}]
[null,null,null,null,null,null,"Supervisor",null,"Co-worker"]
[null,null,null,null,"Attitude",null,{"$f":"E49","v":0},null,{"$f":"SUM(G49:L49)/3","v":0},null,null,null,null,"Total Score PCPT:",null,null,{"$f":"IF(E3=\"Executive/Managerial\",SUM(G54:J54),SUM(G54:J54))","v":0}]
[null,null,null,null,"Commitment",null,{"$f":"N49","v":0},null,{"$f":"SUM(P49:U49)/3","v":0}]
[null,null,null,null,"Appearance",null,{"$f":"W49","v":0},null,{"$f":"SUM(Y49:AD49)/3","v":0}]
[null,null,null,null,null,null,{"$f":"SUM(G51:G53)*0.6","v":0},null,{"$f":"SUM(I51:I53)*0.4","v":0}]
[null,null,{"$f":"IF(E3=\"First Level\",\"G. Potential [Assessment Form No. 2] (3 pts.)\",\"G. Potential [Assessment Form No. 2] (5 pts.)\")","v":"G. Potential [Assessment Form No. 2] (5 pts.)"}]
[]
[null,null,null,"INTERVIEW"]
[]
[null,null,null,null,"G.1.1. Sound judgement",null,null,null,null,null,null,{"$f":"IF($E$3=\"First Level\",\"Not Applicable for First Level position\",\"\")","v":""}]
[null,null,null,null,"G.1.2. Analytical mind",null,null,null,null,null,null,{"$f":"IF($E$3=\"First Level\",\"Not Applicable for First Level position\",\"\")","v":""}]
[null,null,null,null,"G.1.3. The ability to motivate co-workers",null,null,null,null,null,null,{"$f":"IF($E$3=\"First Level\",\"Not Applicable for First Level position\",\"\")","v":""}]
[null,null,null,null,"G.1.4. Unifying Factor",null,null,null,null,null,null,{"$f":"IF($E$3=\"First Level\",\"Not Applicable for First Level position\",\"\")","v":""}]
[null,null,null,null,"G.1.5. Vision/foresight",null,null,null,null,null,null,{"$f":"IF($E$3=\"First Level\",\"Not Applicable for First Level position\",\"\")","v":""}]
[null,null,null,null,"G.2. Resourcefulness"]
[null,null,null,null,"G.3. Creativity/ Ingenuity "]
[]
[null,null,null,"TOTAL POINTS FOR POTENTIAL",null,null,null,null,null,null,{"$f":"IF(E3=\"First Level\",(3*(SUM(K64:K65)/8)),(5*(SUM(K59:K65)/28)))","v":0}]
[]
[null,null,{"$f":"IF(E3=\"First Level\",\"H. Written/ Skills Examination (12 pts.)\",\"H. Written/ Skills Examination (15 pts.)\")","v":"H. Written/ Skills Examination (15 pts.)"}]
[null,null,null,null,null,null,null,null,null,null,{"$f":"IFERROR(SUM(K59:K65)/7,0)","v":0}]
[null,null,null,"WRITTEN/SKILLS EXAMINATION"]
[]
[null,null,null,null,"Perfect/Entire Score",null,null,"="]
[null,null,null,null,"Raw Score",null,null,"="]
[]
[]
[null,null,null,"TOTAL FOR EXAMINATION",null,null,null,null,null,null,{"$f":"IFERROR(IF(E3=\"First Level\",IF(K74>K73,0,(K74*12)/K73),IF(K74>K73,0,(K74*15)/K73)),0)","v":0}]
[]
[null,null,"I. Public Service"]
[]
[null,null,null,null,"Additional Pts. in excess of Total Score"]

{"sheet":"AP42","index":49,"n_rows":81,"n_cols":33,"rows_kept":81,"cut":false,"hidden":false,"merged":[[1,2,1,29],[2,4,2,9],[2,13,2,22],[2,27,2,30],[2,32,2,33],[45,4,45,5],[45,6,45,7],[45,8,45,9],[45,10,45,11],[45,13,45,14],[10,15,10,22],[12,15,12,22],[14,15,14,22],[19,19,19,22],[35,4,37,7],[45,28,45,29],[45,24,45,25],[45,26,45,27],[6,11,6,22],[46,4,46,5],[46,6,46,7],[46,8,46,9],[46,10,46,11],[46,13,46,14],[46,17,46,18],[46,19,46,20],[46,22,46,23],[45,15,45,16],[45,17,45,18],[45,19,45,20],[45,22,45,23],[46,24,46,25],[46,26,46,27],[46,28,46,29],[47,4,47,5],[47,6,47,7],[47,8,47,9],[47,10,47,11],[47,13,47,14],[47,15,47,16],[47,17,47,18],[47,19,47,20],[47,22,47,23],[47,24,47,25],[47,26,47,27],[47,28,47,29],[46,15,46,16],[48,4,48,5],[48,6,48,7],[48,8,48,9],[48,10,48,11],[48,13,48,14],[48,28,48,29],[50,16,50,17],[48,15,48,16],[48,17,48,18],[48,19,48,20],[48,22,48,23],[48,24,48,25],[48,26,48,27]]}
[]
[null,null,"MSP CALCULATOR"]
[null,null,"Levels",":",{"$f":"IF(Vacancy!E6=\"\",\"\",Vacancy!E6)","v":""},null,null,null,null,null,null,"Name",":",null,null,null,null,null,null,null,null,null,null,null,null,null,"Employment Category:",null,null,null,null,null,{"$f":"SUM(F13,Y11,Y13,Y15,E25,Z25,J40,Q51,K67,K77,D81)","v":0}]
[null,null,null,null,null,null,null,null,null,null,null,null,null,null,null,null,null,null,null,null,null,null,null,null,null,null,null,null,null,null,null,null,"TOTAL MATRIX POINTS"]
[null,null,{"$f":"IF(E3=\"First Level\",\"A. Performance Rating (20 pts)\",IF(E3=\"Second Level\",\"A. Performance Rating (15 pts)\",\"A. Performance Rating (35 pts)\"))","v":"A. Performance Rating (35 pts)"},null,null,null,null,null,null,null,null,{"$f":"IF(E3=\"First Level\",\"B. Education (15 pts.)\",IF(E3=\"Second Level\",\"B. Education (10 pts.)\",\"B. Education (5 pts.)\"))","v":"B. Education (5 pts.)"}]
[null,null,"New Graduates (No previous work experience)",null,null,null,null,null,null,null,null,"Required:"]
[false,null,null,null,null,null,null,{"$f":"IF(F9>=2.75,1,IF(F9>=2.5,3,IF(F9>=2.25,5,IF(F9>=2,7,IF(F9>=1.75,9,IF(F9>=1.5,11,IF(F9>=1.25,13,IF(F9>=1,15))))))))","v":false},null,null,null,{"$f":"IF(Vacancy!E10=\"\",\"\",Vacancy!E10)","v":""}]
[]
[null,null,"GWA",null,null,null,{"$f":"IF(F9>=2.75,2,IF(F9>=2.5,5,IF(F9>=2.25,8,IF(F9>=2,11,IF(F9>=1.75,14,IF(F9>=1.5,16,IF(F9>=1.25,18,IF(F9>=1,20))))))))","v":false},{"$f":"IF(E3=\"First Level\",(20*F11)/5,IF(E3=\"Second Level\",(15*F11)/5,IF(E3=\"Executive/Managerial\",(35*F11)/5,\"\")))","v":""},null,null,null,"Highest Educational Attainment:",null,null,null,null,null,null,null,null,null,null,null,null,"Total Score:"]
[]
[null,null,"Last Rating Period",null,null,null,null,{"$f":"IFERROR(IF(AND(A7=TRUE,E3=\"First Level\"),G9,IF(AND(A7=TRUE,E3=\"Second Level\"),H7,H9)),\"\")","v":""},null,null,null,"First Level:",null,null,null,null,null,null,null,null,null,null,null,{"$f":"VLOOKUP(P11,Educ_2!$A$11:$B$26,2,FALSE)","v":{"$error":"#N/A"}},{"$f":"IFERROR(VLOOKUP($L$7,Educ_2!$A$1:$Q$8,X11+1,FALSE),\"\")","v":""}]
[]
[false,null,"Total Score",null,":",{"$f":"IF(H11=FALSE,0,H11)","v":""},"pts.",null,null,null,null,"Second Level:",null,null,null,null,null,null,null,null,null,null,null,{"$f":"VLOOKUP(P13,Educ_2!$A$11:$B$26,2,FALSE)","v":{"$error":"#N/A"}},{"$f":"IFERROR(VLOOKUP($L$7,Educ_2!$A$1:$Q$8,X13+1,FALSE),\"\")","v":""}]
[]
[null,null,null,null,null,null,null,null,null,null,null,"Executive/Managerial:",null,null,null,null,null,null,null,null,null,null,null,{"$f":"VLOOKUP(P15,Educ_2!$A$11:$B$26,2,FALSE)","v":{"$error":"#N/A"}},{"$f":"IFERROR(VLOOKUP($L$7,Educ_2!$A$1:$Q$8,X15+1,FALSE),\"\")","v":""}]
[]
[null,null,null,null,null,null,null,null,null,null,null,null,null,null,null,null,null,null,null,null,null,null,null,null,{"$f":"SUM(Y11,Y13,Y15)","v":0}]
[]
[null,null,"C. Training (10 pts.)",null,null,null,null,null,null,null,null,null,null,null,null,null,null,null,null,null,null,null,null,null,{"$f":"IF(E3=\"Executive/Managerial\",\"D. Experience (10 pts)\",\"D. Experience (25 pts)\")","v":"D. Experience (25 pts)"}]
[null,null,null,null,null,null,null,null,null,null,null,null,null,null,null,null,null,null,null,"Coversion to YEAR"]
[true,null,null,null,{"$f":"IF(Vacancy!$R$10=\"None required\",0,IF(Vacancy!$R$10=\"\",\"\",Vacancy!$R$10))","v":""},"Required (hrs.)",null,null,null,null,null,null,null,null,null,null,null,null,null,null,"Year",null,{"$f":"T21","v":0},null,null,{"$f":"IF(Vacancy!$AA$10=\"None required\",0,IF(Vacancy!$AA$10=\"\",\"\",Vacancy!$AA$10))","v":""},"Required Exp."]
[]
[null,null,null,{"$f":"E23-E21","v":{"$error":"#VALUE!"}},null,"Relevant training hrs. acquired",null,null,null,null,null,null,null,null,null,null,null,null,null,null,"Month",null,{"$f":"T23/12","v":0},null,{"$f":"Z23-Z21","v":{"$error":"#VALUE!"}},{"$f":"SUM(W21,W23,W25)","v":0},"Relevant years of experience"]
[]
[null,null,null,null,{"$f":"IF(N3=\"\",0,IFERROR(IF(E21=E23,5,IF(E23>=E21,((5*D23)/Trg_Exp!$D$2)+5,0)),0))","v":0},"Total",null,null,null,null,null,null,null,null,null,null,null,null,null,null,"Day",null,{"$f":"T25/365","v":0},null,{"$f":"IFERROR(IF(AND(Z21=Z23),10,IF(Vacancy!E6=\"Executive/Managerial\",((10*Y23)/Trg_Exp!$K$2),IF(Z23>=Z21,((15*Y23)/Trg_Exp!$K$2)+10,0))),0)","v":0},{"$f":"IF(N3=\"\",0,IF(Y25<0,0,Y25))","v":0},"Total Score:"]
[]
[null,null,{"$f":"IF(Vacancy!E6=\"Second Level\",\"E. Accomplishment (15 pts.)\",\"E. Accomplishment (10 pts.)\")","v":"E. Accomplishment (10 pts.)"}]
[]
[null,null,null,null,"E.1  Awards/Citations/Commendations"]
[]
[false,null,null,null,"E.1.1. Unit Level",null,null,null,null,{"$f":"IF(A31=TRUE,1,\"\")","v":""}]
[]
[false,null,null,null,"E.1.2. University Level",null,null,null,null,{"$f":"IF(A33=TRUE,3,\"\")","v":""}]
[]
[false,null,null,null,"E.1.3. National/CSC Level",null,null,null,null,{"$f":"IF(A35=TRUE,5,\"\")","v":""}]
[null,null,null,null,"E.2. Innovations/ Systems Improvement"]
[false,null,null,null,null,null,null,null,null,{"$f":"IF(A37=TRUE,IF(Vacancy!E6=\"Second Level\",4,3),\"\")","v":""}]
[null,null,null,null,null,null,null,null,null,null,{"$f":"IF(E3=\"Second Level\",((SUM(J31,J33,J35)*11)/9),((SUM(J31,J33,J35)*7)/9))","v":0}]
[]
[null,null,null,null,"C.2. Total Score:",null,null,null,null,{"$f":"IF(E3=\"Second Level\",(15*SUM(K38,J37)/15),(10*SUM(K38,J37)/10))","v":0}]
[]
[null,null,{"$f":"IF(E3=\"Executive/Managerial\",\"F. Physical Characteristics and Personality Traits (10 pts.)\",\"F. Physical Characteristics and Personality Traits (5 pts.)\")","v":"F. Physical Characteristics and Personality Traits (5 pts.)"}]
[]
[null,null,null,null,"Supervisor",null,"Co-worker 1",null,"Co-worker 2",null,"Co-worker 3",null,null,"Supervisor",null,"Co-worker 1",null,"Co-worker 2",null,"Co-worker 3",null,null,"Supervisor",null,"Co-worker 1",null,"Co-worker 2",null,"Co-worker 3"]
[null,null,null,null,"ATTITUDE",null,null,null,null,null,null,null,null,"COMMITMENT",null,null,null,null,null,null,null,null,"APPEARANCE"]
[null,null,null,"F.1.1. ",null,null,null,null,null,null,null,null,"F.2.1. ",null,null,null,null,null,null,null,null,"F.3.1. "]
[null,null,null,"F.1.2. ",null,null,null,null,null,null,null,null,"F.2.2. ",null,null,null,null,null,null,null,null,"F.3.2. "]
[null,null,null,"F.1.3. ",null,null,null,null,null,null,null,null,"F.2.3. "]
[null,null,null,null,{"$f":"IF($E$3=\"Executive/Managerial\",(4*(SUM(E46:F48)/12)),(2*(SUM(E46:F48)/12)))","v":0},null,{"$f":"IF($E$3=\"Executive/Managerial\",(4*(SUM(G46:H48)/12)),(2*(SUM(G46:H48)/12)))","v":0},null,{"$f":"IF($E$3=\"Executive/Managerial\",(4*(SUM(I46:J48)/12)),(2*(SUM(I46:J48)/12)))","v":0},null,{"$f":"IF($E$3=\"Executive/Managerial\",(4*(SUM(K46:L48)/12)),(2*(SUM(K46:L48)/12)))","v":0},null,null,{"$f":"IF($E$3=\"Executive/Managerial\",(4*(SUM(N46:O48)/12)),(2*(SUM(N46:O48)/12)))","v":0},null,{"$f":"IF($E$3=\"Executive/Managerial\",(4*(SUM(P46:Q48)/12)),(2*(SUM(P46:Q48)/12)))","v":0},null,{"$f":"IF($E$3=\"Executive/Managerial\",(4*(SUM(R46:S48)/12)),(2*(SUM(R46:S48)/12)))","v":0},null,{"$f":"IF($E$3=\"Executive/Managerial\",(4*(SUM(T46:U48)/12)),(2*(SUM(T46:U48)/12)))","v":0},null,null,{"$f":"IF($E$3=\"Executive/Managerial\",(2*(SUM(W46:X48))/8),(1*(SUM(W46:X48))/8))","v":0},null,{"$f":"IF($E$3=\"Executive/Managerial\",(2*(SUM(Y46:Z48))/8),(1*(SUM(Y46:Z48))/8))","v":0},null,{"$f":"IF($E$3=\"Executive/Managerial\",(2*(SUM(AA46:AB48))/8),(1*(SUM(AA46:AB48))/8))","v":0},null,{"$f":"IF($E$3=\"Executive/Managerial\",(2*(SUM(AC46:AD48))/8),(1*(SUM(AC46:AD48))/8))","v":0}]
[null,null,null,null,null,null,"Supervisor",null,"Co-worker"]
[null,null,null,null,"Attitude",null,{"$f":"E49","v":0},null,{"$f":"SUM(G49:L49)/3","v":0},null,null,null,null,"Total Score PCPT:",null,null,{"$f":"IF(E3=\"Executive/Managerial\",SUM(G54:J54),SUM(G54:J54))","v":0}]
[null,null,null,null,"Commitment",null,{"$f":"N49","v":0},null,{"$f":"SUM(P49:U49)/3","v":0}]
[null,null,null,null,"Appearance",null,{"$f":"W49","v":0},null,{"$f":"SUM(Y49:AD49)/3","v":0}]
[null,null,null,null,null,null,{"$f":"SUM(G51:G53)*0.6","v":0},null,{"$f":"SUM(I51:I53)*0.4","v":0}]
[null,null,{"$f":"IF(E3=\"First Level\",\"G. Potential [Assessment Form No. 2] (3 pts.)\",\"G. Potential [Assessment Form No. 2] (5 pts.)\")","v":"G. Potential [Assessment Form No. 2] (5 pts.)"}]
[]
[null,null,null,"INTERVIEW"]
[]
[null,null,null,null,"G.1.1. Sound judgement",null,null,null,null,null,null,{"$f":"IF($E$3=\"First Level\",\"Not Applicable for First Level position\",\"\")","v":""}]
[null,null,null,null,"G.1.2. Analytical mind",null,null,null,null,null,null,{"$f":"IF($E$3=\"First Level\",\"Not Applicable for First Level position\",\"\")","v":""}]
[null,null,null,null,"G.1.3. The ability to motivate co-workers",null,null,null,null,null,null,{"$f":"IF($E$3=\"First Level\",\"Not Applicable for First Level position\",\"\")","v":""}]
[null,null,null,null,"G.1.4. Unifying Factor",null,null,null,null,null,null,{"$f":"IF($E$3=\"First Level\",\"Not Applicable for First Level position\",\"\")","v":""}]
[null,null,null,null,"G.1.5. Vision/foresight",null,null,null,null,null,null,{"$f":"IF($E$3=\"First Level\",\"Not Applicable for First Level position\",\"\")","v":""}]
[null,null,null,null,"G.2. Resourcefulness"]
[null,null,null,null,"G.3. Creativity/ Ingenuity "]
[]
[null,null,null,"TOTAL POINTS FOR POTENTIAL",null,null,null,null,null,null,{"$f":"IF(E3=\"First Level\",(3*(SUM(K64:K65)/8)),(5*(SUM(K59:K65)/28)))","v":0}]
[]
[null,null,{"$f":"IF(E3=\"First Level\",\"H. Written/ Skills Examination (12 pts.)\",\"H. Written/ Skills Examination (15 pts.)\")","v":"H. Written/ Skills Examination (15 pts.)"}]
[null,null,null,null,null,null,null,null,null,null,{"$f":"IFERROR(SUM(K59:K65)/7,0)","v":0}]
[null,null,null,"WRITTEN/SKILLS EXAMINATION"]
[]
[null,null,null,null,"Perfect/Entire Score",null,null,"="]
[null,null,null,null,"Raw Score",null,null,"="]
[]
[]
[null,null,null,"TOTAL FOR EXAMINATION",null,null,null,null,null,null,{"$f":"IFERROR(IF(E3=\"First Level\",IF(K74>K73,0,(K74*12)/K73),IF(K74>K73,0,(K74*15)/K73)),0)","v":0}]
[]
[null,null,"I. Public Service"]
[]
[null,null,null,null,"Additional Pts. in excess of Total Score"]

{"sheet":"AP43","index":50,"n_rows":81,"n_cols":33,"rows_kept":81,"cut":false,"hidden":false,"merged":[[1,2,1,29],[2,4,2,9],[2,13,2,22],[2,27,2,30],[2,32,2,33],[45,4,45,5],[45,6,45,7],[45,8,45,9],[45,10,45,11],[45,13,45,14],[10,15,10,22],[12,15,12,22],[14,15,14,22],[19,19,19,22],[35,4,37,7],[45,28,45,29],[45,24,45,25],[45,26,45,27],[6,11,6,22],[46,4,46,5],[46,6,46,7],[46,8,46,9],[46,10,46,11],[46,13,46,14],[46,17,46,18],[46,19,46,20],[46,22,46,23],[45,15,45,16],[45,17,45,18],[45,19,45,20],[45,22,45,23],[46,24,46,25],[46,26,46,27],[46,28,46,29],[47,4,47,5],[47,6,47,7],[47,8,47,9],[47,10,47,11],[47,13,47,14],[47,15,47,16],[47,17,47,18],[47,19,47,20],[47,22,47,23],[47,24,47,25],[47,26,47,27],[47,28,47,29],[46,15,46,16],[48,4,48,5],[48,6,48,7],[48,8,48,9],[48,10,48,11],[48,13,48,14],[48,28,48,29],[50,16,50,17],[48,15,48,16],[48,17,48,18],[48,19,48,20],[48,22,48,23],[48,24,48,25],[48,26,48,27]]}
[]
[null,null,"MSP CALCULATOR"]
[null,null,"Levels",":",{"$f":"IF(Vacancy!E6=\"\",\"\",Vacancy!E6)","v":""},null,null,null,null,null,null,"Name",":",null,null,null,null,null,null,null,null,null,null,null,null,null,"Employment Category:",null,null,null,null,null,{"$f":"SUM(F13,Y11,Y13,Y15,E25,Z25,J40,Q51,K67,K77,D81)","v":0}]
[null,null,null,null,null,null,null,null,null,null,null,null,null,null,null,null,null,null,null,null,null,null,null,null,null,null,null,null,null,null,null,null,"TOTAL MATRIX POINTS"]
[null,null,{"$f":"IF(E3=\"First Level\",\"A. Performance Rating (20 pts)\",IF(E3=\"Second Level\",\"A. Performance Rating (15 pts)\",\"A. Performance Rating (35 pts)\"))","v":"A. Performance Rating (35 pts)"},null,null,null,null,null,null,null,null,{"$f":"IF(E3=\"First Level\",\"B. Education (15 pts.)\",IF(E3=\"Second Level\",\"B. Education (10 pts.)\",\"B. Education (5 pts.)\"))","v":"B. Education (5 pts.)"}]
[null,null,"New Graduates (No previous work experience)",null,null,null,null,null,null,null,null,"Required:"]
[false,null,null,null,null,null,null,{"$f":"IF(F9>=2.75,1,IF(F9>=2.5,3,IF(F9>=2.25,5,IF(F9>=2,7,IF(F9>=1.75,9,IF(F9>=1.5,11,IF(F9>=1.25,13,IF(F9>=1,15))))))))","v":false},null,null,null,{"$f":"IF(Vacancy!E10=\"\",\"\",Vacancy!E10)","v":""}]
[]
[null,null,"GWA",null,null,null,{"$f":"IF(F9>=2.75,2,IF(F9>=2.5,5,IF(F9>=2.25,8,IF(F9>=2,11,IF(F9>=1.75,14,IF(F9>=1.5,16,IF(F9>=1.25,18,IF(F9>=1,20))))))))","v":false},{"$f":"IF(E3=\"First Level\",(20*F11)/5,IF(E3=\"Second Level\",(15*F11)/5,IF(E3=\"Executive/Managerial\",(35*F11)/5,\"\")))","v":""},null,null,null,"Highest Educational Attainment:",null,null,null,null,null,null,null,null,null,null,null,null,"Total Score:"]
[]
[null,null,"Last Rating Period",null,null,null,null,{"$f":"IFERROR(IF(AND(A7=TRUE,E3=\"First Level\"),G9,IF(AND(A7=TRUE,E3=\"Second Level\"),H7,H9)),\"\")","v":""},null,null,null,"First Level:",null,null,null,null,null,null,null,null,null,null,null,{"$f":"VLOOKUP(P11,Educ_2!$A$11:$B$26,2,FALSE)","v":{"$error":"#N/A"}},{"$f":"IFERROR(VLOOKUP($L$7,Educ_2!$A$1:$Q$8,X11+1,FALSE),\"\")","v":""}]
[]
[false,null,"Total Score",null,":",{"$f":"IF(H11=FALSE,0,H11)","v":""},"pts.",null,null,null,null,"Second Level:",null,null,null,null,null,null,null,null,null,null,null,{"$f":"VLOOKUP(P13,Educ_2!$A$11:$B$26,2,FALSE)","v":{"$error":"#N/A"}},{"$f":"IFERROR(VLOOKUP($L$7,Educ_2!$A$1:$Q$8,X13+1,FALSE),\"\")","v":""}]
[]
[null,null,null,null,null,null,null,null,null,null,null,"Executive/Managerial:",null,null,null,null,null,null,null,null,null,null,null,{"$f":"VLOOKUP(P15,Educ_2!$A$11:$B$26,2,FALSE)","v":{"$error":"#N/A"}},{"$f":"IFERROR(VLOOKUP($L$7,Educ_2!$A$1:$Q$8,X15+1,FALSE),\"\")","v":""}]
[]
[null,null,null,null,null,null,null,null,null,null,null,null,null,null,null,null,null,null,null,null,null,null,null,null,{"$f":"SUM(Y11,Y13,Y15)","v":0}]
[]
[null,null,"C. Training (10 pts.)",null,null,null,null,null,null,null,null,null,null,null,null,null,null,null,null,null,null,null,null,null,{"$f":"IF(E3=\"Executive/Managerial\",\"D. Experience (10 pts)\",\"D. Experience (25 pts)\")","v":"D. Experience (25 pts)"}]
[null,null,null,null,null,null,null,null,null,null,null,null,null,null,null,null,null,null,null,"Coversion to YEAR"]
[true,null,null,null,{"$f":"IF(Vacancy!$R$10=\"None required\",0,IF(Vacancy!$R$10=\"\",\"\",Vacancy!$R$10))","v":""},"Required (hrs.)",null,null,null,null,null,null,null,null,null,null,null,null,null,null,"Year",null,{"$f":"T21","v":0},null,null,{"$f":"IF(Vacancy!$AA$10=\"None required\",0,IF(Vacancy!$AA$10=\"\",\"\",Vacancy!$AA$10))","v":""},"Required Exp."]
[]
[null,null,null,{"$f":"E23-E21","v":{"$error":"#VALUE!"}},null,"Relevant training hrs. acquired",null,null,null,null,null,null,null,null,null,null,null,null,null,null,"Month",null,{"$f":"T23/12","v":0},null,{"$f":"Z23-Z21","v":{"$error":"#VALUE!"}},{"$f":"SUM(W21,W23,W25)","v":0},"Relevant years of experience"]
[]
[null,null,null,null,{"$f":"IF(N3=\"\",0,IFERROR(IF(E21=E23,5,IF(E23>=E21,((5*D23)/Trg_Exp!$D$2)+5,0)),0))","v":0},"Total",null,null,null,null,null,null,null,null,null,null,null,null,null,null,"Day",null,{"$f":"T25/365","v":0},null,{"$f":"IFERROR(IF(AND(Z21=Z23),10,IF(Vacancy!E6=\"Executive/Managerial\",((10*Y23)/Trg_Exp!$K$2),IF(Z23>=Z21,((15*Y23)/Trg_Exp!$K$2)+10,0))),0)","v":0},{"$f":"IF(N3=\"\",0,IF(Y25<0,0,Y25))","v":0},"Total Score:"]
[]
[null,null,{"$f":"IF(Vacancy!E6=\"Second Level\",\"E. Accomplishment (15 pts.)\",\"E. Accomplishment (10 pts.)\")","v":"E. Accomplishment (10 pts.)"}]
[]
[null,null,null,null,"E.1  Awards/Citations/Commendations"]
[]
[false,null,null,null,"E.1.1. Unit Level",null,null,null,null,{"$f":"IF(A31=TRUE,1,\"\")","v":""}]
[]
[false,null,null,null,"E.1.2. University Level",null,null,null,null,{"$f":"IF(A33=TRUE,3,\"\")","v":""}]
[]
[false,null,null,null,"E.1.3. National/CSC Level",null,null,null,null,{"$f":"IF(A35=TRUE,5,\"\")","v":""}]
[null,null,null,null,"E.2. Innovations/ Systems Improvement"]
[false,null,null,null,null,null,null,null,null,{"$f":"IF(A37=TRUE,IF(Vacancy!E6=\"Second Level\",4,3),\"\")","v":""}]
[null,null,null,null,null,null,null,null,null,null,{"$f":"IF(E3=\"Second Level\",((SUM(J31,J33,J35)*11)/9),((SUM(J31,J33,J35)*7)/9))","v":0}]
[]
[null,null,null,null,"C.2. Total Score:",null,null,null,null,{"$f":"IF(E3=\"Second Level\",(15*SUM(K38,J37)/15),(10*SUM(K38,J37)/10))","v":0}]
[]
[null,null,{"$f":"IF(E3=\"Executive/Managerial\",\"F. Physical Characteristics and Personality Traits (10 pts.)\",\"F. Physical Characteristics and Personality Traits (5 pts.)\")","v":"F. Physical Characteristics and Personality Traits (5 pts.)"}]
[]
[null,null,null,null,"Supervisor",null,"Co-worker 1",null,"Co-worker 2",null,"Co-worker 3",null,null,"Supervisor",null,"Co-worker 1",null,"Co-worker 2",null,"Co-worker 3",null,null,"Supervisor",null,"Co-worker 1",null,"Co-worker 2",null,"Co-worker 3"]
[null,null,null,null,"ATTITUDE",null,null,null,null,null,null,null,null,"COMMITMENT",null,null,null,null,null,null,null,null,"APPEARANCE"]
[null,null,null,"F.1.1. ",null,null,null,null,null,null,null,null,"F.2.1. ",null,null,null,null,null,null,null,null,"F.3.1. "]
[null,null,null,"F.1.2. ",null,null,null,null,null,null,null,null,"F.2.2. ",null,null,null,null,null,null,null,null,"F.3.2. "]
[null,null,null,"F.1.3. ",null,null,null,null,null,null,null,null,"F.2.3. "]
[null,null,null,null,{"$f":"IF($E$3=\"Executive/Managerial\",(4*(SUM(E46:F48)/12)),(2*(SUM(E46:F48)/12)))","v":0},null,{"$f":"IF($E$3=\"Executive/Managerial\",(4*(SUM(G46:H48)/12)),(2*(SUM(G46:H48)/12)))","v":0},null,{"$f":"IF($E$3=\"Executive/Managerial\",(4*(SUM(I46:J48)/12)),(2*(SUM(I46:J48)/12)))","v":0},null,{"$f":"IF($E$3=\"Executive/Managerial\",(4*(SUM(K46:L48)/12)),(2*(SUM(K46:L48)/12)))","v":0},null,null,{"$f":"IF($E$3=\"Executive/Managerial\",(4*(SUM(N46:O48)/12)),(2*(SUM(N46:O48)/12)))","v":0},null,{"$f":"IF($E$3=\"Executive/Managerial\",(4*(SUM(P46:Q48)/12)),(2*(SUM(P46:Q48)/12)))","v":0},null,{"$f":"IF($E$3=\"Executive/Managerial\",(4*(SUM(R46:S48)/12)),(2*(SUM(R46:S48)/12)))","v":0},null,{"$f":"IF($E$3=\"Executive/Managerial\",(4*(SUM(T46:U48)/12)),(2*(SUM(T46:U48)/12)))","v":0},null,null,{"$f":"IF($E$3=\"Executive/Managerial\",(2*(SUM(W46:X48))/8),(1*(SUM(W46:X48))/8))","v":0},null,{"$f":"IF($E$3=\"Executive/Managerial\",(2*(SUM(Y46:Z48))/8),(1*(SUM(Y46:Z48))/8))","v":0},null,{"$f":"IF($E$3=\"Executive/Managerial\",(2*(SUM(AA46:AB48))/8),(1*(SUM(AA46:AB48))/8))","v":0},null,{"$f":"IF($E$3=\"Executive/Managerial\",(2*(SUM(AC46:AD48))/8),(1*(SUM(AC46:AD48))/8))","v":0}]
[null,null,null,null,null,null,"Supervisor",null,"Co-worker"]
[null,null,null,null,"Attitude",null,{"$f":"E49","v":0},null,{"$f":"SUM(G49:L49)/3","v":0},null,null,null,null,"Total Score PCPT:",null,null,{"$f":"IF(E3=\"Executive/Managerial\",SUM(G54:J54),SUM(G54:J54))","v":0}]
[null,null,null,null,"Commitment",null,{"$f":"N49","v":0},null,{"$f":"SUM(P49:U49)/3","v":0}]
[null,null,null,null,"Appearance",null,{"$f":"W49","v":0},null,{"$f":"SUM(Y49:AD49)/3","v":0}]
[null,null,null,null,null,null,{"$f":"SUM(G51:G53)*0.6","v":0},null,{"$f":"SUM(I51:I53)*0.4","v":0}]
[null,null,{"$f":"IF(E3=\"First Level\",\"G. Potential [Assessment Form No. 2] (3 pts.)\",\"G. Potential [Assessment Form No. 2] (5 pts.)\")","v":"G. Potential [Assessment Form No. 2] (5 pts.)"}]
[]
[null,null,null,"INTERVIEW"]
[]
[null,null,null,null,"G.1.1. Sound judgement",null,null,null,null,null,null,{"$f":"IF($E$3=\"First Level\",\"Not Applicable for First Level position\",\"\")","v":""}]
[null,null,null,null,"G.1.2. Analytical mind",null,null,null,null,null,null,{"$f":"IF($E$3=\"First Level\",\"Not Applicable for First Level position\",\"\")","v":""}]
[null,null,null,null,"G.1.3. The ability to motivate co-workers",null,null,null,null,null,null,{"$f":"IF($E$3=\"First Level\",\"Not Applicable for First Level position\",\"\")","v":""}]
[null,null,null,null,"G.1.4. Unifying Factor",null,null,null,null,null,null,{"$f":"IF($E$3=\"First Level\",\"Not Applicable for First Level position\",\"\")","v":""}]
[null,null,null,null,"G.1.5. Vision/foresight",null,null,null,null,null,null,{"$f":"IF($E$3=\"First Level\",\"Not Applicable for First Level position\",\"\")","v":""}]
[null,null,null,null,"G.2. Resourcefulness"]
[null,null,null,null,"G.3. Creativity/ Ingenuity "]
[]
[null,null,null,"TOTAL POINTS FOR POTENTIAL",null,null,null,null,null,null,{"$f":"IF(E3=\"First Level\",(3*(SUM(K64:K65)/8)),(5*(SUM(K59:K65)/28)))","v":0}]
[]
[null,null,{"$f":"IF(E3=\"First Level\",\"H. Written/ Skills Examination (12 pts.)\",\"H. Written/ Skills Examination (15 pts.)\")","v":"H. Written/ Skills Examination (15 pts.)"}]
[null,null,null,null,null,null,null,null,null,null,{"$f":"IFERROR(SUM(K59:K65)/7,0)","v":0}]
[null,null,null,"WRITTEN/SKILLS EXAMINATION"]
[]
[null,null,null,null,"Perfect/Entire Score",null,null,"="]
[null,null,null,null,"Raw Score",null,null,"="]
[]
[]
[null,null,null,"TOTAL FOR EXAMINATION",null,null,null,null,null,null,{"$f":"IFERROR(IF(E3=\"First Level\",IF(K74>K73,0,(K74*12)/K73),IF(K74>K73,0,(K74*15)/K73)),0)","v":0}]
[]
[null,null,"I. Public Service"]
[]
[null,null,null,null,"Additional Pts. in excess of Total Score"]

{"sheet":"AP44","index":51,"n_rows":81,"n_cols":33,"rows_kept":81,"cut":false,"hidden":false,"merged":[[1,2,1,29],[2,4,2,9],[2,13,2,22],[2,27,2,30],[2,32,2,33],[45,4,45,5],[45,6,45,7],[45,8,45,9],[45,10,45,11],[45,13,45,14],[10,15,10,22],[12,15,12,22],[14,15,14,22],[19,19,19,22],[35,4,37,7],[45,28,45,29],[45,24,45,25],[45,26,45,27],[6,11,6,22],[46,4,46,5],[46,6,46,7],[46,8,46,9],[46,10,46,11],[46,13,46,14],[46,17,46,18],[46,19,46,20],[46,22,46,23],[45,15,45,16],[45,17,45,18],[45,19,45,20],[45,22,45,23],[46,24,46,25],[46,26,46,27],[46,28,46,29],[47,4,47,5],[47,6,47,7],[47,8,47,9],[47,10,47,11],[47,13,47,14],[47,15,47,16],[47,17,47,18],[47,19,47,20],[47,22,47,23],[47,24,47,25],[47,26,47,27],[47,28,47,29],[46,15,46,16],[48,4,48,5],[48,6,48,7],[48,8,48,9],[48,10,48,11],[48,13,48,14],[48,28,48,29],[50,16,50,17],[48,15,48,16],[48,17,48,18],[48,19,48,20],[48,22,48,23],[48,24,48,25],[48,26,48,27]]}
[]
[null,null,"MSP CALCULATOR"]
[null,null,"Levels",":",{"$f":"IF(Vacancy!E6=\"\",\"\",Vacancy!E6)","v":""},null,null,null,null,null,null,"Name",":",null,null,null,null,null,null,null,null,null,null,null,null,null,"Employment Category:",null,null,null,null,null,{"$f":"SUM(F13,Y11,Y13,Y15,E25,Z25,J40,Q51,K67,K77,D81)","v":0}]
[null,null,null,null,null,null,null,null,null,null,null,null,null,null,null,null,null,null,null,null,null,null,null,null,null,null,null,null,null,null,null,null,"TOTAL MATRIX POINTS"]
[null,null,{"$f":"IF(E3=\"First Level\",\"A. Performance Rating (20 pts)\",IF(E3=\"Second Level\",\"A. Performance Rating (15 pts)\",\"A. Performance Rating (35 pts)\"))","v":"A. Performance Rating (35 pts)"},null,null,null,null,null,null,null,null,{"$f":"IF(E3=\"First Level\",\"B. Education (15 pts.)\",IF(E3=\"Second Level\",\"B. Education (10 pts.)\",\"B. Education (5 pts.)\"))","v":"B. Education (5 pts.)"}]
[null,null,"New Graduates (No previous work experience)",null,null,null,null,null,null,null,null,"Required:"]
[false,null,null,null,null,null,null,{"$f":"IF(F9>=2.75,1,IF(F9>=2.5,3,IF(F9>=2.25,5,IF(F9>=2,7,IF(F9>=1.75,9,IF(F9>=1.5,11,IF(F9>=1.25,13,IF(F9>=1,15))))))))","v":false},null,null,null,{"$f":"IF(Vacancy!E10=\"\",\"\",Vacancy!E10)","v":""}]
[]
[null,null,"GWA",null,null,null,{"$f":"IF(F9>=2.75,2,IF(F9>=2.5,5,IF(F9>=2.25,8,IF(F9>=2,11,IF(F9>=1.75,14,IF(F9>=1.5,16,IF(F9>=1.25,18,IF(F9>=1,20))))))))","v":false},{"$f":"IF(E3=\"First Level\",(20*F11)/5,IF(E3=\"Second Level\",(15*F11)/5,IF(E3=\"Executive/Managerial\",(35*F11)/5,\"\")))","v":""},null,null,null,"Highest Educational Attainment:",null,null,null,null,null,null,null,null,null,null,null,null,"Total Score:"]
[]
[null,null,"Last Rating Period",null,null,null,null,{"$f":"IFERROR(IF(AND(A7=TRUE,E3=\"First Level\"),G9,IF(AND(A7=TRUE,E3=\"Second Level\"),H7,H9)),\"\")","v":""},null,null,null,"First Level:",null,null,null,null,null,null,null,null,null,null,null,{"$f":"VLOOKUP(P11,Educ_2!$A$11:$B$26,2,FALSE)","v":{"$error":"#N/A"}},{"$f":"IFERROR(VLOOKUP($L$7,Educ_2!$A$1:$Q$8,X11+1,FALSE),\"\")","v":""}]
[]
[false,null,"Total Score",null,":",{"$f":"IF(H11=FALSE,0,H11)","v":""},"pts.",null,null,null,null,"Second Level:",null,null,null,null,null,null,null,null,null,null,null,{"$f":"VLOOKUP(P13,Educ_2!$A$11:$B$26,2,FALSE)","v":{"$error":"#N/A"}},{"$f":"IFERROR(VLOOKUP($L$7,Educ_2!$A$1:$Q$8,X13+1,FALSE),\"\")","v":""}]
[]
[null,null,null,null,null,null,null,null,null,null,null,"Executive/Managerial:",null,null,null,null,null,null,null,null,null,null,null,{"$f":"VLOOKUP(P15,Educ_2!$A$11:$B$26,2,FALSE)","v":{"$error":"#N/A"}},{"$f":"IFERROR(VLOOKUP($L$7,Educ_2!$A$1:$Q$8,X15+1,FALSE),\"\")","v":""}]
[]
[null,null,null,null,null,null,null,null,null,null,null,null,null,null,null,null,null,null,null,null,null,null,null,null,{"$f":"SUM(Y11,Y13,Y15)","v":0}]
[]
[null,null,"C. Training (10 pts.)",null,null,null,null,null,null,null,null,null,null,null,null,null,null,null,null,null,null,null,null,null,{"$f":"IF(E3=\"Executive/Managerial\",\"D. Experience (10 pts)\",\"D. Experience (25 pts)\")","v":"D. Experience (25 pts)"}]
[null,null,null,null,null,null,null,null,null,null,null,null,null,null,null,null,null,null,null,"Coversion to YEAR"]
[true,null,null,null,{"$f":"IF(Vacancy!$R$10=\"None required\",0,IF(Vacancy!$R$10=\"\",\"\",Vacancy!$R$10))","v":""},"Required (hrs.)",null,null,null,null,null,null,null,null,null,null,null,null,null,null,"Year",null,{"$f":"T21","v":0},null,null,{"$f":"IF(Vacancy!$AA$10=\"None required\",0,IF(Vacancy!$AA$10=\"\",\"\",Vacancy!$AA$10))","v":""},"Required Exp."]
[]
[null,null,null,{"$f":"E23-E21","v":{"$error":"#VALUE!"}},null,"Relevant training hrs. acquired",null,null,null,null,null,null,null,null,null,null,null,null,null,null,"Month",null,{"$f":"T23/12","v":0},null,{"$f":"Z23-Z21","v":{"$error":"#VALUE!"}},{"$f":"SUM(W21,W23,W25)","v":0},"Relevant years of experience"]
[]
[null,null,null,null,{"$f":"IF(N3=\"\",0,IFERROR(IF(E21=E23,5,IF(E23>=E21,((5*D23)/Trg_Exp!$D$2)+5,0)),0))","v":0},"Total",null,null,null,null,null,null,null,null,null,null,null,null,null,null,"Day",null,{"$f":"T25/365","v":0},null,{"$f":"IFERROR(IF(AND(Z21=Z23),10,IF(Vacancy!E6=\"Executive/Managerial\",((10*Y23)/Trg_Exp!$K$2),IF(Z23>=Z21,((15*Y23)/Trg_Exp!$K$2)+10,0))),0)","v":0},{"$f":"IF(N3=\"\",0,IF(Y25<0,0,Y25))","v":0},"Total Score:"]
[]
[null,null,{"$f":"IF(Vacancy!E6=\"Second Level\",\"E. Accomplishment (15 pts.)\",\"E. Accomplishment (10 pts.)\")","v":"E. Accomplishment (10 pts.)"}]
[]
[null,null,null,null,"E.1  Awards/Citations/Commendations"]
[]
[false,null,null,null,"E.1.1. Unit Level",null,null,null,null,{"$f":"IF(A31=TRUE,1,\"\")","v":""}]
[]
[false,null,null,null,"E.1.2. University Level",null,null,null,null,{"$f":"IF(A33=TRUE,3,\"\")","v":""}]
[]
[false,null,null,null,"E.1.3. National/CSC Level",null,null,null,null,{"$f":"IF(A35=TRUE,5,\"\")","v":""}]
[null,null,null,null,"E.2. Innovations/ Systems Improvement"]
[false,null,null,null,null,null,null,null,null,{"$f":"IF(A37=TRUE,IF(Vacancy!E6=\"Second Level\",4,3),\"\")","v":""}]
[null,null,null,null,null,null,null,null,null,null,{"$f":"IF(E3=\"Second Level\",((SUM(J31,J33,J35)*11)/9),((SUM(J31,J33,J35)*7)/9))","v":0}]
[]
[null,null,null,null,"C.2. Total Score:",null,null,null,null,{"$f":"IF(E3=\"Second Level\",(15*SUM(K38,J37)/15),(10*SUM(K38,J37)/10))","v":0}]
[]
[null,null,{"$f":"IF(E3=\"Executive/Managerial\",\"F. Physical Characteristics and Personality Traits (10 pts.)\",\"F. Physical Characteristics and Personality Traits (5 pts.)\")","v":"F. Physical Characteristics and Personality Traits (5 pts.)"}]
[]
[null,null,null,null,"Supervisor",null,"Co-worker 1",null,"Co-worker 2",null,"Co-worker 3",null,null,"Supervisor",null,"Co-worker 1",null,"Co-worker 2",null,"Co-worker 3",null,null,"Supervisor",null,"Co-worker 1",null,"Co-worker 2",null,"Co-worker 3"]
[null,null,null,null,"ATTITUDE",null,null,null,null,null,null,null,null,"COMMITMENT",null,null,null,null,null,null,null,null,"APPEARANCE"]
[null,null,null,"F.1.1. ",null,null,null,null,null,null,null,null,"F.2.1. ",null,null,null,null,null,null,null,null,"F.3.1. "]
[null,null,null,"F.1.2. ",null,null,null,null,null,null,null,null,"F.2.2. ",null,null,null,null,null,null,null,null,"F.3.2. "]
[null,null,null,"F.1.3. ",null,null,null,null,null,null,null,null,"F.2.3. "]
[null,null,null,null,{"$f":"IF($E$3=\"Executive/Managerial\",(4*(SUM(E46:F48)/12)),(2*(SUM(E46:F48)/12)))","v":0},null,{"$f":"IF($E$3=\"Executive/Managerial\",(4*(SUM(G46:H48)/12)),(2*(SUM(G46:H48)/12)))","v":0},null,{"$f":"IF($E$3=\"Executive/Managerial\",(4*(SUM(I46:J48)/12)),(2*(SUM(I46:J48)/12)))","v":0},null,{"$f":"IF($E$3=\"Executive/Managerial\",(4*(SUM(K46:L48)/12)),(2*(SUM(K46:L48)/12)))","v":0},null,null,{"$f":"IF($E$3=\"Executive/Managerial\",(4*(SUM(N46:O48)/12)),(2*(SUM(N46:O48)/12)))","v":0},null,{"$f":"IF($E$3=\"Executive/Managerial\",(4*(SUM(P46:Q48)/12)),(2*(SUM(P46:Q48)/12)))","v":0},null,{"$f":"IF($E$3=\"Executive/Managerial\",(4*(SUM(R46:S48)/12)),(2*(SUM(R46:S48)/12)))","v":0},null,{"$f":"IF($E$3=\"Executive/Managerial\",(4*(SUM(T46:U48)/12)),(2*(SUM(T46:U48)/12)))","v":0},null,null,{"$f":"IF($E$3=\"Executive/Managerial\",(2*(SUM(W46:X48))/8),(1*(SUM(W46:X48))/8))","v":0},null,{"$f":"IF($E$3=\"Executive/Managerial\",(2*(SUM(Y46:Z48))/8),(1*(SUM(Y46:Z48))/8))","v":0},null,{"$f":"IF($E$3=\"Executive/Managerial\",(2*(SUM(AA46:AB48))/8),(1*(SUM(AA46:AB48))/8))","v":0},null,{"$f":"IF($E$3=\"Executive/Managerial\",(2*(SUM(AC46:AD48))/8),(1*(SUM(AC46:AD48))/8))","v":0}]
[null,null,null,null,null,null,"Supervisor",null,"Co-worker"]
[null,null,null,null,"Attitude",null,{"$f":"E49","v":0},null,{"$f":"SUM(G49:L49)/3","v":0},null,null,null,null,"Total Score PCPT:",null,null,{"$f":"IF(E3=\"Executive/Managerial\",SUM(G54:J54),SUM(G54:J54))","v":0}]
[null,null,null,null,"Commitment",null,{"$f":"N49","v":0},null,{"$f":"SUM(P49:U49)/3","v":0}]
[null,null,null,null,"Appearance",null,{"$f":"W49","v":0},null,{"$f":"SUM(Y49:AD49)/3","v":0}]
[null,null,null,null,null,null,{"$f":"SUM(G51:G53)*0.6","v":0},null,{"$f":"SUM(I51:I53)*0.4","v":0}]
[null,null,{"$f":"IF(E3=\"First Level\",\"G. Potential [Assessment Form No. 2] (3 pts.)\",\"G. Potential [Assessment Form No. 2] (5 pts.)\")","v":"G. Potential [Assessment Form No. 2] (5 pts.)"}]
[]
[null,null,null,"INTERVIEW"]
[]
[null,null,null,null,"G.1.1. Sound judgement",null,null,null,null,null,null,{"$f":"IF($E$3=\"First Level\",\"Not Applicable for First Level position\",\"\")","v":""}]
[null,null,null,null,"G.1.2. Analytical mind",null,null,null,null,null,null,{"$f":"IF($E$3=\"First Level\",\"Not Applicable for First Level position\",\"\")","v":""}]
[null,null,null,null,"G.1.3. The ability to motivate co-workers",null,null,null,null,null,null,{"$f":"IF($E$3=\"First Level\",\"Not Applicable for First Level position\",\"\")","v":""}]
[null,null,null,null,"G.1.4. Unifying Factor",null,null,null,null,null,null,{"$f":"IF($E$3=\"First Level\",\"Not Applicable for First Level position\",\"\")","v":""}]
[null,null,null,null,"G.1.5. Vision/foresight",null,null,null,null,null,null,{"$f":"IF($E$3=\"First Level\",\"Not Applicable for First Level position\",\"\")","v":""}]
[null,null,null,null,"G.2. Resourcefulness"]
[null,null,null,null,"G.3. Creativity/ Ingenuity "]
[]
[null,null,null,"TOTAL POINTS FOR POTENTIAL",null,null,null,null,null,null,{"$f":"IF(E3=\"First Level\",(3*(SUM(K64:K65)/8)),(5*(SUM(K59:K65)/28)))","v":0}]
[]
[null,null,{"$f":"IF(E3=\"First Level\",\"H. Written/ Skills Examination (12 pts.)\",\"H. Written/ Skills Examination (15 pts.)\")","v":"H. Written/ Skills Examination (15 pts.)"}]
[null,null,null,null,null,null,null,null,null,null,{"$f":"IFERROR(SUM(K59:K65)/7,0)","v":0}]
[null,null,null,"WRITTEN/SKILLS EXAMINATION"]
[]
[null,null,null,null,"Perfect/Entire Score",null,null,"="]
[null,null,null,null,"Raw Score",null,null,"="]
[]
[]
[null,null,null,"TOTAL FOR EXAMINATION",null,null,null,null,null,null,{"$f":"IFERROR(IF(E3=\"First Level\",IF(K74>K73,0,(K74*12)/K73),IF(K74>K73,0,(K74*15)/K73)),0)","v":0}]
[]
[null,null,"I. Public Service"]
[]
[null,null,null,null,"Additional Pts. in excess of Total Score"]

{"sheet":"AP45","index":52,"n_rows":81,"n_cols":33,"rows_kept":81,"cut":false,"hidden":false,"merged":[[1,2,1,29],[2,4,2,9],[2,13,2,22],[2,27,2,30],[2,32,2,33],[45,4,45,5],[45,6,45,7],[45,8,45,9],[45,10,45,11],[45,13,45,14],[10,15,10,22],[12,15,12,22],[14,15,14,22],[19,19,19,22],[35,4,37,7],[45,28,45,29],[45,24,45,25],[45,26,45,27],[6,11,6,22],[46,4,46,5],[46,6,46,7],[46,8,46,9],[46,10,46,11],[46,13,46,14],[46,17,46,18],[46,19,46,20],[46,22,46,23],[45,15,45,16],[45,17,45,18],[45,19,45,20],[45,22,45,23],[46,24,46,25],[46,26,46,27],[46,28,46,29],[47,4,47,5],[47,6,47,7],[47,8,47,9],[47,10,47,11],[47,13,47,14],[47,15,47,16],[47,17,47,18],[47,19,47,20],[47,22,47,23],[47,24,47,25],[47,26,47,27],[47,28,47,29],[46,15,46,16],[48,4,48,5],[48,6,48,7],[48,8,48,9],[48,10,48,11],[48,13,48,14],[48,28,48,29],[50,16,50,17],[48,15,48,16],[48,17,48,18],[48,19,48,20],[48,22,48,23],[48,24,48,25],[48,26,48,27]]}
[]
[null,null,"MSP CALCULATOR"]
[null,null,"Levels",":",{"$f":"IF(Vacancy!E6=\"\",\"\",Vacancy!E6)","v":""},null,null,null,null,null,null,"Name",":",null,null,null,null,null,null,null,null,null,null,null,null,null,"Employment Category:",null,null,null,null,null,{"$f":"SUM(F13,Y11,Y13,Y15,E25,Z25,J40,Q51,K67,K77,D81)","v":0}]
[null,null,null,null,null,null,null,null,null,null,null,null,null,null,null,null,null,null,null,null,null,null,null,null,null,null,null,null,null,null,null,null,"TOTAL MATRIX POINTS"]
[null,null,{"$f":"IF(E3=\"First Level\",\"A. Performance Rating (20 pts)\",IF(E3=\"Second Level\",\"A. Performance Rating (15 pts)\",\"A. Performance Rating (35 pts)\"))","v":"A. Performance Rating (35 pts)"},null,null,null,null,null,null,null,null,{"$f":"IF(E3=\"First Level\",\"B. Education (15 pts.)\",IF(E3=\"Second Level\",\"B. Education (10 pts.)\",\"B. Education (5 pts.)\"))","v":"B. Education (5 pts.)"}]
[null,null,"New Graduates (No previous work experience)",null,null,null,null,null,null,null,null,"Required:"]
[false,null,null,null,null,null,null,{"$f":"IF(F9>=2.75,1,IF(F9>=2.5,3,IF(F9>=2.25,5,IF(F9>=2,7,IF(F9>=1.75,9,IF(F9>=1.5,11,IF(F9>=1.25,13,IF(F9>=1,15))))))))","v":false},null,null,null,{"$f":"IF(Vacancy!E10=\"\",\"\",Vacancy!E10)","v":""}]
[]
[null,null,"GWA",null,null,null,{"$f":"IF(F9>=2.75,2,IF(F9>=2.5,5,IF(F9>=2.25,8,IF(F9>=2,11,IF(F9>=1.75,14,IF(F9>=1.5,16,IF(F9>=1.25,18,IF(F9>=1,20))))))))","v":false},{"$f":"IF(E3=\"First Level\",(20*F11)/5,IF(E3=\"Second Level\",(15*F11)/5,IF(E3=\"Executive/Managerial\",(35*F11)/5,\"\")))","v":""},null,null,null,"Highest Educational Attainment:",null,null,null,null,null,null,null,null,null,null,null,null,"Total Score:"]
[]
[null,null,"Last Rating Period",null,null,null,null,{"$f":"IFERROR(IF(AND(A7=TRUE,E3=\"First Level\"),G9,IF(AND(A7=TRUE,E3=\"Second Level\"),H7,H9)),\"\")","v":""},null,null,null,"First Level:",null,null,null,null,null,null,null,null,null,null,null,{"$f":"VLOOKUP(P11,Educ_2!$A$11:$B$26,2,FALSE)","v":{"$error":"#N/A"}},{"$f":"IFERROR(VLOOKUP($L$7,Educ_2!$A$1:$Q$8,X11+1,FALSE),\"\")","v":""}]
[]
[false,null,"Total Score",null,":",{"$f":"IF(H11=FALSE,0,H11)","v":""},"pts.",null,null,null,null,"Second Level:",null,null,null,null,null,null,null,null,null,null,null,{"$f":"VLOOKUP(P13,Educ_2!$A$11:$B$26,2,FALSE)","v":{"$error":"#N/A"}},{"$f":"IFERROR(VLOOKUP($L$7,Educ_2!$A$1:$Q$8,X13+1,FALSE),\"\")","v":""}]
[]
[null,null,null,null,null,null,null,null,null,null,null,"Executive/Managerial:",null,null,null,null,null,null,null,null,null,null,null,{"$f":"VLOOKUP(P15,Educ_2!$A$11:$B$26,2,FALSE)","v":{"$error":"#N/A"}},{"$f":"IFERROR(VLOOKUP($L$7,Educ_2!$A$1:$Q$8,X15+1,FALSE),\"\")","v":""}]
[]
[null,null,null,null,null,null,null,null,null,null,null,null,null,null,null,null,null,null,null,null,null,null,null,null,{"$f":"SUM(Y11,Y13,Y15)","v":0}]
[]
[null,null,"C. Training (10 pts.)",null,null,null,null,null,null,null,null,null,null,null,null,null,null,null,null,null,null,null,null,null,{"$f":"IF(E3=\"Executive/Managerial\",\"D. Experience (10 pts)\",\"D. Experience (25 pts)\")","v":"D. Experience (25 pts)"}]
[null,null,null,null,null,null,null,null,null,null,null,null,null,null,null,null,null,null,null,"Coversion to YEAR"]
[true,null,null,null,{"$f":"IF(Vacancy!$R$10=\"None required\",0,IF(Vacancy!$R$10=\"\",\"\",Vacancy!$R$10))","v":""},"Required (hrs.)",null,null,null,null,null,null,null,null,null,null,null,null,null,null,"Year",null,{"$f":"T21","v":0},null,null,{"$f":"IF(Vacancy!$AA$10=\"None required\",0,IF(Vacancy!$AA$10=\"\",\"\",Vacancy!$AA$10))","v":""},"Required Exp."]
[]
[null,null,null,{"$f":"E23-E21","v":{"$error":"#VALUE!"}},null,"Relevant training hrs. acquired",null,null,null,null,null,null,null,null,null,null,null,null,null,null,"Month",null,{"$f":"T23/12","v":0},null,{"$f":"Z23-Z21","v":{"$error":"#VALUE!"}},{"$f":"SUM(W21,W23,W25)","v":0},"Relevant years of experience"]
[]
[null,null,null,null,{"$f":"IF(N3=\"\",0,IFERROR(IF(E21=E23,5,IF(E23>=E21,((5*D23)/Trg_Exp!$D$2)+5,0)),0))","v":0},"Total",null,null,null,null,null,null,null,null,null,null,null,null,null,null,"Day",null,{"$f":"T25/365","v":0},null,{"$f":"IFERROR(IF(AND(Z21=Z23),10,IF(Vacancy!E6=\"Executive/Managerial\",((10*Y23)/Trg_Exp!$K$2),IF(Z23>=Z21,((15*Y23)/Trg_Exp!$K$2)+10,0))),0)","v":0},{"$f":"IF(N3=\"\",0,IF(Y25<0,0,Y25))","v":0},"Total Score:"]
[]
[null,null,{"$f":"IF(Vacancy!E6=\"Second Level\",\"E. Accomplishment (15 pts.)\",\"E. Accomplishment (10 pts.)\")","v":"E. Accomplishment (10 pts.)"}]
[]
[null,null,null,null,"E.1  Awards/Citations/Commendations"]
[]
[false,null,null,null,"E.1.1. Unit Level",null,null,null,null,{"$f":"IF(A31=TRUE,1,\"\")","v":""}]
[]
[false,null,null,null,"E.1.2. University Level",null,null,null,null,{"$f":"IF(A33=TRUE,3,\"\")","v":""}]
[]
[false,null,null,null,"E.1.3. National/CSC Level",null,null,null,null,{"$f":"IF(A35=TRUE,5,\"\")","v":""}]
[null,null,null,null,"E.2. Innovations/ Systems Improvement"]
[false,null,null,null,null,null,null,null,null,{"$f":"IF(A37=TRUE,IF(Vacancy!E6=\"Second Level\",4,3),\"\")","v":""}]
[null,null,null,null,null,null,null,null,null,null,{"$f":"IF(E3=\"Second Level\",((SUM(J31,J33,J35)*11)/9),((SUM(J31,J33,J35)*7)/9))","v":0}]
[]
[null,null,null,null,"C.2. Total Score:",null,null,null,null,{"$f":"IF(E3=\"Second Level\",(15*SUM(K38,J37)/15),(10*SUM(K38,J37)/10))","v":0}]
[]
[null,null,{"$f":"IF(E3=\"Executive/Managerial\",\"F. Physical Characteristics and Personality Traits (10 pts.)\",\"F. Physical Characteristics and Personality Traits (5 pts.)\")","v":"F. Physical Characteristics and Personality Traits (5 pts.)"}]
[]
[null,null,null,null,"Supervisor",null,"Co-worker 1",null,"Co-worker 2",null,"Co-worker 3",null,null,"Supervisor",null,"Co-worker 1",null,"Co-worker 2",null,"Co-worker 3",null,null,"Supervisor",null,"Co-worker 1",null,"Co-worker 2",null,"Co-worker 3"]
[null,null,null,null,"ATTITUDE",null,null,null,null,null,null,null,null,"COMMITMENT",null,null,null,null,null,null,null,null,"APPEARANCE"]
[null,null,null,"F.1.1. ",null,null,null,null,null,null,null,null,"F.2.1. ",null,null,null,null,null,null,null,null,"F.3.1. "]
[null,null,null,"F.1.2. ",null,null,null,null,null,null,null,null,"F.2.2. ",null,null,null,null,null,null,null,null,"F.3.2. "]
[null,null,null,"F.1.3. ",null,null,null,null,null,null,null,null,"F.2.3. "]
[null,null,null,null,{"$f":"IF($E$3=\"Executive/Managerial\",(4*(SUM(E46:F48)/12)),(2*(SUM(E46:F48)/12)))","v":0},null,{"$f":"IF($E$3=\"Executive/Managerial\",(4*(SUM(G46:H48)/12)),(2*(SUM(G46:H48)/12)))","v":0},null,{"$f":"IF($E$3=\"Executive/Managerial\",(4*(SUM(I46:J48)/12)),(2*(SUM(I46:J48)/12)))","v":0},null,{"$f":"IF($E$3=\"Executive/Managerial\",(4*(SUM(K46:L48)/12)),(2*(SUM(K46:L48)/12)))","v":0},null,null,{"$f":"IF($E$3=\"Executive/Managerial\",(4*(SUM(N46:O48)/12)),(2*(SUM(N46:O48)/12)))","v":0},null,{"$f":"IF($E$3=\"Executive/Managerial\",(4*(SUM(P46:Q48)/12)),(2*(SUM(P46:Q48)/12)))","v":0},null,{"$f":"IF($E$3=\"Executive/Managerial\",(4*(SUM(R46:S48)/12)),(2*(SUM(R46:S48)/12)))","v":0},null,{"$f":"IF($E$3=\"Executive/Managerial\",(4*(SUM(T46:U48)/12)),(2*(SUM(T46:U48)/12)))","v":0},null,null,{"$f":"IF($E$3=\"Executive/Managerial\",(2*(SUM(W46:X48))/8),(1*(SUM(W46:X48))/8))","v":0},null,{"$f":"IF($E$3=\"Executive/Managerial\",(2*(SUM(Y46:Z48))/8),(1*(SUM(Y46:Z48))/8))","v":0},null,{"$f":"IF($E$3=\"Executive/Managerial\",(2*(SUM(AA46:AB48))/8),(1*(SUM(AA46:AB48))/8))","v":0},null,{"$f":"IF($E$3=\"Executive/Managerial\",(2*(SUM(AC46:AD48))/8),(1*(SUM(AC46:AD48))/8))","v":0}]
[null,null,null,null,null,null,"Supervisor",null,"Co-worker"]
[null,null,null,null,"Attitude",null,{"$f":"E49","v":0},null,{"$f":"SUM(G49:L49)/3","v":0},null,null,null,null,"Total Score PCPT:",null,null,{"$f":"IF(E3=\"Executive/Managerial\",SUM(G54:J54),SUM(G54:J54))","v":0}]
[null,null,null,null,"Commitment",null,{"$f":"N49","v":0},null,{"$f":"SUM(P49:U49)/3","v":0}]
[null,null,null,null,"Appearance",null,{"$f":"W49","v":0},null,{"$f":"SUM(Y49:AD49)/3","v":0}]
[null,null,null,null,null,null,{"$f":"SUM(G51:G53)*0.6","v":0},null,{"$f":"SUM(I51:I53)*0.4","v":0}]
[null,null,{"$f":"IF(E3=\"First Level\",\"G. Potential [Assessment Form No. 2] (3 pts.)\",\"G. Potential [Assessment Form No. 2] (5 pts.)\")","v":"G. Potential [Assessment Form No. 2] (5 pts.)"}]
[]
[null,null,null,"INTERVIEW"]
[]
[null,null,null,null,"G.1.1. Sound judgement",null,null,null,null,null,null,{"$f":"IF($E$3=\"First Level\",\"Not Applicable for First Level position\",\"\")","v":""}]
[null,null,null,null,"G.1.2. Analytical mind",null,null,null,null,null,null,{"$f":"IF($E$3=\"First Level\",\"Not Applicable for First Level position\",\"\")","v":""}]
[null,null,null,null,"G.1.3. The ability to motivate co-workers",null,null,null,null,null,null,{"$f":"IF($E$3=\"First Level\",\"Not Applicable for First Level position\",\"\")","v":""}]
[null,null,null,null,"G.1.4. Unifying Factor",null,null,null,null,null,null,{"$f":"IF($E$3=\"First Level\",\"Not Applicable for First Level position\",\"\")","v":""}]
[null,null,null,null,"G.1.5. Vision/foresight",null,null,null,null,null,null,{"$f":"IF($E$3=\"First Level\",\"Not Applicable for First Level position\",\"\")","v":""}]
[null,null,null,null,"G.2. Resourcefulness"]
[null,null,null,null,"G.3. Creativity/ Ingenuity "]
[]
[null,null,null,"TOTAL POINTS FOR POTENTIAL",null,null,null,null,null,null,{"$f":"IF(E3=\"First Level\",(3*(SUM(K64:K65)/8)),(5*(SUM(K59:K65)/28)))","v":0}]
[]
[null,null,{"$f":"IF(E3=\"First Level\",\"H. Written/ Skills Examination (12 pts.)\",\"H. Written/ Skills Examination (15 pts.)\")","v":"H. Written/ Skills Examination (15 pts.)"}]
[null,null,null,null,null,null,null,null,null,null,{"$f":"IFERROR(SUM(K59:K65)/7,0)","v":0}]
[null,null,null,"WRITTEN/SKILLS EXAMINATION"]
[]
[null,null,null,null,"Perfect/Entire Score",null,null,"="]
[null,null,null,null,"Raw Score",null,null,"="]
[]
[]
[null,null,null,"TOTAL FOR EXAMINATION",null,null,null,null,null,null,{"$f":"IFERROR(IF(E3=\"First Level\",IF(K74>K73,0,(K74*12)/K73),IF(K74>K73,0,(K74*15)/K73)),0)","v":0}]
[]
[null,null,"I. Public Service"]
[]
[null,null,null,null,"Additional Pts. in excess of Total Score"]

{"sheet":"AP46","index":53,"n_rows":81,"n_cols":33,"rows_kept":81,"cut":false,"hidden":false,"merged":[[1,2,1,29],[2,4,2,9],[2,13,2,22],[2,27,2,30],[2,32,2,33],[45,4,45,5],[45,6,45,7],[45,8,45,9],[45,10,45,11],[45,13,45,14],[10,15,10,22],[12,15,12,22],[14,15,14,22],[19,19,19,22],[35,4,37,7],[45,28,45,29],[45,24,45,25],[45,26,45,27],[6,11,6,22],[46,4,46,5],[46,6,46,7],[46,8,46,9],[46,10,46,11],[46,13,46,14],[46,17,46,18],[46,19,46,20],[46,22,46,23],[45,15,45,16],[45,17,45,18],[45,19,45,20],[45,22,45,23],[46,24,46,25],[46,26,46,27],[46,28,46,29],[47,4,47,5],[47,6,47,7],[47,8,47,9],[47,10,47,11],[47,13,47,14],[47,15,47,16],[47,17,47,18],[47,19,47,20],[47,22,47,23],[47,24,47,25],[47,26,47,27],[47,28,47,29],[46,15,46,16],[48,4,48,5],[48,6,48,7],[48,8,48,9],[48,10,48,11],[48,13,48,14],[48,28,48,29],[50,16,50,17],[48,15,48,16],[48,17,48,18],[48,19,48,20],[48,22,48,23],[48,24,48,25],[48,26,48,27]]}
[]
[null,null,"MSP CALCULATOR"]
[null,null,"Levels",":",{"$f":"IF(Vacancy!E6=\"\",\"\",Vacancy!E6)","v":""},null,null,null,null,null,null,"Name",":",null,null,null,null,null,null,null,null,null,null,null,null,null,"Employment Category:",null,null,null,null,null,{"$f":"SUM(F13,Y11,Y13,Y15,E25,Z25,J40,Q51,K67,K77,D81)","v":0}]
[null,null,null,null,null,null,null,null,null,null,null,null,null,null,null,null,null,null,null,null,null,null,null,null,null,null,null,null,null,null,null,null,"TOTAL MATRIX POINTS"]
[null,null,{"$f":"IF(E3=\"First Level\",\"A. Performance Rating (20 pts)\",IF(E3=\"Second Level\",\"A. Performance Rating (15 pts)\",\"A. Performance Rating (35 pts)\"))","v":"A. Performance Rating (35 pts)"},null,null,null,null,null,null,null,null,{"$f":"IF(E3=\"First Level\",\"B. Education (15 pts.)\",IF(E3=\"Second Level\",\"B. Education (10 pts.)\",\"B. Education (5 pts.)\"))","v":"B. Education (5 pts.)"}]
[null,null,"New Graduates (No previous work experience)",null,null,null,null,null,null,null,null,"Required:"]
[false,null,null,null,null,null,null,{"$f":"IF(F9>=2.75,1,IF(F9>=2.5,3,IF(F9>=2.25,5,IF(F9>=2,7,IF(F9>=1.75,9,IF(F9>=1.5,11,IF(F9>=1.25,13,IF(F9>=1,15))))))))","v":false},null,null,null,{"$f":"IF(Vacancy!E10=\"\",\"\",Vacancy!E10)","v":""}]
[]
[null,null,"GWA",null,null,null,{"$f":"IF(F9>=2.75,2,IF(F9>=2.5,5,IF(F9>=2.25,8,IF(F9>=2,11,IF(F9>=1.75,14,IF(F9>=1.5,16,IF(F9>=1.25,18,IF(F9>=1,20))))))))","v":false},{"$f":"IF(E3=\"First Level\",(20*F11)/5,IF(E3=\"Second Level\",(15*F11)/5,IF(E3=\"Executive/Managerial\",(35*F11)/5,\"\")))","v":""},null,null,null,"Highest Educational Attainment:",null,null,null,null,null,null,null,null,null,null,null,null,"Total Score:"]
[]
[null,null,"Last Rating Period",null,null,null,null,{"$f":"IFERROR(IF(AND(A7=TRUE,E3=\"First Level\"),G9,IF(AND(A7=TRUE,E3=\"Second Level\"),H7,H9)),\"\")","v":""},null,null,null,"First Level:",null,null,null,null,null,null,null,null,null,null,null,{"$f":"VLOOKUP(P11,Educ_2!$A$11:$B$26,2,FALSE)","v":{"$error":"#N/A"}},{"$f":"IFERROR(VLOOKUP($L$7,Educ_2!$A$1:$Q$8,X11+1,FALSE),\"\")","v":""}]
[]
[false,null,"Total Score",null,":",{"$f":"IF(H11=FALSE,0,H11)","v":""},"pts.",null,null,null,null,"Second Level:",null,null,null,null,null,null,null,null,null,null,null,{"$f":"VLOOKUP(P13,Educ_2!$A$11:$B$26,2,FALSE)","v":{"$error":"#N/A"}},{"$f":"IFERROR(VLOOKUP($L$7,Educ_2!$A$1:$Q$8,X13+1,FALSE),\"\")","v":""}]
[]
[null,null,null,null,null,null,null,null,null,null,null,"Executive/Managerial:",null,null,null,null,null,null,null,null,null,null,null,{"$f":"VLOOKUP(P15,Educ_2!$A$11:$B$26,2,FALSE)","v":{"$error":"#N/A"}},{"$f":"IFERROR(VLOOKUP($L$7,Educ_2!$A$1:$Q$8,X15+1,FALSE),\"\")","v":""}]
[]
[null,null,null,null,null,null,null,null,null,null,null,null,null,null,null,null,null,null,null,null,null,null,null,null,{"$f":"SUM(Y11,Y13,Y15)","v":0}]
[]
[null,null,"C. Training (10 pts.)",null,null,null,null,null,null,null,null,null,null,null,null,null,null,null,null,null,null,null,null,null,{"$f":"IF(E3=\"Executive/Managerial\",\"D. Experience (10 pts)\",\"D. Experience (25 pts)\")","v":"D. Experience (25 pts)"}]
[null,null,null,null,null,null,null,null,null,null,null,null,null,null,null,null,null,null,null,"Coversion to YEAR"]
[true,null,null,null,{"$f":"IF(Vacancy!$R$10=\"None required\",0,IF(Vacancy!$R$10=\"\",\"\",Vacancy!$R$10))","v":""},"Required (hrs.)",null,null,null,null,null,null,null,null,null,null,null,null,null,null,"Year",null,{"$f":"T21","v":0},null,null,{"$f":"IF(Vacancy!$AA$10=\"None required\",0,IF(Vacancy!$AA$10=\"\",\"\",Vacancy!$AA$10))","v":""},"Required Exp."]
[]
[null,null,null,{"$f":"E23-E21","v":{"$error":"#VALUE!"}},null,"Relevant training hrs. acquired",null,null,null,null,null,null,null,null,null,null,null,null,null,null,"Month",null,{"$f":"T23/12","v":0},null,{"$f":"Z23-Z21","v":{"$error":"#VALUE!"}},{"$f":"SUM(W21,W23,W25)","v":0},"Relevant years of experience"]
[]
[null,null,null,null,{"$f":"IF(N3=\"\",0,IFERROR(IF(E21=E23,5,IF(E23>=E21,((5*D23)/Trg_Exp!$D$2)+5,0)),0))","v":0},"Total",null,null,null,null,null,null,null,null,null,null,null,null,null,null,"Day",null,{"$f":"T25/365","v":0},null,{"$f":"IFERROR(IF(AND(Z21=Z23),10,IF(Vacancy!E6=\"Executive/Managerial\",((10*Y23)/Trg_Exp!$K$2),IF(Z23>=Z21,((15*Y23)/Trg_Exp!$K$2)+10,0))),0)","v":0},{"$f":"IF(N3=\"\",0,IF(Y25<0,0,Y25))","v":0},"Total Score:"]
[]
[null,null,{"$f":"IF(Vacancy!E6=\"Second Level\",\"E. Accomplishment (15 pts.)\",\"E. Accomplishment (10 pts.)\")","v":"E. Accomplishment (10 pts.)"}]
[]
[null,null,null,null,"E.1  Awards/Citations/Commendations"]
[]
[false,null,null,null,"E.1.1. Unit Level",null,null,null,null,{"$f":"IF(A31=TRUE,1,\"\")","v":""}]
[]
[false,null,null,null,"E.1.2. University Level",null,null,null,null,{"$f":"IF(A33=TRUE,3,\"\")","v":""}]
[]
[false,null,null,null,"E.1.3. National/CSC Level",null,null,null,null,{"$f":"IF(A35=TRUE,5,\"\")","v":""}]
[null,null,null,null,"E.2. Innovations/ Systems Improvement"]
[false,null,null,null,null,null,null,null,null,{"$f":"IF(A37=TRUE,IF(Vacancy!E6=\"Second Level\",4,3),\"\")","v":""}]
[null,null,null,null,null,null,null,null,null,null,{"$f":"IF(E3=\"Second Level\",((SUM(J31,J33,J35)*11)/9),((SUM(J31,J33,J35)*7)/9))","v":0}]
[]
[null,null,null,null,"C.2. Total Score:",null,null,null,null,{"$f":"IF(E3=\"Second Level\",(15*SUM(K38,J37)/15),(10*SUM(K38,J37)/10))","v":0}]
[]
[null,null,{"$f":"IF(E3=\"Executive/Managerial\",\"F. Physical Characteristics and Personality Traits (10 pts.)\",\"F. Physical Characteristics and Personality Traits (5 pts.)\")","v":"F. Physical Characteristics and Personality Traits (5 pts.)"}]
[]
[null,null,null,null,"Supervisor",null,"Co-worker 1",null,"Co-worker 2",null,"Co-worker 3",null,null,"Supervisor",null,"Co-worker 1",null,"Co-worker 2",null,"Co-worker 3",null,null,"Supervisor",null,"Co-worker 1",null,"Co-worker 2",null,"Co-worker 3"]
[null,null,null,null,"ATTITUDE",null,null,null,null,null,null,null,null,"COMMITMENT",null,null,null,null,null,null,null,null,"APPEARANCE"]
[null,null,null,"F.1.1. ",null,null,null,null,null,null,null,null,"F.2.1. ",null,null,null,null,null,null,null,null,"F.3.1. "]
[null,null,null,"F.1.2. ",null,null,null,null,null,null,null,null,"F.2.2. ",null,null,null,null,null,null,null,null,"F.3.2. "]
[null,null,null,"F.1.3. ",null,null,null,null,null,null,null,null,"F.2.3. "]
[null,null,null,null,{"$f":"IF($E$3=\"Executive/Managerial\",(4*(SUM(E46:F48)/12)),(2*(SUM(E46:F48)/12)))","v":0},null,{"$f":"IF($E$3=\"Executive/Managerial\",(4*(SUM(G46:H48)/12)),(2*(SUM(G46:H48)/12)))","v":0},null,{"$f":"IF($E$3=\"Executive/Managerial\",(4*(SUM(I46:J48)/12)),(2*(SUM(I46:J48)/12)))","v":0},null,{"$f":"IF($E$3=\"Executive/Managerial\",(4*(SUM(K46:L48)/12)),(2*(SUM(K46:L48)/12)))","v":0},null,null,{"$f":"IF($E$3=\"Executive/Managerial\",(4*(SUM(N46:O48)/12)),(2*(SUM(N46:O48)/12)))","v":0},null,{"$f":"IF($E$3=\"Executive/Managerial\",(4*(SUM(P46:Q48)/12)),(2*(SUM(P46:Q48)/12)))","v":0},null,{"$f":"IF($E$3=\"Executive/Managerial\",(4*(SUM(R46:S48)/12)),(2*(SUM(R46:S48)/12)))","v":0},null,{"$f":"IF($E$3=\"Executive/Managerial\",(4*(SUM(T46:U48)/12)),(2*(SUM(T46:U48)/12)))","v":0},null,null,{"$f":"IF($E$3=\"Executive/Managerial\",(2*(SUM(W46:X48))/8),(1*(SUM(W46:X48))/8))","v":0},null,{"$f":"IF($E$3=\"Executive/Managerial\",(2*(SUM(Y46:Z48))/8),(1*(SUM(Y46:Z48))/8))","v":0},null,{"$f":"IF($E$3=\"Executive/Managerial\",(2*(SUM(AA46:AB48))/8),(1*(SUM(AA46:AB48))/8))","v":0},null,{"$f":"IF($E$3=\"Executive/Managerial\",(2*(SUM(AC46:AD48))/8),(1*(SUM(AC46:AD48))/8))","v":0}]
[null,null,null,null,null,null,"Supervisor",null,"Co-worker"]
[null,null,null,null,"Attitude",null,{"$f":"E49","v":0},null,{"$f":"SUM(G49:L49)/3","v":0},null,null,null,null,"Total Score PCPT:",null,null,{"$f":"IF(E3=\"Executive/Managerial\",SUM(G54:J54),SUM(G54:J54))","v":0}]
[null,null,null,null,"Commitment",null,{"$f":"N49","v":0},null,{"$f":"SUM(P49:U49)/3","v":0}]
[null,null,null,null,"Appearance",null,{"$f":"W49","v":0},null,{"$f":"SUM(Y49:AD49)/3","v":0}]
[null,null,null,null,null,null,{"$f":"SUM(G51:G53)*0.6","v":0},null,{"$f":"SUM(I51:I53)*0.4","v":0}]
[null,null,{"$f":"IF(E3=\"First Level\",\"G. Potential [Assessment Form No. 2] (3 pts.)\",\"G. Potential [Assessment Form No. 2] (5 pts.)\")","v":"G. Potential [Assessment Form No. 2] (5 pts.)"}]
[]
[null,null,null,"INTERVIEW"]
[]
[null,null,null,null,"G.1.1. Sound judgement",null,null,null,null,null,null,{"$f":"IF($E$3=\"First Level\",\"Not Applicable for First Level position\",\"\")","v":""}]
[null,null,null,null,"G.1.2. Analytical mind",null,null,null,null,null,null,{"$f":"IF($E$3=\"First Level\",\"Not Applicable for First Level position\",\"\")","v":""}]
[null,null,null,null,"G.1.3. The ability to motivate co-workers",null,null,null,null,null,null,{"$f":"IF($E$3=\"First Level\",\"Not Applicable for First Level position\",\"\")","v":""}]
[null,null,null,null,"G.1.4. Unifying Factor",null,null,null,null,null,null,{"$f":"IF($E$3=\"First Level\",\"Not Applicable for First Level position\",\"\")","v":""}]
[null,null,null,null,"G.1.5. Vision/foresight",null,null,null,null,null,null,{"$f":"IF($E$3=\"First Level\",\"Not Applicable for First Level position\",\"\")","v":""}]
[null,null,null,null,"G.2. Resourcefulness"]
[null,null,null,null,"G.3. Creativity/ Ingenuity "]
[]
[null,null,null,"TOTAL POINTS FOR POTENTIAL",null,null,null,null,null,null,{"$f":"IF(E3=\"First Level\",(3*(SUM(K64:K65)/8)),(5*(SUM(K59:K65)/28)))","v":0}]
[]
[null,null,{"$f":"IF(E3=\"First Level\",\"H. Written/ Skills Examination (12 pts.)\",\"H. Written/ Skills Examination (15 pts.)\")","v":"H. Written/ Skills Examination (15 pts.)"}]
[null,null,null,null,null,null,null,null,null,null,{"$f":"IFERROR(SUM(K59:K65)/7,0)","v":0}]
[null,null,null,"WRITTEN/SKILLS EXAMINATION"]
[]
[null,null,null,null,"Perfect/Entire Score",null,null,"="]
[null,null,null,null,"Raw Score",null,null,"="]
[]
[]
[null,null,null,"TOTAL FOR EXAMINATION",null,null,null,null,null,null,{"$f":"IFERROR(IF(E3=\"First Level\",IF(K74>K73,0,(K74*12)/K73),IF(K74>K73,0,(K74*15)/K73)),0)","v":0}]
[]
[null,null,"I. Public Service"]
[]
[null,null,null,null,"Additional Pts. in excess of Total Score"]

{"sheet":"AP47","index":54,"n_rows":81,"n_cols":33,"rows_kept":81,"cut":false,"hidden":false,"merged":[[1,2,1,29],[2,4,2,9],[2,13,2,22],[2,27,2,30],[2,32,2,33],[45,4,45,5],[45,6,45,7],[45,8,45,9],[45,10,45,11],[45,13,45,14],[10,15,10,22],[12,15,12,22],[14,15,14,22],[19,19,19,22],[35,4,37,7],[45,28,45,29],[45,24,45,25],[45,26,45,27],[6,11,6,22],[46,4,46,5],[46,6,46,7],[46,8,46,9],[46,10,46,11],[46,13,46,14],[46,17,46,18],[46,19,46,20],[46,22,46,23],[45,15,45,16],[45,17,45,18],[45,19,45,20],[45,22,45,23],[46,24,46,25],[46,26,46,27],[46,28,46,29],[47,4,47,5],[47,6,47,7],[47,8,47,9],[47,10,47,11],[47,13,47,14],[47,15,47,16],[47,17,47,18],[47,19,47,20],[47,22,47,23],[47,24,47,25],[47,26,47,27],[47,28,47,29],[46,15,46,16],[48,4,48,5],[48,6,48,7],[48,8,48,9],[48,10,48,11],[48,13,48,14],[48,28,48,29],[50,16,50,17],[48,15,48,16],[48,17,48,18],[48,19,48,20],[48,22,48,23],[48,24,48,25],[48,26,48,27]]}
[]
[null,null,"MSP CALCULATOR"]
[null,null,"Levels",":",{"$f":"IF(Vacancy!E6=\"\",\"\",Vacancy!E6)","v":""},null,null,null,null,null,null,"Name",":",null,null,null,null,null,null,null,null,null,null,null,null,null,"Employment Category:",null,null,null,null,null,{"$f":"SUM(F13,Y11,Y13,Y15,E25,Z25,J40,Q51,K67,K77,D81)","v":0}]
[null,null,null,null,null,null,null,null,null,null,null,null,null,null,null,null,null,null,null,null,null,null,null,null,null,null,null,null,null,null,null,null,"TOTAL MATRIX POINTS"]
[null,null,{"$f":"IF(E3=\"First Level\",\"A. Performance Rating (20 pts)\",IF(E3=\"Second Level\",\"A. Performance Rating (15 pts)\",\"A. Performance Rating (35 pts)\"))","v":"A. Performance Rating (35 pts)"},null,null,null,null,null,null,null,null,{"$f":"IF(E3=\"First Level\",\"B. Education (15 pts.)\",IF(E3=\"Second Level\",\"B. Education (10 pts.)\",\"B. Education (5 pts.)\"))","v":"B. Education (5 pts.)"}]
[null,null,"New Graduates (No previous work experience)",null,null,null,null,null,null,null,null,"Required:"]
[false,null,null,null,null,null,null,{"$f":"IF(F9>=2.75,1,IF(F9>=2.5,3,IF(F9>=2.25,5,IF(F9>=2,7,IF(F9>=1.75,9,IF(F9>=1.5,11,IF(F9>=1.25,13,IF(F9>=1,15))))))))","v":false},null,null,null,{"$f":"IF(Vacancy!E10=\"\",\"\",Vacancy!E10)","v":""}]
[]
[null,null,"GWA",null,null,null,{"$f":"IF(F9>=2.75,2,IF(F9>=2.5,5,IF(F9>=2.25,8,IF(F9>=2,11,IF(F9>=1.75,14,IF(F9>=1.5,16,IF(F9>=1.25,18,IF(F9>=1,20))))))))","v":false},{"$f":"IF(E3=\"First Level\",(20*F11)/5,IF(E3=\"Second Level\",(15*F11)/5,IF(E3=\"Executive/Managerial\",(35*F11)/5,\"\")))","v":""},null,null,null,"Highest Educational Attainment:",null,null,null,null,null,null,null,null,null,null,null,null,"Total Score:"]
[]
[null,null,"Last Rating Period",null,null,null,null,{"$f":"IFERROR(IF(AND(A7=TRUE,E3=\"First Level\"),G9,IF(AND(A7=TRUE,E3=\"Second Level\"),H7,H9)),\"\")","v":""},null,null,null,"First Level:",null,null,null,null,null,null,null,null,null,null,null,{"$f":"VLOOKUP(P11,Educ_2!$A$11:$B$26,2,FALSE)","v":{"$error":"#N/A"}},{"$f":"IFERROR(VLOOKUP($L$7,Educ_2!$A$1:$Q$8,X11+1,FALSE),\"\")","v":""}]
[]
[false,null,"Total Score",null,":",{"$f":"IF(H11=FALSE,0,H11)","v":""},"pts.",null,null,null,null,"Second Level:",null,null,null,null,null,null,null,null,null,null,null,{"$f":"VLOOKUP(P13,Educ_2!$A$11:$B$26,2,FALSE)","v":{"$error":"#N/A"}},{"$f":"IFERROR(VLOOKUP($L$7,Educ_2!$A$1:$Q$8,X13+1,FALSE),\"\")","v":""}]
[]
[null,null,null,null,null,null,null,null,null,null,null,"Executive/Managerial:",null,null,null,null,null,null,null,null,null,null,null,{"$f":"VLOOKUP(P15,Educ_2!$A$11:$B$26,2,FALSE)","v":{"$error":"#N/A"}},{"$f":"IFERROR(VLOOKUP($L$7,Educ_2!$A$1:$Q$8,X15+1,FALSE),\"\")","v":""}]
[]
[null,null,null,null,null,null,null,null,null,null,null,null,null,null,null,null,null,null,null,null,null,null,null,null,{"$f":"SUM(Y11,Y13,Y15)","v":0}]
[]
[null,null,"C. Training (10 pts.)",null,null,null,null,null,null,null,null,null,null,null,null,null,null,null,null,null,null,null,null,null,{"$f":"IF(E3=\"Executive/Managerial\",\"D. Experience (10 pts)\",\"D. Experience (25 pts)\")","v":"D. Experience (25 pts)"}]
[null,null,null,null,null,null,null,null,null,null,null,null,null,null,null,null,null,null,null,"Coversion to YEAR"]
[true,null,null,null,{"$f":"IF(Vacancy!$R$10=\"None required\",0,IF(Vacancy!$R$10=\"\",\"\",Vacancy!$R$10))","v":""},"Required (hrs.)",null,null,null,null,null,null,null,null,null,null,null,null,null,null,"Year",null,{"$f":"T21","v":0},null,null,{"$f":"IF(Vacancy!$AA$10=\"None required\",0,IF(Vacancy!$AA$10=\"\",\"\",Vacancy!$AA$10))","v":""},"Required Exp."]
[]
[null,null,null,{"$f":"E23-E21","v":{"$error":"#VALUE!"}},null,"Relevant training hrs. acquired",null,null,null,null,null,null,null,null,null,null,null,null,null,null,"Month",null,{"$f":"T23/12","v":0},null,{"$f":"Z23-Z21","v":{"$error":"#VALUE!"}},{"$f":"SUM(W21,W23,W25)","v":0},"Relevant years of experience"]
[]
[null,null,null,null,{"$f":"IF(N3=\"\",0,IFERROR(IF(E21=E23,5,IF(E23>=E21,((5*D23)/Trg_Exp!$D$2)+5,0)),0))","v":0},"Total",null,null,null,null,null,null,null,null,null,null,null,null,null,null,"Day",null,{"$f":"T25/365","v":0},null,{"$f":"IFERROR(IF(AND(Z21=Z23),10,IF(Vacancy!E6=\"Executive/Managerial\",((10*Y23)/Trg_Exp!$K$2),IF(Z23>=Z21,((15*Y23)/Trg_Exp!$K$2)+10,0))),0)","v":0},{"$f":"IF(N3=\"\",0,IF(Y25<0,0,Y25))","v":0},"Total Score:"]
[]
[null,null,{"$f":"IF(Vacancy!E6=\"Second Level\",\"E. Accomplishment (15 pts.)\",\"E. Accomplishment (10 pts.)\")","v":"E. Accomplishment (10 pts.)"}]
[]
[null,null,null,null,"E.1  Awards/Citations/Commendations"]
[]
[false,null,null,null,"E.1.1. Unit Level",null,null,null,null,{"$f":"IF(A31=TRUE,1,\"\")","v":""}]
[]
[false,null,null,null,"E.1.2. University Level",null,null,null,null,{"$f":"IF(A33=TRUE,3,\"\")","v":""}]
[]
[false,null,null,null,"E.1.3. National/CSC Level",null,null,null,null,{"$f":"IF(A35=TRUE,5,\"\")","v":""}]
[null,null,null,null,"E.2. Innovations/ Systems Improvement"]
[false,null,null,null,null,null,null,null,null,{"$f":"IF(A37=TRUE,IF(Vacancy!E6=\"Second Level\",4,3),\"\")","v":""}]
[null,null,null,null,null,null,null,null,null,null,{"$f":"IF(E3=\"Second Level\",((SUM(J31,J33,J35)*11)/9),((SUM(J31,J33,J35)*7)/9))","v":0}]
[]
[null,null,null,null,"C.2. Total Score:",null,null,null,null,{"$f":"IF(E3=\"Second Level\",(15*SUM(K38,J37)/15),(10*SUM(K38,J37)/10))","v":0}]
[]
[null,null,{"$f":"IF(E3=\"Executive/Managerial\",\"F. Physical Characteristics and Personality Traits (10 pts.)\",\"F. Physical Characteristics and Personality Traits (5 pts.)\")","v":"F. Physical Characteristics and Personality Traits (5 pts.)"}]
[]
[null,null,null,null,"Supervisor",null,"Co-worker 1",null,"Co-worker 2",null,"Co-worker 3",null,null,"Supervisor",null,"Co-worker 1",null,"Co-worker 2",null,"Co-worker 3",null,null,"Supervisor",null,"Co-worker 1",null,"Co-worker 2",null,"Co-worker 3"]
[null,null,null,null,"ATTITUDE",null,null,null,null,null,null,null,null,"COMMITMENT",null,null,null,null,null,null,null,null,"APPEARANCE"]
[null,null,null,"F.1.1. ",null,null,null,null,null,null,null,null,"F.2.1. ",null,null,null,null,null,null,null,null,"F.3.1. "]
[null,null,null,"F.1.2. ",null,null,null,null,null,null,null,null,"F.2.2. ",null,null,null,null,null,null,null,null,"F.3.2. "]
[null,null,null,"F.1.3. ",null,null,null,null,null,null,null,null,"F.2.3. "]
[null,null,null,null,{"$f":"IF($E$3=\"Executive/Managerial\",(4*(SUM(E46:F48)/12)),(2*(SUM(E46:F48)/12)))","v":0},null,{"$f":"IF($E$3=\"Executive/Managerial\",(4*(SUM(G46:H48)/12)),(2*(SUM(G46:H48)/12)))","v":0},null,{"$f":"IF($E$3=\"Executive/Managerial\",(4*(SUM(I46:J48)/12)),(2*(SUM(I46:J48)/12)))","v":0},null,{"$f":"IF($E$3=\"Executive/Managerial\",(4*(SUM(K46:L48)/12)),(2*(SUM(K46:L48)/12)))","v":0},null,null,{"$f":"IF($E$3=\"Executive/Managerial\",(4*(SUM(N46:O48)/12)),(2*(SUM(N46:O48)/12)))","v":0},null,{"$f":"IF($E$3=\"Executive/Managerial\",(4*(SUM(P46:Q48)/12)),(2*(SUM(P46:Q48)/12)))","v":0},null,{"$f":"IF($E$3=\"Executive/Managerial\",(4*(SUM(R46:S48)/12)),(2*(SUM(R46:S48)/12)))","v":0},null,{"$f":"IF($E$3=\"Executive/Managerial\",(4*(SUM(T46:U48)/12)),(2*(SUM(T46:U48)/12)))","v":0},null,null,{"$f":"IF($E$3=\"Executive/Managerial\",(2*(SUM(W46:X48))/8),(1*(SUM(W46:X48))/8))","v":0},null,{"$f":"IF($E$3=\"Executive/Managerial\",(2*(SUM(Y46:Z48))/8),(1*(SUM(Y46:Z48))/8))","v":0},null,{"$f":"IF($E$3=\"Executive/Managerial\",(2*(SUM(AA46:AB48))/8),(1*(SUM(AA46:AB48))/8))","v":0},null,{"$f":"IF($E$3=\"Executive/Managerial\",(2*(SUM(AC46:AD48))/8),(1*(SUM(AC46:AD48))/8))","v":0}]
[null,null,null,null,null,null,"Supervisor",null,"Co-worker"]
[null,null,null,null,"Attitude",null,{"$f":"E49","v":0},null,{"$f":"SUM(G49:L49)/3","v":0},null,null,null,null,"Total Score PCPT:",null,null,{"$f":"IF(E3=\"Executive/Managerial\",SUM(G54:J54),SUM(G54:J54))","v":0}]
[null,null,null,null,"Commitment",null,{"$f":"N49","v":0},null,{"$f":"SUM(P49:U49)/3","v":0}]
[null,null,null,null,"Appearance",null,{"$f":"W49","v":0},null,{"$f":"SUM(Y49:AD49)/3","v":0}]
[null,null,null,null,null,null,{"$f":"SUM(G51:G53)*0.6","v":0},null,{"$f":"SUM(I51:I53)*0.4","v":0}]
[null,null,{"$f":"IF(E3=\"First Level\",\"G. Potential [Assessment Form No. 2] (3 pts.)\",\"G. Potential [Assessment Form No. 2] (5 pts.)\")","v":"G. Potential [Assessment Form No. 2] (5 pts.)"}]
[]
[null,null,null,"INTERVIEW"]
[]
[null,null,null,null,"G.1.1. Sound judgement",null,null,null,null,null,null,{"$f":"IF($E$3=\"First Level\",\"Not Applicable for First Level position\",\"\")","v":""}]
[null,null,null,null,"G.1.2. Analytical mind",null,null,null,null,null,null,{"$f":"IF($E$3=\"First Level\",\"Not Applicable for First Level position\",\"\")","v":""}]
[null,null,null,null,"G.1.3. The ability to motivate co-workers",null,null,null,null,null,null,{"$f":"IF($E$3=\"First Level\",\"Not Applicable for First Level position\",\"\")","v":""}]
[null,null,null,null,"G.1.4. Unifying Factor",null,null,null,null,null,null,{"$f":"IF($E$3=\"First Level\",\"Not Applicable for First Level position\",\"\")","v":""}]
[null,null,null,null,"G.1.5. Vision/foresight",null,null,null,null,null,null,{"$f":"IF($E$3=\"First Level\",\"Not Applicable for First Level position\",\"\")","v":""}]
[null,null,null,null,"G.2. Resourcefulness"]
[null,null,null,null,"G.3. Creativity/ Ingenuity "]
[]
[null,null,null,"TOTAL POINTS FOR POTENTIAL",null,null,null,null,null,null,{"$f":"IF(E3=\"First Level\",(3*(SUM(K64:K65)/8)),(5*(SUM(K59:K65)/28)))","v":0}]
[]
[null,null,{"$f":"IF(E3=\"First Level\",\"H. Written/ Skills Examination (12 pts.)\",\"H. Written/ Skills Examination (15 pts.)\")","v":"H. Written/ Skills Examination (15 pts.)"}]
[null,null,null,null,null,null,null,null,null,null,{"$f":"IFERROR(SUM(K59:K65)/7,0)","v":0}]
[null,null,null,"WRITTEN/SKILLS EXAMINATION"]
[]
[null,null,null,null,"Perfect/Entire Score",null,null,"="]
[null,null,null,null,"Raw Score",null,null,"="]
[]
[]
[null,null,null,"TOTAL FOR EXAMINATION",null,null,null,null,null,null,{"$f":"IFERROR(IF(E3=\"First Level\",IF(K74>K73,0,(K74*12)/K73),IF(K74>K73,0,(K74*15)/K73)),0)","v":0}]
[]
[null,null,"I. Public Service"]
[]
[null,null,null,null,"Additional Pts. in excess of Total Score"]

{"sheet":"AP48","index":55,"n_rows":81,"n_cols":33,"rows_kept":81,"cut":false,"hidden":false,"merged":[[1,2,1,29],[2,4,2,9],[2,13,2,22],[2,27,2,30],[2,32,2,33],[45,4,45,5],[45,6,45,7],[45,8,45,9],[45,10,45,11],[45,13,45,14],[10,15,10,22],[12,15,12,22],[14,15,14,22],[19,19,19,22],[35,4,37,7],[45,28,45,29],[45,24,45,25],[45,26,45,27],[6,11,6,22],[46,4,46,5],[46,6,46,7],[46,8,46,9],[46,10,46,11],[46,13,46,14],[46,17,46,18],[46,19,46,20],[46,22,46,23],[45,15,45,16],[45,17,45,18],[45,19,45,20],[45,22,45,23],[46,24,46,25],[46,26,46,27],[46,28,46,29],[47,4,47,5],[47,6,47,7],[47,8,47,9],[47,10,47,11],[47,13,47,14],[47,15,47,16],[47,17,47,18],[47,19,47,20],[47,22,47,23],[47,24,47,25],[47,26,47,27],[47,28,47,29],[46,15,46,16],[48,4,48,5],[48,6,48,7],[48,8,48,9],[48,10,48,11],[48,13,48,14],[48,28,48,29],[50,16,50,17],[48,15,48,16],[48,17,48,18],[48,19,48,20],[48,22,48,23],[48,24,48,25],[48,26,48,27]]}
[]
[null,null,"MSP CALCULATOR"]
[null,null,"Levels",":",{"$f":"IF(Vacancy!E6=\"\",\"\",Vacancy!E6)","v":""},null,null,null,null,null,null,"Name",":",null,null,null,null,null,null,null,null,null,null,null,null,null,"Employment Category:",null,null,null,null,null,{"$f":"SUM(F13,Y11,Y13,Y15,E25,Z25,J40,Q51,K67,K77,D81)","v":0}]
[null,null,null,null,null,null,null,null,null,null,null,null,null,null,null,null,null,null,null,null,null,null,null,null,null,null,null,null,null,null,null,null,"TOTAL MATRIX POINTS"]
[null,null,{"$f":"IF(E3=\"First Level\",\"A. Performance Rating (20 pts)\",IF(E3=\"Second Level\",\"A. Performance Rating (15 pts)\",\"A. Performance Rating (35 pts)\"))","v":"A. Performance Rating (35 pts)"},null,null,null,null,null,null,null,null,{"$f":"IF(E3=\"First Level\",\"B. Education (15 pts.)\",IF(E3=\"Second Level\",\"B. Education (10 pts.)\",\"B. Education (5 pts.)\"))","v":"B. Education (5 pts.)"}]
[null,null,"New Graduates (No previous work experience)",null,null,null,null,null,null,null,null,"Required:"]
[false,null,null,null,null,null,null,{"$f":"IF(F9>=2.75,1,IF(F9>=2.5,3,IF(F9>=2.25,5,IF(F9>=2,7,IF(F9>=1.75,9,IF(F9>=1.5,11,IF(F9>=1.25,13,IF(F9>=1,15))))))))","v":false},null,null,null,{"$f":"IF(Vacancy!E10=\"\",\"\",Vacancy!E10)","v":""}]
[]
[null,null,"GWA",null,null,null,{"$f":"IF(F9>=2.75,2,IF(F9>=2.5,5,IF(F9>=2.25,8,IF(F9>=2,11,IF(F9>=1.75,14,IF(F9>=1.5,16,IF(F9>=1.25,18,IF(F9>=1,20))))))))","v":false},{"$f":"IF(E3=\"First Level\",(20*F11)/5,IF(E3=\"Second Level\",(15*F11)/5,IF(E3=\"Executive/Managerial\",(35*F11)/5,\"\")))","v":""},null,null,null,"Highest Educational Attainment:",null,null,null,null,null,null,null,null,null,null,null,null,"Total Score:"]
[]
[null,null,"Last Rating Period",null,null,null,null,{"$f":"IFERROR(IF(AND(A7=TRUE,E3=\"First Level\"),G9,IF(AND(A7=TRUE,E3=\"Second Level\"),H7,H9)),\"\")","v":""},null,null,null,"First Level:",null,null,null,null,null,null,null,null,null,null,null,{"$f":"VLOOKUP(P11,Educ_2!$A$11:$B$26,2,FALSE)","v":{"$error":"#N/A"}},{"$f":"IFERROR(VLOOKUP($L$7,Educ_2!$A$1:$Q$8,X11+1,FALSE),\"\")","v":""}]
[]
[false,null,"Total Score",null,":",{"$f":"IF(H11=FALSE,0,H11)","v":""},"pts.",null,null,null,null,"Second Level:",null,null,null,null,null,null,null,null,null,null,null,{"$f":"VLOOKUP(P13,Educ_2!$A$11:$B$26,2,FALSE)","v":{"$error":"#N/A"}},{"$f":"IFERROR(VLOOKUP($L$7,Educ_2!$A$1:$Q$8,X13+1,FALSE),\"\")","v":""}]
[]
[null,null,null,null,null,null,null,null,null,null,null,"Executive/Managerial:",null,null,null,null,null,null,null,null,null,null,null,{"$f":"VLOOKUP(P15,Educ_2!$A$11:$B$26,2,FALSE)","v":{"$error":"#N/A"}},{"$f":"IFERROR(VLOOKUP($L$7,Educ_2!$A$1:$Q$8,X15+1,FALSE),\"\")","v":""}]
[]
[null,null,null,null,null,null,null,null,null,null,null,null,null,null,null,null,null,null,null,null,null,null,null,null,{"$f":"SUM(Y11,Y13,Y15)","v":0}]
[]
[null,null,"C. Training (10 pts.)",null,null,null,null,null,null,null,null,null,null,null,null,null,null,null,null,null,null,null,null,null,{"$f":"IF(E3=\"Executive/Managerial\",\"D. Experience (10 pts)\",\"D. Experience (25 pts)\")","v":"D. Experience (25 pts)"}]
[null,null,null,null,null,null,null,null,null,null,null,null,null,null,null,null,null,null,null,"Coversion to YEAR"]
[true,null,null,null,{"$f":"IF(Vacancy!$R$10=\"None required\",0,IF(Vacancy!$R$10=\"\",\"\",Vacancy!$R$10))","v":""},"Required (hrs.)",null,null,null,null,null,null,null,null,null,null,null,null,null,null,"Year",null,{"$f":"T21","v":0},null,null,{"$f":"IF(Vacancy!$AA$10=\"None required\",0,IF(Vacancy!$AA$10=\"\",\"\",Vacancy!$AA$10))","v":""},"Required Exp."]
[]
[null,null,null,{"$f":"E23-E21","v":{"$error":"#VALUE!"}},null,"Relevant training hrs. acquired",null,null,null,null,null,null,null,null,null,null,null,null,null,null,"Month",null,{"$f":"T23/12","v":0},null,{"$f":"Z23-Z21","v":{"$error":"#VALUE!"}},{"$f":"SUM(W21,W23,W25)","v":0},"Relevant years of experience"]
[]
[null,null,null,null,{"$f":"IF(N3=\"\",0,IFERROR(IF(E21=E23,5,IF(E23>=E21,((5*D23)/Trg_Exp!$D$2)+5,0)),0))","v":0},"Total",null,null,null,null,null,null,null,null,null,null,null,null,null,null,"Day",null,{"$f":"T25/365","v":0},null,{"$f":"IFERROR(IF(AND(Z21=Z23),10,IF(Vacancy!E6=\"Executive/Managerial\",((10*Y23)/Trg_Exp!$K$2),IF(Z23>=Z21,((15*Y23)/Trg_Exp!$K$2)+10,0))),0)","v":0},{"$f":"IF(N3=\"\",0,IF(Y25<0,0,Y25))","v":0},"Total Score:"]
[]
[null,null,{"$f":"IF(Vacancy!E6=\"Second Level\",\"E. Accomplishment (15 pts.)\",\"E. Accomplishment (10 pts.)\")","v":"E. Accomplishment (10 pts.)"}]
[]
[null,null,null,null,"E.1  Awards/Citations/Commendations"]
[]
[false,null,null,null,"E.1.1. Unit Level",null,null,null,null,{"$f":"IF(A31=TRUE,1,\"\")","v":""}]
[]
[false,null,null,null,"E.1.2. University Level",null,null,null,null,{"$f":"IF(A33=TRUE,3,\"\")","v":""}]
[]
[false,null,null,null,"E.1.3. National/CSC Level",null,null,null,null,{"$f":"IF(A35=TRUE,5,\"\")","v":""}]
[null,null,null,null,"E.2. Innovations/ Systems Improvement"]
[false,null,null,null,null,null,null,null,null,{"$f":"IF(A37=TRUE,IF(Vacancy!E6=\"Second Level\",4,3),\"\")","v":""}]
[null,null,null,null,null,null,null,null,null,null,{"$f":"IF(E3=\"Second Level\",((SUM(J31,J33,J35)*11)/9),((SUM(J31,J33,J35)*7)/9))","v":0}]
[]
[null,null,null,null,"C.2. Total Score:",null,null,null,null,{"$f":"IF(E3=\"Second Level\",(15*SUM(K38,J37)/15),(10*SUM(K38,J37)/10))","v":0}]
[]
[null,null,{"$f":"IF(E3=\"Executive/Managerial\",\"F. Physical Characteristics and Personality Traits (10 pts.)\",\"F. Physical Characteristics and Personality Traits (5 pts.)\")","v":"F. Physical Characteristics and Personality Traits (5 pts.)"}]
[]
[null,null,null,null,"Supervisor",null,"Co-worker 1",null,"Co-worker 2",null,"Co-worker 3",null,null,"Supervisor",null,"Co-worker 1",null,"Co-worker 2",null,"Co-worker 3",null,null,"Supervisor",null,"Co-worker 1",null,"Co-worker 2",null,"Co-worker 3"]
[null,null,null,null,"ATTITUDE",null,null,null,null,null,null,null,null,"COMMITMENT",null,null,null,null,null,null,null,null,"APPEARANCE"]
[null,null,null,"F.1.1. ",null,null,null,null,null,null,null,null,"F.2.1. ",null,null,null,null,null,null,null,null,"F.3.1. "]
[null,null,null,"F.1.2. ",null,null,null,null,null,null,null,null,"F.2.2. ",null,null,null,null,null,null,null,null,"F.3.2. "]
[null,null,null,"F.1.3. ",null,null,null,null,null,null,null,null,"F.2.3. "]
[null,null,null,null,{"$f":"IF($E$3=\"Executive/Managerial\",(4*(SUM(E46:F48)/12)),(2*(SUM(E46:F48)/12)))","v":0},null,{"$f":"IF($E$3=\"Executive/Managerial\",(4*(SUM(G46:H48)/12)),(2*(SUM(G46:H48)/12)))","v":0},null,{"$f":"IF($E$3=\"Executive/Managerial\",(4*(SUM(I46:J48)/12)),(2*(SUM(I46:J48)/12)))","v":0},null,{"$f":"IF($E$3=\"Executive/Managerial\",(4*(SUM(K46:L48)/12)),(2*(SUM(K46:L48)/12)))","v":0},null,null,{"$f":"IF($E$3=\"Executive/Managerial\",(4*(SUM(N46:O48)/12)),(2*(SUM(N46:O48)/12)))","v":0},null,{"$f":"IF($E$3=\"Executive/Managerial\",(4*(SUM(P46:Q48)/12)),(2*(SUM(P46:Q48)/12)))","v":0},null,{"$f":"IF($E$3=\"Executive/Managerial\",(4*(SUM(R46:S48)/12)),(2*(SUM(R46:S48)/12)))","v":0},null,{"$f":"IF($E$3=\"Executive/Managerial\",(4*(SUM(T46:U48)/12)),(2*(SUM(T46:U48)/12)))","v":0},null,null,{"$f":"IF($E$3=\"Executive/Managerial\",(2*(SUM(W46:X48))/8),(1*(SUM(W46:X48))/8))","v":0},null,{"$f":"IF($E$3=\"Executive/Managerial\",(2*(SUM(Y46:Z48))/8),(1*(SUM(Y46:Z48))/8))","v":0},null,{"$f":"IF($E$3=\"Executive/Managerial\",(2*(SUM(AA46:AB48))/8),(1*(SUM(AA46:AB48))/8))","v":0},null,{"$f":"IF($E$3=\"Executive/Managerial\",(2*(SUM(AC46:AD48))/8),(1*(SUM(AC46:AD48))/8))","v":0}]
[null,null,null,null,null,null,"Supervisor",null,"Co-worker"]
[null,null,null,null,"Attitude",null,{"$f":"E49","v":0},null,{"$f":"SUM(G49:L49)/3","v":0},null,null,null,null,"Total Score PCPT:",null,null,{"$f":"IF(E3=\"Executive/Managerial\",SUM(G54:J54),SUM(G54:J54))","v":0}]
[null,null,null,null,"Commitment",null,{"$f":"N49","v":0},null,{"$f":"SUM(P49:U49)/3","v":0}]
[null,null,null,null,"Appearance",null,{"$f":"W49","v":0},null,{"$f":"SUM(Y49:AD49)/3","v":0}]
[null,null,null,null,null,null,{"$f":"SUM(G51:G53)*0.6","v":0},null,{"$f":"SUM(I51:I53)*0.4","v":0}]
[null,null,{"$f":"IF(E3=\"First Level\",\"G. Potential [Assessment Form No. 2] (3 pts.)\",\"G. Potential [Assessment Form No. 2] (5 pts.)\")","v":"G. Potential [Assessment Form No. 2] (5 pts.)"}]
[]
[null,null,null,"INTERVIEW"]
[]
[null,null,null,null,"G.1.1. Sound judgement",null,null,null,null,null,null,{"$f":"IF($E$3=\"First Level\",\"Not Applicable for First Level position\",\"\")","v":""}]
[null,null,null,null,"G.1.2. Analytical mind",null,null,null,null,null,null,{"$f":"IF($E$3=\"First Level\",\"Not Applicable for First Level position\",\"\")","v":""}]
[null,null,null,null,"G.1.3. The ability to motivate co-workers",null,null,null,null,null,null,{"$f":"IF($E$3=\"First Level\",\"Not Applicable for First Level position\",\"\")","v":""}]
[null,null,null,null,"G.1.4. Unifying Factor",null,null,null,null,null,null,{"$f":"IF($E$3=\"First Level\",\"Not Applicable for First Level position\",\"\")","v":""}]
[null,null,null,null,"G.1.5. Vision/foresight",null,null,null,null,null,null,{"$f":"IF($E$3=\"First Level\",\"Not Applicable for First Level position\",\"\")","v":""}]
[null,null,null,null,"G.2. Resourcefulness"]
[null,null,null,null,"G.3. Creativity/ Ingenuity "]
[]
[null,null,null,"TOTAL POINTS FOR POTENTIAL",null,null,null,null,null,null,{"$f":"IF(E3=\"First Level\",(3*(SUM(K64:K65)/8)),(5*(SUM(K59:K65)/28)))","v":0}]
[]
[null,null,{"$f":"IF(E3=\"First Level\",\"H. Written/ Skills Examination (12 pts.)\",\"H. Written/ Skills Examination (15 pts.)\")","v":"H. Written/ Skills Examination (15 pts.)"}]
[null,null,null,null,null,null,null,null,null,null,{"$f":"IFERROR(SUM(K59:K65)/7,0)","v":0}]
[null,null,null,"WRITTEN/SKILLS EXAMINATION"]
[]
[null,null,null,null,"Perfect/Entire Score",null,null,"="]
[null,null,null,null,"Raw Score",null,null,"="]
[]
[]
[null,null,null,"TOTAL FOR EXAMINATION",null,null,null,null,null,null,{"$f":"IFERROR(IF(E3=\"First Level\",IF(K74>K73,0,(K74*12)/K73),IF(K74>K73,0,(K74*15)/K73)),0)","v":0}]
[]
[null,null,"I. Public Service"]
[]
[null,null,null,null,"Additional Pts. in excess of Total Score"]

{"sheet":"AP49","index":56,"n_rows":81,"n_cols":33,"rows_kept":81,"cut":false,"hidden":false,"merged":[[1,2,1,29],[2,4,2,9],[2,13,2,22],[2,27,2,30],[2,32,2,33],[45,4,45,5],[45,6,45,7],[45,8,45,9],[45,10,45,11],[45,13,45,14],[10,15,10,22],[12,15,12,22],[14,15,14,22],[19,19,19,22],[35,4,37,7],[45,28,45,29],[45,24,45,25],[45,26,45,27],[6,11,6,22],[46,4,46,5],[46,6,46,7],[46,8,46,9],[46,10,46,11],[46,13,46,14],[46,17,46,18],[46,19,46,20],[46,22,46,23],[45,15,45,16],[45,17,45,18],[45,19,45,20],[45,22,45,23],[46,24,46,25],[46,26,46,27],[46,28,46,29],[47,4,47,5],[47,6,47,7],[47,8,47,9],[47,10,47,11],[47,13,47,14],[47,15,47,16],[47,17,47,18],[47,19,47,20],[47,22,47,23],[47,24,47,25],[47,26,47,27],[47,28,47,29],[46,15,46,16],[48,4,48,5],[48,6,48,7],[48,8,48,9],[48,10,48,11],[48,13,48,14],[48,28,48,29],[50,16,50,17],[48,15,48,16],[48,17,48,18],[48,19,48,20],[48,22,48,23],[48,24,48,25],[48,26,48,27]]}
[]
[null,null,"MSP CALCULATOR"]
[null,null,"Levels",":",{"$f":"IF(Vacancy!E6=\"\",\"\",Vacancy!E6)","v":""},null,null,null,null,null,null,"Name",":",null,null,null,null,null,null,null,null,null,null,null,null,null,"Employment Category:",null,null,null,null,null,{"$f":"SUM(F13,Y11,Y13,Y15,E25,Z25,J40,Q51,K67,K77,D81)","v":0}]
[null,null,null,null,null,null,null,null,null,null,null,null,null,null,null,null,null,null,null,null,null,null,null,null,null,null,null,null,null,null,null,null,"TOTAL MATRIX POINTS"]
[null,null,{"$f":"IF(E3=\"First Level\",\"A. Performance Rating (20 pts)\",IF(E3=\"Second Level\",\"A. Performance Rating (15 pts)\",\"A. Performance Rating (35 pts)\"))","v":"A. Performance Rating (35 pts)"},null,null,null,null,null,null,null,null,{"$f":"IF(E3=\"First Level\",\"B. Education (15 pts.)\",IF(E3=\"Second Level\",\"B. Education (10 pts.)\",\"B. Education (5 pts.)\"))","v":"B. Education (5 pts.)"}]
[null,null,"New Graduates (No previous work experience)",null,null,null,null,null,null,null,null,"Required:"]
[false,null,null,null,null,null,null,{"$f":"IF(F9>=2.75,1,IF(F9>=2.5,3,IF(F9>=2.25,5,IF(F9>=2,7,IF(F9>=1.75,9,IF(F9>=1.5,11,IF(F9>=1.25,13,IF(F9>=1,15))))))))","v":false},null,null,null,{"$f":"IF(Vacancy!E10=\"\",\"\",Vacancy!E10)","v":""}]
[]
[null,null,"GWA",null,null,null,{"$f":"IF(F9>=2.75,2,IF(F9>=2.5,5,IF(F9>=2.25,8,IF(F9>=2,11,IF(F9>=1.75,14,IF(F9>=1.5,16,IF(F9>=1.25,18,IF(F9>=1,20))))))))","v":false},{"$f":"IF(E3=\"First Level\",(20*F11)/5,IF(E3=\"Second Level\",(15*F11)/5,IF(E3=\"Executive/Managerial\",(35*F11)/5,\"\")))","v":""},null,null,null,"Highest Educational Attainment:",null,null,null,null,null,null,null,null,null,null,null,null,"Total Score:"]
[]
[null,null,"Last Rating Period",null,null,null,null,{"$f":"IFERROR(IF(AND(A7=TRUE,E3=\"First Level\"),G9,IF(AND(A7=TRUE,E3=\"Second Level\"),H7,H9)),\"\")","v":""},null,null,null,"First Level:",null,null,null,null,null,null,null,null,null,null,null,{"$f":"VLOOKUP(P11,Educ_2!$A$11:$B$26,2,FALSE)","v":{"$error":"#N/A"}},{"$f":"IFERROR(VLOOKUP($L$7,Educ_2!$A$1:$Q$8,X11+1,FALSE),\"\")","v":""}]
[]
[false,null,"Total Score",null,":",{"$f":"IF(H11=FALSE,0,H11)","v":""},"pts.",null,null,null,null,"Second Level:",null,null,null,null,null,null,null,null,null,null,null,{"$f":"VLOOKUP(P13,Educ_2!$A$11:$B$26,2,FALSE)","v":{"$error":"#N/A"}},{"$f":"IFERROR(VLOOKUP($L$7,Educ_2!$A$1:$Q$8,X13+1,FALSE),\"\")","v":""}]
[]
[null,null,null,null,null,null,null,null,null,null,null,"Executive/Managerial:",null,null,null,null,null,null,null,null,null,null,null,{"$f":"VLOOKUP(P15,Educ_2!$A$11:$B$26,2,FALSE)","v":{"$error":"#N/A"}},{"$f":"IFERROR(VLOOKUP($L$7,Educ_2!$A$1:$Q$8,X15+1,FALSE),\"\")","v":""}]
[]
[null,null,null,null,null,null,null,null,null,null,null,null,null,null,null,null,null,null,null,null,null,null,null,null,{"$f":"SUM(Y11,Y13,Y15)","v":0}]
[]
[null,null,"C. Training (10 pts.)",null,null,null,null,null,null,null,null,null,null,null,null,null,null,null,null,null,null,null,null,null,{"$f":"IF(E3=\"Executive/Managerial\",\"D. Experience (10 pts)\",\"D. Experience (25 pts)\")","v":"D. Experience (25 pts)"}]
[null,null,null,null,null,null,null,null,null,null,null,null,null,null,null,null,null,null,null,"Coversion to YEAR"]
[true,null,null,null,{"$f":"IF(Vacancy!$R$10=\"None required\",0,IF(Vacancy!$R$10=\"\",\"\",Vacancy!$R$10))","v":""},"Required (hrs.)",null,null,null,null,null,null,null,null,null,null,null,null,null,null,"Year",null,{"$f":"T21","v":0},null,null,{"$f":"IF(Vacancy!$AA$10=\"None required\",0,IF(Vacancy!$AA$10=\"\",\"\",Vacancy!$AA$10))","v":""},"Required Exp."]
[]
[null,null,null,{"$f":"E23-E21","v":{"$error":"#VALUE!"}},null,"Relevant training hrs. acquired",null,null,null,null,null,null,null,null,null,null,null,null,null,null,"Month",null,{"$f":"T23/12","v":0},null,{"$f":"Z23-Z21","v":{"$error":"#VALUE!"}},{"$f":"SUM(W21,W23,W25)","v":0},"Relevant years of experience"]
[]
[null,null,null,null,{"$f":"IF(N3=\"\",0,IFERROR(IF(E21=E23,5,IF(E23>=E21,((5*D23)/Trg_Exp!$D$2)+5,0)),0))","v":0},"Total",null,null,null,null,null,null,null,null,null,null,null,null,null,null,"Day",null,{"$f":"T25/365","v":0},null,{"$f":"IFERROR(IF(AND(Z21=Z23),10,IF(Vacancy!E6=\"Executive/Managerial\",((10*Y23)/Trg_Exp!$K$2),IF(Z23>=Z21,((15*Y23)/Trg_Exp!$K$2)+10,0))),0)","v":0},{"$f":"IF(N3=\"\",0,IF(Y25<0,0,Y25))","v":0},"Total Score:"]
[]
[null,null,{"$f":"IF(Vacancy!E6=\"Second Level\",\"E. Accomplishment (15 pts.)\",\"E. Accomplishment (10 pts.)\")","v":"E. Accomplishment (10 pts.)"}]
[]
[null,null,null,null,"E.1  Awards/Citations/Commendations"]
[]
[false,null,null,null,"E.1.1. Unit Level",null,null,null,null,{"$f":"IF(A31=TRUE,1,\"\")","v":""}]
[]
[false,null,null,null,"E.1.2. University Level",null,null,null,null,{"$f":"IF(A33=TRUE,3,\"\")","v":""}]
[]
[false,null,null,null,"E.1.3. National/CSC Level",null,null,null,null,{"$f":"IF(A35=TRUE,5,\"\")","v":""}]
[null,null,null,null,"E.2. Innovations/ Systems Improvement"]
[false,null,null,null,null,null,null,null,null,{"$f":"IF(A37=TRUE,IF(Vacancy!E6=\"Second Level\",4,3),\"\")","v":""}]
[null,null,null,null,null,null,null,null,null,null,{"$f":"IF(E3=\"Second Level\",((SUM(J31,J33,J35)*11)/9),((SUM(J31,J33,J35)*7)/9))","v":0}]
[]
[null,null,null,null,"C.2. Total Score:",null,null,null,null,{"$f":"IF(E3=\"Second Level\",(15*SUM(K38,J37)/15),(10*SUM(K38,J37)/10))","v":0}]
[]
[null,null,{"$f":"IF(E3=\"Executive/Managerial\",\"F. Physical Characteristics and Personality Traits (10 pts.)\",\"F. Physical Characteristics and Personality Traits (5 pts.)\")","v":"F. Physical Characteristics and Personality Traits (5 pts.)"}]
[]
[null,null,null,null,"Supervisor",null,"Co-worker 1",null,"Co-worker 2",null,"Co-worker 3",null,null,"Supervisor",null,"Co-worker 1",null,"Co-worker 2",null,"Co-worker 3",null,null,"Supervisor",null,"Co-worker 1",null,"Co-worker 2",null,"Co-worker 3"]
[null,null,null,null,"ATTITUDE",null,null,null,null,null,null,null,null,"COMMITMENT",null,null,null,null,null,null,null,null,"APPEARANCE"]
[null,null,null,"F.1.1. ",null,null,null,null,null,null,null,null,"F.2.1. ",null,null,null,null,null,null,null,null,"F.3.1. "]
[null,null,null,"F.1.2. ",null,null,null,null,null,null,null,null,"F.2.2. ",null,null,null,null,null,null,null,null,"F.3.2. "]
[null,null,null,"F.1.3. ",null,null,null,null,null,null,null,null,"F.2.3. "]
[null,null,null,null,{"$f":"IF($E$3=\"Executive/Managerial\",(4*(SUM(E46:F48)/12)),(2*(SUM(E46:F48)/12)))","v":0},null,{"$f":"IF($E$3=\"Executive/Managerial\",(4*(SUM(G46:H48)/12)),(2*(SUM(G46:H48)/12)))","v":0},null,{"$f":"IF($E$3=\"Executive/Managerial\",(4*(SUM(I46:J48)/12)),(2*(SUM(I46:J48)/12)))","v":0},null,{"$f":"IF($E$3=\"Executive/Managerial\",(4*(SUM(K46:L48)/12)),(2*(SUM(K46:L48)/12)))","v":0},null,null,{"$f":"IF($E$3=\"Executive/Managerial\",(4*(SUM(N46:O48)/12)),(2*(SUM(N46:O48)/12)))","v":0},null,{"$f":"IF($E$3=\"Executive/Managerial\",(4*(SUM(P46:Q48)/12)),(2*(SUM(P46:Q48)/12)))","v":0},null,{"$f":"IF($E$3=\"Executive/Managerial\",(4*(SUM(R46:S48)/12)),(2*(SUM(R46:S48)/12)))","v":0},null,{"$f":"IF($E$3=\"Executive/Managerial\",(4*(SUM(T46:U48)/12)),(2*(SUM(T46:U48)/12)))","v":0},null,null,{"$f":"IF($E$3=\"Executive/Managerial\",(2*(SUM(W46:X48))/8),(1*(SUM(W46:X48))/8))","v":0},null,{"$f":"IF($E$3=\"Executive/Managerial\",(2*(SUM(Y46:Z48))/8),(1*(SUM(Y46:Z48))/8))","v":0},null,{"$f":"IF($E$3=\"Executive/Managerial\",(2*(SUM(AA46:AB48))/8),(1*(SUM(AA46:AB48))/8))","v":0},null,{"$f":"IF($E$3=\"Executive/Managerial\",(2*(SUM(AC46:AD48))/8),(1*(SUM(AC46:AD48))/8))","v":0}]
[null,null,null,null,null,null,"Supervisor",null,"Co-worker"]
[null,null,null,null,"Attitude",null,{"$f":"E49","v":0},null,{"$f":"SUM(G49:L49)/3","v":0},null,null,null,null,"Total Score PCPT:",null,null,{"$f":"IF(E3=\"Executive/Managerial\",SUM(G54:J54),SUM(G54:J54))","v":0}]
[null,null,null,null,"Commitment",null,{"$f":"N49","v":0},null,{"$f":"SUM(P49:U49)/3","v":0}]
[null,null,null,null,"Appearance",null,{"$f":"W49","v":0},null,{"$f":"SUM(Y49:AD49)/3","v":0}]
[null,null,null,null,null,null,{"$f":"SUM(G51:G53)*0.6","v":0},null,{"$f":"SUM(I51:I53)*0.4","v":0}]
[null,null,{"$f":"IF(E3=\"First Level\",\"G. Potential [Assessment Form No. 2] (3 pts.)\",\"G. Potential [Assessment Form No. 2] (5 pts.)\")","v":"G. Potential [Assessment Form No. 2] (5 pts.)"}]
[]
[null,null,null,"INTERVIEW"]
[]
[null,null,null,null,"G.1.1. Sound judgement",null,null,null,null,null,null,{"$f":"IF($E$3=\"First Level\",\"Not Applicable for First Level position\",\"\")","v":""}]
[null,null,null,null,"G.1.2. Analytical mind",null,null,null,null,null,null,{"$f":"IF($E$3=\"First Level\",\"Not Applicable for First Level position\",\"\")","v":""}]
[null,null,null,null,"G.1.3. The ability to motivate co-workers",null,null,null,null,null,null,{"$f":"IF($E$3=\"First Level\",\"Not Applicable for First Level position\",\"\")","v":""}]
[null,null,null,null,"G.1.4. Unifying Factor",null,null,null,null,null,null,{"$f":"IF($E$3=\"First Level\",\"Not Applicable for First Level position\",\"\")","v":""}]
[null,null,null,null,"G.1.5. Vision/foresight",null,null,null,null,null,null,{"$f":"IF($E$3=\"First Level\",\"Not Applicable for First Level position\",\"\")","v":""}]
[null,null,null,null,"G.2. Resourcefulness"]
[null,null,null,null,"G.3. Creativity/ Ingenuity "]
[]
[null,null,null,"TOTAL POINTS FOR POTENTIAL",null,null,null,null,null,null,{"$f":"IF(E3=\"First Level\",(3*(SUM(K64:K65)/8)),(5*(SUM(K59:K65)/28)))","v":0}]
[]
[null,null,{"$f":"IF(E3=\"First Level\",\"H. Written/ Skills Examination (12 pts.)\",\"H. Written/ Skills Examination (15 pts.)\")","v":"H. Written/ Skills Examination (15 pts.)"}]
[null,null,null,null,null,null,null,null,null,null,{"$f":"IFERROR(SUM(K59:K65)/7,0)","v":0}]
[null,null,null,"WRITTEN/SKILLS EXAMINATION"]
[]
[null,null,null,null,"Perfect/Entire Score",null,null,"="]
[null,null,null,null,"Raw Score",null,null,"="]
[]
[]
[null,null,null,"TOTAL FOR EXAMINATION",null,null,null,null,null,null,{"$f":"IFERROR(IF(E3=\"First Level\",IF(K74>K73,0,(K74*12)/K73),IF(K74>K73,0,(K74*15)/K73)),0)","v":0}]
[]
[null,null,"I. Public Service"]
[]
[null,null,null,null,"Additional Pts. in excess of Total Score"]

{"sheet":"AP50","index":57,"n_rows":81,"n_cols":33,"rows_kept":81,"cut":false,"hidden":false,"merged":[[1,2,1,29],[2,4,2,9],[2,13,2,22],[2,27,2,30],[2,32,2,33],[45,4,45,5],[45,6,45,7],[45,8,45,9],[45,10,45,11],[45,13,45,14],[10,15,10,22],[12,15,12,22],[14,15,14,22],[19,19,19,22],[35,4,37,7],[45,28,45,29],[45,24,45,25],[45,26,45,27],[6,11,6,22],[46,4,46,5],[46,6,46,7],[46,8,46,9],[46,10,46,11],[46,13,46,14],[46,17,46,18],[46,19,46,20],[46,22,46,23],[45,15,45,16],[45,17,45,18],[45,19,45,20],[45,22,45,23],[46,24,46,25],[46,26,46,27],[46,28,46,29],[47,4,47,5],[47,6,47,7],[47,8,47,9],[47,10,47,11],[47,13,47,14],[47,15,47,16],[47,17,47,18],[47,19,47,20],[47,22,47,23],[47,24,47,25],[47,26,47,27],[47,28,47,29],[46,15,46,16],[48,4,48,5],[48,6,48,7],[48,8,48,9],[48,10,48,11],[48,13,48,14],[48,28,48,29],[50,16,50,17],[48,15,48,16],[48,17,48,18],[48,19,48,20],[48,22,48,23],[48,24,48,25],[48,26,48,27]]}
[]
[null,null,"MSP CALCULATOR"]
[null,null,"Levels",":",{"$f":"IF(Vacancy!E6=\"\",\"\",Vacancy!E6)","v":""},null,null,null,null,null,null,"Name",":",null,null,null,null,null,null,null,null,null,null,null,null,null,"Employment Category:",null,null,null,null,null,{"$f":"SUM(F13,Y11,Y13,Y15,E25,Z25,J40,Q51,K67,K77,D81)","v":0}]
[null,null,null,null,null,null,null,null,null,null,null,null,null,null,null,null,null,null,null,null,null,null,null,null,null,null,null,null,null,null,null,null,"TOTAL MATRIX POINTS"]
[null,null,{"$f":"IF(E3=\"First Level\",\"A. Performance Rating (20 pts)\",IF(E3=\"Second Level\",\"A. Performance Rating (15 pts)\",\"A. Performance Rating (35 pts)\"))","v":"A. Performance Rating (35 pts)"},null,null,null,null,null,null,null,null,{"$f":"IF(E3=\"First Level\",\"B. Education (15 pts.)\",IF(E3=\"Second Level\",\"B. Education (10 pts.)\",\"B. Education (5 pts.)\"))","v":"B. Education (5 pts.)"}]
[null,null,"New Graduates (No previous work experience)",null,null,null,null,null,null,null,null,"Required:"]
[false,null,null,null,null,null,null,{"$f":"IF(F9>=2.75,1,IF(F9>=2.5,3,IF(F9>=2.25,5,IF(F9>=2,7,IF(F9>=1.75,9,IF(F9>=1.5,11,IF(F9>=1.25,13,IF(F9>=1,15))))))))","v":false},null,null,null,{"$f":"IF(Vacancy!E10=\"\",\"\",Vacancy!E10)","v":""}]
[]
[null,null,"GWA",null,null,null,{"$f":"IF(F9>=2.75,2,IF(F9>=2.5,5,IF(F9>=2.25,8,IF(F9>=2,11,IF(F9>=1.75,14,IF(F9>=1.5,16,IF(F9>=1.25,18,IF(F9>=1,20))))))))","v":false},{"$f":"IF(E3=\"First Level\",(20*F11)/5,IF(E3=\"Second Level\",(15*F11)/5,IF(E3=\"Executive/Managerial\",(35*F11)/5,\"\")))","v":""},null,null,null,"Highest Educational Attainment:",null,null,null,null,null,null,null,null,null,null,null,null,"Total Score:"]
[]
[null,null,"Last Rating Period",null,null,null,null,{"$f":"IFERROR(IF(AND(A7=TRUE,E3=\"First Level\"),G9,IF(AND(A7=TRUE,E3=\"Second Level\"),H7,H9)),\"\")","v":""},null,null,null,"First Level:",null,null,null,null,null,null,null,null,null,null,null,{"$f":"VLOOKUP(P11,Educ_2!$A$11:$B$26,2,FALSE)","v":{"$error":"#N/A"}},{"$f":"IFERROR(VLOOKUP($L$7,Educ_2!$A$1:$Q$8,X11+1,FALSE),\"\")","v":""}]
[]
[false,null,"Total Score",null,":",{"$f":"IF(H11=FALSE,0,H11)","v":""},"pts.",null,null,null,null,"Second Level:",null,null,null,null,null,null,null,null,null,null,null,{"$f":"VLOOKUP(P13,Educ_2!$A$11:$B$26,2,FALSE)","v":{"$error":"#N/A"}},{"$f":"IFERROR(VLOOKUP($L$7,Educ_2!$A$1:$Q$8,X13+1,FALSE),\"\")","v":""}]
[]
[null,null,null,null,null,null,null,null,null,null,null,"Executive/Managerial:",null,null,null,null,null,null,null,null,null,null,null,{"$f":"VLOOKUP(P15,Educ_2!$A$11:$B$26,2,FALSE)","v":{"$error":"#N/A"}},{"$f":"IFERROR(VLOOKUP($L$7,Educ_2!$A$1:$Q$8,X15+1,FALSE),\"\")","v":""}]
[]
[null,null,null,null,null,null,null,null,null,null,null,null,null,null,null,null,null,null,null,null,null,null,null,null,{"$f":"SUM(Y11,Y13,Y15)","v":0}]
[]
[null,null,"C. Training (10 pts.)",null,null,null,null,null,null,null,null,null,null,null,null,null,null,null,null,null,null,null,null,null,{"$f":"IF(E3=\"Executive/Managerial\",\"D. Experience (10 pts)\",\"D. Experience (25 pts)\")","v":"D. Experience (25 pts)"}]
[null,null,null,null,null,null,null,null,null,null,null,null,null,null,null,null,null,null,null,"Coversion to YEAR"]
[true,null,null,null,{"$f":"IF(Vacancy!$R$10=\"None required\",0,IF(Vacancy!$R$10=\"\",\"\",Vacancy!$R$10))","v":""},"Required (hrs.)",null,null,null,null,null,null,null,null,null,null,null,null,null,null,"Year",null,{"$f":"T21","v":0},null,null,{"$f":"IF(Vacancy!$AA$10=\"None required\",0,IF(Vacancy!$AA$10=\"\",\"\",Vacancy!$AA$10))","v":""},"Required Exp."]
[]
[null,null,null,{"$f":"E23-E21","v":{"$error":"#VALUE!"}},null,"Relevant training hrs. acquired",null,null,null,null,null,null,null,null,null,null,null,null,null,null,"Month",null,{"$f":"T23/12","v":0},null,{"$f":"Z23-Z21","v":{"$error":"#VALUE!"}},{"$f":"SUM(W21,W23,W25)","v":0},"Relevant years of experience"]
[]
[null,null,null,null,{"$f":"IF(N3=\"\",0,IFERROR(IF(E21=E23,5,IF(E23>=E21,((5*D23)/Trg_Exp!$D$2)+5,0)),0))","v":0},"Total",null,null,null,null,null,null,null,null,null,null,null,null,null,null,"Day",null,{"$f":"T25/365","v":0},null,{"$f":"IFERROR(IF(AND(Z21=Z23),10,IF(Vacancy!E6=\"Executive/Managerial\",((10*Y23)/Trg_Exp!$K$2),IF(Z23>=Z21,((15*Y23)/Trg_Exp!$K$2)+10,0))),0)","v":0},{"$f":"IF(N3=\"\",0,IF(Y25<0,0,Y25))","v":0},"Total Score:"]
[]
[null,null,{"$f":"IF(Vacancy!E6=\"Second Level\",\"E. Accomplishment (15 pts.)\",\"E. Accomplishment (10 pts.)\")","v":"E. Accomplishment (10 pts.)"}]
[]
[null,null,null,null,"E.1  Awards/Citations/Commendations"]
[]
[false,null,null,null,"E.1.1. Unit Level",null,null,null,null,{"$f":"IF(A31=TRUE,1,\"\")","v":""}]
[]
[false,null,null,null,"E.1.2. University Level",null,null,null,null,{"$f":"IF(A33=TRUE,3,\"\")","v":""}]
[]
[false,null,null,null,"E.1.3. National/CSC Level",null,null,null,null,{"$f":"IF(A35=TRUE,5,\"\")","v":""}]
[null,null,null,null,"E.2. Innovations/ Systems Improvement"]
[false,null,null,null,null,null,null,null,null,{"$f":"IF(A37=TRUE,IF(Vacancy!E6=\"Second Level\",4,3),\"\")","v":""}]
[null,null,null,null,null,null,null,null,null,null,{"$f":"IF(E3=\"Second Level\",((SUM(J31,J33,J35)*11)/9),((SUM(J31,J33,J35)*7)/9))","v":0}]
[]
[null,null,null,null,"C.2. Total Score:",null,null,null,null,{"$f":"IF(E3=\"Second Level\",(15*SUM(K38,J37)/15),(10*SUM(K38,J37)/10))","v":0}]
[]
[null,null,{"$f":"IF(E3=\"Executive/Managerial\",\"F. Physical Characteristics and Personality Traits (10 pts.)\",\"F. Physical Characteristics and Personality Traits (5 pts.)\")","v":"F. Physical Characteristics and Personality Traits (5 pts.)"}]
[]
[null,null,null,null,"Supervisor",null,"Co-worker 1",null,"Co-worker 2",null,"Co-worker 3",null,null,"Supervisor",null,"Co-worker 1",null,"Co-worker 2",null,"Co-worker 3",null,null,"Supervisor",null,"Co-worker 1",null,"Co-worker 2",null,"Co-worker 3"]
[null,null,null,null,"ATTITUDE",null,null,null,null,null,null,null,null,"COMMITMENT",null,null,null,null,null,null,null,null,"APPEARANCE"]
[null,null,null,"F.1.1. ",null,null,null,null,null,null,null,null,"F.2.1. ",null,null,null,null,null,null,null,null,"F.3.1. "]
[null,null,null,"F.1.2. ",null,null,null,null,null,null,null,null,"F.2.2. ",null,null,null,null,null,null,null,null,"F.3.2. "]
[null,null,null,"F.1.3. ",null,null,null,null,null,null,null,null,"F.2.3. "]
[null,null,null,null,{"$f":"IF($E$3=\"Executive/Managerial\",(4*(SUM(E46:F48)/12)),(2*(SUM(E46:F48)/12)))","v":0},null,{"$f":"IF($E$3=\"Executive/Managerial\",(4*(SUM(G46:H48)/12)),(2*(SUM(G46:H48)/12)))","v":0},null,{"$f":"IF($E$3=\"Executive/Managerial\",(4*(SUM(I46:J48)/12)),(2*(SUM(I46:J48)/12)))","v":0},null,{"$f":"IF($E$3=\"Executive/Managerial\",(4*(SUM(K46:L48)/12)),(2*(SUM(K46:L48)/12)))","v":0},null,null,{"$f":"IF($E$3=\"Executive/Managerial\",(4*(SUM(N46:O48)/12)),(2*(SUM(N46:O48)/12)))","v":0},null,{"$f":"IF($E$3=\"Executive/Managerial\",(4*(SUM(P46:Q48)/12)),(2*(SUM(P46:Q48)/12)))","v":0},null,{"$f":"IF($E$3=\"Executive/Managerial\",(4*(SUM(R46:S48)/12)),(2*(SUM(R46:S48)/12)))","v":0},null,{"$f":"IF($E$3=\"Executive/Managerial\",(4*(SUM(T46:U48)/12)),(2*(SUM(T46:U48)/12)))","v":0},null,null,{"$f":"IF($E$3=\"Executive/Managerial\",(2*(SUM(W46:X48))/8),(1*(SUM(W46:X48))/8))","v":0},null,{"$f":"IF($E$3=\"Executive/Managerial\",(2*(SUM(Y46:Z48))/8),(1*(SUM(Y46:Z48))/8))","v":0},null,{"$f":"IF($E$3=\"Executive/Managerial\",(2*(SUM(AA46:AB48))/8),(1*(SUM(AA46:AB48))/8))","v":0},null,{"$f":"IF($E$3=\"Executive/Managerial\",(2*(SUM(AC46:AD48))/8),(1*(SUM(AC46:AD48))/8))","v":0}]
[null,null,null,null,null,null,"Supervisor",null,"Co-worker"]
[null,null,null,null,"Attitude",null,{"$f":"E49","v":0},null,{"$f":"SUM(G49:L49)/3","v":0},null,null,null,null,"Total Score PCPT:",null,null,{"$f":"IF(E3=\"Executive/Managerial\",SUM(G54:J54),SUM(G54:J54))","v":0}]
[null,null,null,null,"Commitment",null,{"$f":"N49","v":0},null,{"$f":"SUM(P49:U49)/3","v":0}]
[null,null,null,null,"Appearance",null,{"$f":"W49","v":0},null,{"$f":"SUM(Y49:AD49)/3","v":0}]
[null,null,null,null,null,null,{"$f":"SUM(G51:G53)*0.6","v":0},null,{"$f":"SUM(I51:I53)*0.4","v":0}]
[null,null,{"$f":"IF(E3=\"First Level\",\"G. Potential [Assessment Form No. 2] (3 pts.)\",\"G. Potential [Assessment Form No. 2] (5 pts.)\")","v":"G. Potential [Assessment Form No. 2] (5 pts.)"}]
[]
[null,null,null,"INTERVIEW"]
[]
[null,null,null,null,"G.1.1. Sound judgement",null,null,null,null,null,null,{"$f":"IF($E$3=\"First Level\",\"Not Applicable for First Level position\",\"\")","v":""}]
[null,null,null,null,"G.1.2. Analytical mind",null,null,null,null,null,null,{"$f":"IF($E$3=\"First Level\",\"Not Applicable for First Level position\",\"\")","v":""}]
[null,null,null,null,"G.1.3. The ability to motivate co-workers",null,null,null,null,null,null,{"$f":"IF($E$3=\"First Level\",\"Not Applicable for First Level position\",\"\")","v":""}]
[null,null,null,null,"G.1.4. Unifying Factor",null,null,null,null,null,null,{"$f":"IF($E$3=\"First Level\",\"Not Applicable for First Level position\",\"\")","v":""}]
[null,null,null,null,"G.1.5. Vision/foresight",null,null,null,null,null,null,{"$f":"IF($E$3=\"First Level\",\"Not Applicable for First Level position\",\"\")","v":""}]
[null,null,null,null,"G.2. Resourcefulness"]
[null,null,null,null,"G.3. Creativity/ Ingenuity "]
[]
[null,null,null,"TOTAL POINTS FOR POTENTIAL",null,null,null,null,null,null,{"$f":"IF(E3=\"First Level\",(3*(SUM(K64:K65)/8)),(5*(SUM(K59:K65)/28)))","v":0}]
[]
[null,null,{"$f":"IF(E3=\"First Level\",\"H. Written/ Skills Examination (12 pts.)\",\"H. Written/ Skills Examination (15 pts.)\")","v":"H. Written/ Skills Examination (15 pts.)"}]
[null,null,null,null,null,null,null,null,null,null,{"$f":"IFERROR(SUM(K59:K65)/7,0)","v":0}]
[null,null,null,"WRITTEN/SKILLS EXAMINATION"]
[]
[null,null,null,null,"Perfect/Entire Score",null,null,"="]
[null,null,null,null,"Raw Score",null,null,"="]
[]
[]
[null,null,null,"TOTAL FOR EXAMINATION",null,null,null,null,null,null,{"$f":"IFERROR(IF(E3=\"First Level\",IF(K74>K73,0,(K74*12)/K73),IF(K74>K73,0,(K74*15)/K73)),0)","v":0}]
[]
[null,null,"I. Public Service"]
[]
[null,null,null,null,"Additional Pts. in excess of Total Score"]

{"sheet":"Educ_2","index":58,"n_rows":26,"n_cols":17,"rows_kept":26,"cut":false,"hidden":true,"merged":[]}
[null,"Below Elementary","Elementary Graduate","Below High School","High School Graduate","Vocational","1st Year College < 72 Units","2nd Year College = 72 Units","3rd Year College > 72 Units","Bachelor's degree","Post Bac Diploma","6 Units in Master's","7 and above Units in Master's","With Units earned in Master's","Master's degree/C-Pro or its Equivalent","With Units earned in PhD/Doctoral","PhD/Doctoral degree"]
["Below Elementary",5,7,9,11,13,15,15,15,15,15,15,15]
["Elementary Graduate",null,5,7,9,11,13,15,15,15,15,15,15]
["High School Graduate",null,null,null,5,7,9,11,13,15,15,15,15]
["Vocational",null,null,null,null,5,7,9,11,13,15,15,15]
["2 years studies in College",null,null,null,null,null,null,5,7,9,11,13,15]
["Bachelor's degree",null,null,null,null,null,null,null,null,5,6,0,0,7,8,9,10]
["Master's degree",null,null,null,null,null,null,null,null,null,null,null,null,null,3,4,5]
[]
[]
["Below Elementary",1]
["Elementary Graduate",2]
["Below High School",3]
["High School Graduate",4]
["Vocational",5]
["1st Year College < 72 Units",6]
["2nd Year College = 72 Units",7]
["3rd Year College > 72 Units",8]
["Bachelor's degree",9]
["Post Bac Diploma",10]
["6 Units in Master's",11]
["7 and above Units in Master's",12]
["With Units earned in Master's",13]
["Master's degree/C-Pro or its Equivalent",14]
["With Units earned in PhD/Doctoral",15]
["PhD/Doctoral degree",16]

{"sheet":"Highest_#","index":59,"n_rows":4,"n_cols":5,"rows_kept":4,"cut":false,"hidden":true,"merged":[]}
["Applicant","Experience","Ranking","Training","Ranking"]
[{"$f":"#REF!","v":{"$error":"#REF!"}},{"$f":"#REF!","v":{"$error":"#REF!"}},null,{"$f":"#REF!","v":{"$error":"#REF!"}}]
[{"$f":"#REF!","v":{"$error":"#REF!"}},{"$f":"#REF!","v":{"$error":"#REF!"}},null,{"$f":"#REF!","v":{"$error":"#REF!"}}]
[{"$f":"#REF!","v":{"$error":"#REF!"}},{"$f":"#REF!","v":{"$error":"#REF!"}},null,{"$f":"#REF!","v":{"$error":"#REF!"}}]

{"sheet":"Trg_Exp","index":60,"n_rows":55,"n_cols":14,"rows_kept":55,"cut":false,"hidden":true,"merged":[[2,11,4,11],[2,10,4,10],[2,3,4,3],[2,4,4,4],[0,1,0,4],[1,3,1,4],[0,8,0,11],[1,8,1,9],[2,1,4,1],[2,2,4,2],[1,1,1,2],[1,10,1,11],[2,8,4,8],[2,9,4,9]]}
[null,"Highest",null,null,null,null,null,null,"Highest"]
[null,{"$f":"VLOOKUP(1,$E$6:$G$55,3,FALSE)","v":{"$error":"#N/A"}},null,{"$f":"VLOOKUP(1,$E$6:$G$55,2,FALSE)","v":{"$error":"#N/A"}},null,null,null,null,{"$f":"VLOOKUP(1,$L$6:$N$55,3,FALSE)","v":{"$error":"#N/A"}},null,{"$f":"VLOOKUP(1,$L$6:$N$55,2,FALSE)","v":{"$error":"#N/A"}}]
[null,"#","NAME","Hrs","RANK",null,null,null,"#","NAME","Yrs","RANK"]
[]
[]
[{"$f":"E6","v":{"$error":"#VALUE!"}},1,{"$f":"'AP1'!N3","v":0},{"$f":"'AP1'!D23","v":{"$error":"#VALUE!"}},{"$f":"SUMPRODUCT((D6<$D$6:$D$55)/COUNTIF($D$6:$D$55,$D$6:$D$55))+1","v":{"$error":"#VALUE!"}},{"$f":"D6","v":{"$error":"#VALUE!"}},{"$f":"C6","v":0},null,1,{"$f":"'AP1'!N3","v":0},{"$f":"'AP1'!Y23","v":{"$error":"#VALUE!"}},{"$f":"SUMPRODUCT((K6<$K$6:$K$55)/COUNTIF($K$6:$K$55,$K$6:$K$55))+1","v":{"$error":"#VALUE!"}},{"$f":"K6","v":{"$error":"#VALUE!"}},{"$f":"J6","v":0}]
[{"$f":"E7","v":{"$error":"#VALUE!"}},2,{"$f":"'AP2'!N3","v":0},{"$f":"'AP2'!D23","v":{"$error":"#VALUE!"}},{"$f":"SUMPRODUCT((D7<$D$6:$D$55)/COUNTIF($D$6:$D$55,$D$6:$D$55))+1","v":{"$error":"#VALUE!"}},{"$f":"D7","v":{"$error":"#VALUE!"}},{"$f":"C7","v":0},null,2,{"$f":"'AP2'!N3","v":0},{"$f":"'AP2'!Y23","v":{"$error":"#VALUE!"}},{"$f":"SUMPRODUCT((K7<$K$6:$K$55)/COUNTIF($K$6:$K$55,$K$6:$K$55))+1","v":{"$error":"#VALUE!"}},{"$f":"K7","v":{"$error":"#VALUE!"}},{"$f":"J7","v":0}]
[{"$error":"#VALUE!"},3,{"$f":"'AP3'!N3","v":0},{"$f":"'AP3'!D23","v":{"$error":"#VALUE!"}},{"$f":"SUMPRODUCT((D8<$D$6:$D$55)/COUNTIF($D$6:$D$55,$D$6:$D$55))+1","v":{"$error":"#VALUE!"}},{"$error":"#VALUE!"},0,null,3,{"$f":"'AP3'!N3","v":0},{"$f":"'AP3'!Y23","v":{"$error":"#VALUE!"}},{"$f":"SUMPRODUCT((K8<$K$6:$K$55)/COUNTIF($K$6:$K$55,$K$6:$K$55))+1","v":{"$error":"#VALUE!"}},{"$error":"#VALUE!"},0]
[{"$error":"#VALUE!"},4,{"$f":"'AP4'!N3","v":0},{"$f":"'AP4'!D23","v":{"$error":"#VALUE!"}},{"$f":"SUMPRODUCT((D9<$D$6:$D$55)/COUNTIF($D$6:$D$55,$D$6:$D$55))+1","v":{"$error":"#VALUE!"}},{"$error":"#VALUE!"},0,null,4,{"$f":"'AP4'!N3","v":0},{"$f":"'AP4'!Y23","v":{"$error":"#VALUE!"}},{"$f":"SUMPRODUCT((K9<$K$6:$K$55)/COUNTIF($K$6:$K$55,$K$6:$K$55))+1","v":{"$error":"#VALUE!"}},{"$error":"#VALUE!"},0]
[{"$error":"#VALUE!"},5,{"$f":"'AP5'!N3","v":0},{"$f":"'AP5'!D23","v":{"$error":"#VALUE!"}},{"$f":"SUMPRODUCT((D10<$D$6:$D$55)/COUNTIF($D$6:$D$55,$D$6:$D$55))+1","v":{"$error":"#VALUE!"}},{"$error":"#VALUE!"},0,null,5,{"$f":"'AP5'!N3","v":0},{"$f":"'AP5'!Y23","v":{"$error":"#VALUE!"}},{"$f":"SUMPRODUCT((K10<$K$6:$K$55)/COUNTIF($K$6:$K$55,$K$6:$K$55))+1","v":{"$error":"#VALUE!"}},{"$error":"#VALUE!"},0]
[null,6,{"$f":"'AP6'!N3","v":0},{"$f":"'AP6'!D23","v":{"$error":"#VALUE!"}},{"$f":"SUMPRODUCT((D11<$D$6:$D$55)/COUNTIF($D$6:$D$55,$D$6:$D$55))+1","v":{"$error":"#VALUE!"}},{"$f":"D11","v":{"$error":"#VALUE!"}},{"$f":"C11","v":0},null,6,{"$f":"'AP6'!N3","v":0},{"$f":"'AP6'!Y23","v":{"$error":"#VALUE!"}},{"$f":"SUMPRODUCT((K11<$K$6:$K$55)/COUNTIF($K$6:$K$55,$K$6:$K$55))+1","v":{"$error":"#VALUE!"}},{"$f":"K11","v":{"$error":"#VALUE!"}},{"$f":"J11","v":0}]
[null,7,{"$f":"'AP7'!N3","v":0},{"$f":"'AP7'!D23","v":{"$error":"#VALUE!"}},{"$f":"SUMPRODUCT((D12<$D$6:$D$55)/COUNTIF($D$6:$D$55,$D$6:$D$55))+1","v":{"$error":"#VALUE!"}},{"$error":"#VALUE!"},0,null,7,{"$f":"'AP7'!N3","v":0},{"$f":"'AP7'!Y23","v":{"$error":"#VALUE!"}},{"$f":"SUMPRODUCT((K12<$K$6:$K$55)/COUNTIF($K$6:$K$55,$K$6:$K$55))+1","v":{"$error":"#VALUE!"}},{"$error":"#VALUE!"},0]
[null,8,{"$f":"'AP8'!N3","v":0},{"$f":"'AP8'!D23","v":{"$error":"#VALUE!"}},{"$f":"SUMPRODUCT((D13<$D$6:$D$55)/COUNTIF($D$6:$D$55,$D$6:$D$55))+1","v":{"$error":"#VALUE!"}},{"$error":"#VALUE!"},0,null,8,{"$f":"'AP8'!N3","v":0},{"$f":"'AP8'!Y23","v":{"$error":"#VALUE!"}},{"$f":"SUMPRODUCT((K13<$K$6:$K$55)/COUNTIF($K$6:$K$55,$K$6:$K$55))+1","v":{"$error":"#VALUE!"}},{"$error":"#VALUE!"},0]
[null,9,{"$f":"'AP9'!N3","v":0},{"$f":"'AP9'!D23","v":{"$error":"#VALUE!"}},{"$f":"SUMPRODUCT((D14<$D$6:$D$55)/COUNTIF($D$6:$D$55,$D$6:$D$55))+1","v":{"$error":"#VALUE!"}},{"$error":"#VALUE!"},0,null,9,{"$f":"'AP9'!N3","v":0},{"$f":"'AP9'!Y23","v":{"$error":"#VALUE!"}},{"$f":"SUMPRODUCT((K14<$K$6:$K$55)/COUNTIF($K$6:$K$55,$K$6:$K$55))+1","v":{"$error":"#VALUE!"}},{"$error":"#VALUE!"},0]
[null,10,{"$f":"'AP10'!$N$3","v":0},{"$f":"'AP10'!$D$23","v":{"$error":"#VALUE!"}},{"$f":"SUMPRODUCT((D15<$D$6:$D$55)/COUNTIF($D$6:$D$55,$D$6:$D$55))+1","v":{"$error":"#VALUE!"}},{"$error":"#VALUE!"},0,null,10,{"$f":"'AP10'!$N$3","v":0},{"$f":"'AP10'!$Y$23","v":{"$error":"#VALUE!"}},{"$f":"SUMPRODUCT((K15<$K$6:$K$55)/COUNTIF($K$6:$K$55,$K$6:$K$55))+1","v":{"$error":"#VALUE!"}},{"$error":"#VALUE!"},0]
[null,11,{"$f":"'AP11'!$N$3","v":0},{"$f":"'AP11'!$D$23","v":{"$error":"#VALUE!"}},{"$f":"SUMPRODUCT((D16<$D$6:$D$55)/COUNTIF($D$6:$D$55,$D$6:$D$55))+1","v":{"$error":"#VALUE!"}},{"$error":"#VALUE!"},0,null,11,{"$f":"'AP11'!$N$3","v":0},{"$f":"'AP11'!$Y$23","v":{"$error":"#VALUE!"}},{"$f":"SUMPRODUCT((K16<$K$6:$K$55)/COUNTIF($K$6:$K$55,$K$6:$K$55))+1","v":{"$error":"#VALUE!"}},{"$error":"#VALUE!"},0]
[null,12,{"$f":"'AP12'!$N$3","v":0},{"$f":"'AP12'!$D$23","v":{"$error":"#VALUE!"}},{"$f":"SUMPRODUCT((D17<$D$6:$D$55)/COUNTIF($D$6:$D$55,$D$6:$D$55))+1","v":{"$error":"#VALUE!"}},{"$error":"#VALUE!"},0,null,12,{"$f":"'AP12'!$N$3","v":0},{"$f":"'AP12'!$Y$23","v":{"$error":"#VALUE!"}},{"$f":"SUMPRODUCT((K17<$K$6:$K$55)/COUNTIF($K$6:$K$55,$K$6:$K$55))+1","v":{"$error":"#VALUE!"}},{"$error":"#VALUE!"},0]
[null,13,{"$f":"'AP13'!$N$3","v":0},{"$f":"'AP13'!$D$23","v":{"$error":"#VALUE!"}},{"$f":"SUMPRODUCT((D18<$D$6:$D$55)/COUNTIF($D$6:$D$55,$D$6:$D$55))+1","v":{"$error":"#VALUE!"}},{"$error":"#VALUE!"},0,null,13,{"$f":"'AP13'!$N$3","v":0},{"$f":"'AP13'!$Y$23","v":{"$error":"#VALUE!"}},{"$f":"SUMPRODUCT((K18<$K$6:$K$55)/COUNTIF($K$6:$K$55,$K$6:$K$55))+1","v":{"$error":"#VALUE!"}},{"$error":"#VALUE!"},0]
[null,14,{"$f":"'AP14'!$N$3","v":0},{"$f":"'AP14'!$D$23","v":{"$error":"#VALUE!"}},{"$f":"SUMPRODUCT((D19<$D$6:$D$55)/COUNTIF($D$6:$D$55,$D$6:$D$55))+1","v":{"$error":"#VALUE!"}},{"$error":"#VALUE!"},0,null,14,{"$f":"'AP14'!$N$3","v":0},{"$f":"'AP14'!$Y$23","v":{"$error":"#VALUE!"}},{"$f":"SUMPRODUCT((K19<$K$6:$K$55)/COUNTIF($K$6:$K$55,$K$6:$K$55))+1","v":{"$error":"#VALUE!"}},{"$error":"#VALUE!"},0]
[null,15,{"$f":"'AP15'!$N$3","v":0},{"$f":"'AP15'!$D$23","v":{"$error":"#VALUE!"}},{"$f":"SUMPRODUCT((D20<$D$6:$D$55)/COUNTIF($D$6:$D$55,$D$6:$D$55))+1","v":{"$error":"#VALUE!"}},{"$error":"#VALUE!"},0,null,15,{"$f":"'AP15'!$N$3","v":0},{"$f":"'AP15'!$Y$23","v":{"$error":"#VALUE!"}},{"$f":"SUMPRODUCT((K20<$K$6:$K$55)/COUNTIF($K$6:$K$55,$K$6:$K$55))+1","v":{"$error":"#VALUE!"}},{"$error":"#VALUE!"},0]
[null,16,{"$f":"'AP16'!$N$3","v":0},{"$f":"'AP16'!$D$23","v":{"$error":"#VALUE!"}},{"$f":"SUMPRODUCT((D21<$D$6:$D$55)/COUNTIF($D$6:$D$55,$D$6:$D$55))+1","v":{"$error":"#VALUE!"}},{"$error":"#VALUE!"},0,null,16,{"$f":"'AP16'!$N$3","v":0},{"$f":"'AP16'!$Y$23","v":{"$error":"#VALUE!"}},{"$f":"SUMPRODUCT((K21<$K$6:$K$55)/COUNTIF($K$6:$K$55,$K$6:$K$55))+1","v":{"$error":"#VALUE!"}},{"$error":"#VALUE!"},0]
[null,17,{"$f":"'AP17'!$N$3","v":0},{"$f":"'AP17'!$D$23","v":{"$error":"#VALUE!"}},{"$f":"SUMPRODUCT((D22<$D$6:$D$55)/COUNTIF($D$6:$D$55,$D$6:$D$55))+1","v":{"$error":"#VALUE!"}},{"$error":"#VALUE!"},0,null,17,{"$f":"'AP17'!$N$3","v":0},{"$f":"'AP17'!$Y$23","v":{"$error":"#VALUE!"}},{"$f":"SUMPRODUCT((K22<$K$6:$K$55)/COUNTIF($K$6:$K$55,$K$6:$K$55))+1","v":{"$error":"#VALUE!"}},{"$error":"#VALUE!"},0]
[null,18,{"$f":"'AP18'!$N$3","v":0},{"$f":"'AP18'!$D$23","v":{"$error":"#VALUE!"}},{"$f":"SUMPRODUCT((D23<$D$6:$D$55)/COUNTIF($D$6:$D$55,$D$6:$D$55))+1","v":{"$error":"#VALUE!"}},{"$error":"#VALUE!"},0,null,18,{"$f":"'AP18'!$N$3","v":0},{"$f":"'AP18'!$Y$23","v":{"$error":"#VALUE!"}},{"$f":"SUMPRODUCT((K23<$K$6:$K$55)/COUNTIF($K$6:$K$55,$K$6:$K$55))+1","v":{"$error":"#VALUE!"}},{"$error":"#VALUE!"},0]
[null,19,{"$f":"'AP19'!$N$3","v":0},{"$f":"'AP19'!$D$23","v":{"$error":"#VALUE!"}},{"$f":"SUMPRODUCT((D24<$D$6:$D$55)/COUNTIF($D$6:$D$55,$D$6:$D$55))+1","v":{"$error":"#VALUE!"}},{"$error":"#VALUE!"},0,null,19,{"$f":"'AP19'!$N$3","v":0},{"$f":"'AP19'!$Y$23","v":{"$error":"#VALUE!"}},{"$f":"SUMPRODUCT((K24<$K$6:$K$55)/COUNTIF($K$6:$K$55,$K$6:$K$55))+1","v":{"$error":"#VALUE!"}},{"$error":"#VALUE!"},0]
[null,20,{"$f":"'AP20'!$N$3","v":0},{"$f":"'AP20'!$D$23","v":{"$error":"#VALUE!"}},{"$f":"SUMPRODUCT((D25<$D$6:$D$55)/COUNTIF($D$6:$D$55,$D$6:$D$55))+1","v":{"$error":"#VALUE!"}},{"$error":"#VALUE!"},0,null,20,{"$f":"'AP20'!$N$3","v":0},{"$f":"'AP20'!$Y$23","v":{"$error":"#VALUE!"}},{"$f":"SUMPRODUCT((K25<$K$6:$K$55)/COUNTIF($K$6:$K$55,$K$6:$K$55))+1","v":{"$error":"#VALUE!"}},{"$error":"#VALUE!"},0]
[null,21,{"$f":"'AP21'!$N$3","v":0},{"$f":"'AP21'!$D$23","v":{"$error":"#VALUE!"}},{"$f":"SUMPRODUCT((D26<$D$6:$D$55)/COUNTIF($D$6:$D$55,$D$6:$D$55))+1","v":{"$error":"#VALUE!"}},{"$error":"#VALUE!"},0,null,21,{"$f":"'AP21'!$N$3","v":0},{"$f":"'AP21'!$Y$23","v":{"$error":"#VALUE!"}},{"$f":"SUMPRODUCT((K26<$K$6:$K$55)/COUNTIF($K$6:$K$55,$K$6:$K$55))+1","v":{"$error":"#VALUE!"}},{"$error":"#VALUE!"},0]
[null,22,{"$f":"'AP22'!$N$3","v":0},{"$f":"'AP22'!$D$23","v":{"$error":"#VALUE!"}},{"$f":"SUMPRODUCT((D27<$D$6:$D$55)/COUNTIF($D$6:$D$55,$D$6:$D$55))+1","v":{"$error":"#VALUE!"}},{"$error":"#VALUE!"},0,null,22,{"$f":"'AP22'!$N$3","v":0},{"$f":"'AP22'!$Y$23","v":{"$error":"#VALUE!"}},{"$f":"SUMPRODUCT((K27<$K$6:$K$55)/COUNTIF($K$6:$K$55,$K$6:$K$55))+1","v":{"$error":"#VALUE!"}},{"$error":"#VALUE!"},0]
[null,23,{"$f":"'AP23'!$N$3","v":0},{"$f":"'AP23'!$D$23","v":{"$error":"#VALUE!"}},{"$f":"SUMPRODUCT((D28<$D$6:$D$55)/COUNTIF($D$6:$D$55,$D$6:$D$55))+1","v":{"$error":"#VALUE!"}},{"$error":"#VALUE!"},0,null,23,{"$f":"'AP23'!$N$3","v":0},{"$f":"'AP23'!$Y$23","v":{"$error":"#VALUE!"}},{"$f":"SUMPRODUCT((K28<$K$6:$K$55)/COUNTIF($K$6:$K$55,$K$6:$K$55))+1","v":{"$error":"#VALUE!"}},{"$error":"#VALUE!"},0]
[null,24,{"$f":"'AP24'!$N$3","v":0},{"$f":"'AP24'!$D$23","v":{"$error":"#VALUE!"}},{"$f":"SUMPRODUCT((D29<$D$6:$D$55)/COUNTIF($D$6:$D$55,$D$6:$D$55))+1","v":{"$error":"#VALUE!"}},{"$error":"#VALUE!"},0,null,24,{"$f":"'AP24'!$N$3","v":0},{"$f":"'AP24'!$Y$23","v":{"$error":"#VALUE!"}},{"$f":"SUMPRODUCT((K29<$K$6:$K$55)/COUNTIF($K$6:$K$55,$K$6:$K$55))+1","v":{"$error":"#VALUE!"}},{"$error":"#VALUE!"},0]
[null,25,{"$f":"'AP25'!$N$3","v":0},{"$f":"'AP25'!$D$23","v":{"$error":"#VALUE!"}},{"$f":"SUMPRODUCT((D30<$D$6:$D$55)/COUNTIF($D$6:$D$55,$D$6:$D$55))+1","v":{"$error":"#VALUE!"}},{"$error":"#VALUE!"},0,null,25,{"$f":"'AP25'!$N$3","v":0},{"$f":"'AP25'!$Y$23","v":{"$error":"#VALUE!"}},{"$f":"SUMPRODUCT((K30<$K$6:$K$55)/COUNTIF($K$6:$K$55,$K$6:$K$55))+1","v":{"$error":"#VALUE!"}},{"$error":"#VALUE!"},0]
[null,26,{"$f":"'AP26'!$N$3","v":0},{"$f":"'AP26'!$D$23","v":{"$error":"#VALUE!"}},{"$f":"SUMPRODUCT((D31<$D$6:$D$55)/COUNTIF($D$6:$D$55,$D$6:$D$55))+1","v":{"$error":"#VALUE!"}},{"$error":"#VALUE!"},0,null,26,{"$f":"'AP26'!$N$3","v":0},{"$f":"'AP26'!$Y$23","v":{"$error":"#VALUE!"}},{"$f":"SUMPRODUCT((K31<$K$6:$K$55)/COUNTIF($K$6:$K$55,$K$6:$K$55))+1","v":{"$error":"#VALUE!"}},{"$error":"#VALUE!"},0]
[null,27,{"$f":"'AP27'!$N$3","v":0},{"$f":"'AP27'!$D$23","v":{"$error":"#VALUE!"}},{"$f":"SUMPRODUCT((D32<$D$6:$D$55)/COUNTIF($D$6:$D$55,$D$6:$D$55))+1","v":{"$error":"#VALUE!"}},{"$error":"#VALUE!"},0,null,27,{"$f":"'AP27'!$N$3","v":0},{"$f":"'AP27'!$Y$23","v":{"$error":"#VALUE!"}},{"$f":"SUMPRODUCT((K32<$K$6:$K$55)/COUNTIF($K$6:$K$55,$K$6:$K$55))+1","v":{"$error":"#VALUE!"}},{"$error":"#VALUE!"},0]
[null,28,{"$f":"'AP28'!$N$3","v":0},{"$f":"'AP28'!$D$23","v":{"$error":"#VALUE!"}},{"$f":"SUMPRODUCT((D33<$D$6:$D$55)/COUNTIF($D$6:$D$55,$D$6:$D$55))+1","v":{"$error":"#VALUE!"}},{"$error":"#VALUE!"},0,null,28,{"$f":"'AP28'!$N$3","v":0},{"$f":"'AP28'!$Y$23","v":{"$error":"#VALUE!"}},{"$f":"SUMPRODUCT((K33<$K$6:$K$55)/COUNTIF($K$6:$K$55,$K$6:$K$55))+1","v":{"$error":"#VALUE!"}},{"$error":"#VALUE!"},0]
[null,29,{"$f":"'AP29'!$N$3","v":0},{"$f":"'AP29'!$D$23","v":{"$error":"#VALUE!"}},{"$f":"SUMPRODUCT((D34<$D$6:$D$55)/COUNTIF($D$6:$D$55,$D$6:$D$55))+1","v":{"$error":"#VALUE!"}},{"$error":"#VALUE!"},0,null,29,{"$f":"'AP29'!$N$3","v":0},{"$f":"'AP29'!$Y$23","v":{"$error":"#VALUE!"}},{"$f":"SUMPRODUCT((K34<$K$6:$K$55)/COUNTIF($K$6:$K$55,$K$6:$K$55))+1","v":{"$error":"#VALUE!"}},{"$error":"#VALUE!"},0]
[null,30,{"$f":"'AP30'!$N$3","v":0},{"$f":"'AP30'!$D$23","v":{"$error":"#VALUE!"}},{"$f":"SUMPRODUCT((D35<$D$6:$D$55)/COUNTIF($D$6:$D$55,$D$6:$D$55))+1","v":{"$error":"#VALUE!"}},{"$error":"#VALUE!"},0,null,30,{"$f":"'AP30'!$N$3","v":0},{"$f":"'AP30'!$Y$23","v":{"$error":"#VALUE!"}},{"$f":"SUMPRODUCT((K35<$K$6:$K$55)/COUNTIF($K$6:$K$55,$K$6:$K$55))+1","v":{"$error":"#VALUE!"}},{"$error":"#VALUE!"},0]
[null,31,{"$f":"'AP31'!$N$3","v":0},{"$f":"'AP31'!$D$23","v":{"$error":"#VALUE!"}},{"$f":"SUMPRODUCT((D36<$D$6:$D$55)/COUNTIF($D$6:$D$55,$D$6:$D$55))+1","v":{"$error":"#VALUE!"}},{"$error":"#VALUE!"},0,null,31,{"$f":"'AP31'!$N$3","v":0},{"$f":"'AP31'!$Y$23","v":{"$error":"#VALUE!"}},{"$f":"SUMPRODUCT((K36<$K$6:$K$55)/COUNTIF($K$6:$K$55,$K$6:$K$55))+1","v":{"$error":"#VALUE!"}},{"$error":"#VALUE!"},0]
[null,32,{"$f":"'AP32'!$N$3","v":0},{"$f":"'AP32'!$D$23","v":{"$error":"#VALUE!"}},{"$f":"SUMPRODUCT((D37<$D$6:$D$55)/COUNTIF($D$6:$D$55,$D$6:$D$55))+1","v":{"$error":"#VALUE!"}},{"$error":"#VALUE!"},0,null,32,{"$f":"'AP32'!$N$3","v":0},{"$f":"'AP32'!$Y$23","v":{"$error":"#VALUE!"}},{"$f":"SUMPRODUCT((K37<$K$6:$K$55)/COUNTIF($K$6:$K$55,$K$6:$K$55))+1","v":{"$error":"#VALUE!"}},{"$error":"#VALUE!"},0]
[null,33,{"$f":"'AP33'!$N$3","v":0},{"$f":"'AP33'!$D$23","v":{"$error":"#VALUE!"}},{"$f":"SUMPRODUCT((D38<$D$6:$D$55)/COUNTIF($D$6:$D$55,$D$6:$D$55))+1","v":{"$error":"#VALUE!"}},{"$error":"#VALUE!"},0,null,33,{"$f":"'AP33'!$N$3","v":0},{"$f":"'AP33'!$Y$23","v":{"$error":"#VALUE!"}},{"$f":"SUMPRODUCT((K38<$K$6:$K$55)/COUNTIF($K$6:$K$55,$K$6:$K$55))+1","v":{"$error":"#VALUE!"}},{"$error":"#VALUE!"},0]
[null,34,{"$f":"'AP34'!$N$3","v":0},{"$f":"'AP34'!$D$23","v":{"$error":"#VALUE!"}},{"$f":"SUMPRODUCT((D39<$D$6:$D$55)/COUNTIF($D$6:$D$55,$D$6:$D$55))+1","v":{"$error":"#VALUE!"}},{"$error":"#VALUE!"},0,null,34,{"$f":"'AP34'!$N$3","v":0},{"$f":"'AP34'!$Y$23","v":{"$error":"#VALUE!"}},{"$f":"SUMPRODUCT((K39<$K$6:$K$55)/COUNTIF($K$6:$K$55,$K$6:$K$55))+1","v":{"$error":"#VALUE!"}},{"$error":"#VALUE!"},0]
[null,35,{"$f":"'AP35'!$N$3","v":0},{"$f":"'AP35'!$D$23","v":{"$error":"#VALUE!"}},{"$f":"SUMPRODUCT((D40<$D$6:$D$55)/COUNTIF($D$6:$D$55,$D$6:$D$55))+1","v":{"$error":"#VALUE!"}},{"$error":"#VALUE!"},0,null,35,{"$f":"'AP35'!$N$3","v":0},{"$f":"'AP35'!$Y$23","v":{"$error":"#VALUE!"}},{"$f":"SUMPRODUCT((K40<$K$6:$K$55)/COUNTIF($K$6:$K$55,$K$6:$K$55))+1","v":{"$error":"#VALUE!"}},{"$error":"#VALUE!"},0]
[null,36,{"$f":"'AP36'!$N$3","v":0},{"$f":"'AP36'!$D$23","v":{"$error":"#VALUE!"}},{"$f":"SUMPRODUCT((D41<$D$6:$D$55)/COUNTIF($D$6:$D$55,$D$6:$D$55))+1","v":{"$error":"#VALUE!"}},{"$error":"#VALUE!"},0,null,36,{"$f":"'AP36'!$N$3","v":0},{"$f":"'AP36'!$Y$23","v":{"$error":"#VALUE!"}},{"$f":"SUMPRODUCT((K41<$K$6:$K$55)/COUNTIF($K$6:$K$55,$K$6:$K$55))+1","v":{"$error":"#VALUE!"}},{"$error":"#VALUE!"},0]
[null,37,{"$f":"'AP37'!$N$3","v":0},{"$f":"'AP37'!$D$23","v":{"$error":"#VALUE!"}},{"$f":"SUMPRODUCT((D42<$D$6:$D$55)/COUNTIF($D$6:$D$55,$D$6:$D$55))+1","v":{"$error":"#VALUE!"}},{"$error":"#VALUE!"},0,null,37,{"$f":"'AP37'!$N$3","v":0},{"$f":"'AP37'!$Y$23","v":{"$error":"#VALUE!"}},{"$f":"SUMPRODUCT((K42<$K$6:$K$55)/COUNTIF($K$6:$K$55,$K$6:$K$55))+1","v":{"$error":"#VALUE!"}},{"$error":"#VALUE!"},0]
[null,38,{"$f":"'AP38'!$N$3","v":0},{"$f":"'AP38'!$D$23","v":{"$error":"#VALUE!"}},{"$f":"SUMPRODUCT((D43<$D$6:$D$55)/COUNTIF($D$6:$D$55,$D$6:$D$55))+1","v":{"$error":"#VALUE!"}},{"$error":"#VALUE!"},0,null,38,{"$f":"'AP38'!$N$3","v":0},{"$f":"'AP38'!$Y$23","v":{"$error":"#VALUE!"}},{"$f":"SUMPRODUCT((K43<$K$6:$K$55)/COUNTIF($K$6:$K$55,$K$6:$K$55))+1","v":{"$error":"#VALUE!"}},{"$error":"#VALUE!"},0]
[null,39,{"$f":"'AP39'!$N$3","v":0},{"$f":"'AP39'!$D$23","v":{"$error":"#VALUE!"}},{"$f":"SUMPRODUCT((D44<$D$6:$D$55)/COUNTIF($D$6:$D$55,$D$6:$D$55))+1","v":{"$error":"#VALUE!"}},{"$error":"#VALUE!"},0,null,39,{"$f":"'AP39'!$N$3","v":0},{"$f":"'AP39'!$Y$23","v":{"$error":"#VALUE!"}},{"$f":"SUMPRODUCT((K44<$K$6:$K$55)/COUNTIF($K$6:$K$55,$K$6:$K$55))+1","v":{"$error":"#VALUE!"}},{"$error":"#VALUE!"},0]
[null,40,{"$f":"'AP40'!$N$3","v":0},{"$f":"'AP40'!$D$23","v":{"$error":"#VALUE!"}},{"$f":"SUMPRODUCT((D45<$D$6:$D$55)/COUNTIF($D$6:$D$55,$D$6:$D$55))+1","v":{"$error":"#VALUE!"}},{"$error":"#VALUE!"},0,null,40,{"$f":"'AP40'!$N$3","v":0},{"$f":"'AP40'!$Y$23","v":{"$error":"#VALUE!"}},{"$f":"SUMPRODUCT((K45<$K$6:$K$55)/COUNTIF($K$6:$K$55,$K$6:$K$55))+1","v":{"$error":"#VALUE!"}},{"$error":"#VALUE!"},0]
[null,41,{"$f":"'AP41'!$N$3","v":0},{"$f":"'AP41'!$D$23","v":{"$error":"#VALUE!"}},{"$f":"SUMPRODUCT((D46<$D$6:$D$55)/COUNTIF($D$6:$D$55,$D$6:$D$55))+1","v":{"$error":"#VALUE!"}},{"$error":"#VALUE!"},0,null,41,{"$f":"'AP41'!$N$3","v":0},{"$f":"'AP41'!$Y$23","v":{"$error":"#VALUE!"}},{"$f":"SUMPRODUCT((K46<$K$6:$K$55)/COUNTIF($K$6:$K$55,$K$6:$K$55))+1","v":{"$error":"#VALUE!"}},{"$error":"#VALUE!"},0]
[null,42,{"$f":"'AP42'!$N$3","v":0},{"$f":"'AP42'!$D$23","v":{"$error":"#VALUE!"}},{"$f":"SUMPRODUCT((D47<$D$6:$D$55)/COUNTIF($D$6:$D$55,$D$6:$D$55))+1","v":{"$error":"#VALUE!"}},{"$error":"#VALUE!"},0,null,42,{"$f":"'AP42'!$N$3","v":0},{"$f":"'AP42'!$Y$23","v":{"$error":"#VALUE!"}},{"$f":"SUMPRODUCT((K47<$K$6:$K$55)/COUNTIF($K$6:$K$55,$K$6:$K$55))+1","v":{"$error":"#VALUE!"}},{"$error":"#VALUE!"},0]
[null,43,{"$f":"'AP43'!$N$3","v":0},{"$f":"'AP43'!$D$23","v":{"$error":"#VALUE!"}},{"$f":"SUMPRODUCT((D48<$D$6:$D$55)/COUNTIF($D$6:$D$55,$D$6:$D$55))+1","v":{"$error":"#VALUE!"}},{"$error":"#VALUE!"},0,null,43,{"$f":"'AP43'!$N$3","v":0},{"$f":"'AP43'!$Y$23","v":{"$error":"#VALUE!"}},{"$f":"SUMPRODUCT((K48<$K$6:$K$55)/COUNTIF($K$6:$K$55,$K$6:$K$55))+1","v":{"$error":"#VALUE!"}},{"$error":"#VALUE!"},0]
[null,44,{"$f":"'AP44'!$N$3","v":0},{"$f":"'AP44'!$D$23","v":{"$error":"#VALUE!"}},{"$f":"SUMPRODUCT((D49<$D$6:$D$55)/COUNTIF($D$6:$D$55,$D$6:$D$55))+1","v":{"$error":"#VALUE!"}},{"$error":"#VALUE!"},0,null,44,{"$f":"'AP44'!$N$3","v":0},{"$f":"'AP44'!$Y$23","v":{"$error":"#VALUE!"}},{"$f":"SUMPRODUCT((K49<$K$6:$K$55)/COUNTIF($K$6:$K$55,$K$6:$K$55))+1","v":{"$error":"#VALUE!"}},{"$error":"#VALUE!"},0]
[null,45,{"$f":"'AP45'!$N$3","v":0},{"$f":"'AP45'!$D$23","v":{"$error":"#VALUE!"}},{"$f":"SUMPRODUCT((D50<$D$6:$D$55)/COUNTIF($D$6:$D$55,$D$6:$D$55))+1","v":{"$error":"#VALUE!"}},{"$error":"#VALUE!"},0,null,45,{"$f":"'AP45'!$N$3","v":0},{"$f":"'AP45'!$Y$23","v":{"$error":"#VALUE!"}},{"$f":"SUMPRODUCT((K50<$K$6:$K$55)/COUNTIF($K$6:$K$55,$K$6:$K$55))+1","v":{"$error":"#VALUE!"}},{"$error":"#VALUE!"},0]
[null,46,{"$f":"'AP46'!$N$3","v":0},{"$f":"'AP46'!$D$23","v":{"$error":"#VALUE!"}},{"$f":"SUMPRODUCT((D51<$D$6:$D$55)/COUNTIF($D$6:$D$55,$D$6:$D$55))+1","v":{"$error":"#VALUE!"}},{"$error":"#VALUE!"},0,null,46,{"$f":"'AP46'!$N$3","v":0},{"$f":"'AP46'!$Y$23","v":{"$error":"#VALUE!"}},{"$f":"SUMPRODUCT((K51<$K$6:$K$55)/COUNTIF($K$6:$K$55,$K$6:$K$55))+1","v":{"$error":"#VALUE!"}},{"$error":"#VALUE!"},0]
[null,47,{"$f":"'AP47'!$N$3","v":0},{"$f":"'AP47'!$D$23","v":{"$error":"#VALUE!"}},{"$f":"SUMPRODUCT((D52<$D$6:$D$55)/COUNTIF($D$6:$D$55,$D$6:$D$55))+1","v":{"$error":"#VALUE!"}},{"$error":"#VALUE!"},0,null,47,{"$f":"'AP47'!$N$3","v":0},{"$f":"'AP47'!$Y$23","v":{"$error":"#VALUE!"}},{"$f":"SUMPRODUCT((K52<$K$6:$K$55)/COUNTIF($K$6:$K$55,$K$6:$K$55))+1","v":{"$error":"#VALUE!"}},{"$error":"#VALUE!"},0]
[null,48,{"$f":"'AP48'!$N$3","v":0},{"$f":"'AP48'!$D$23","v":{"$error":"#VALUE!"}},{"$f":"SUMPRODUCT((D53<$D$6:$D$55)/COUNTIF($D$6:$D$55,$D$6:$D$55))+1","v":{"$error":"#VALUE!"}},{"$error":"#VALUE!"},0,null,48,{"$f":"'AP48'!$N$3","v":0},{"$f":"'AP48'!$Y$23","v":{"$error":"#VALUE!"}},{"$f":"SUMPRODUCT((K53<$K$6:$K$55)/COUNTIF($K$6:$K$55,$K$6:$K$55))+1","v":{"$error":"#VALUE!"}},{"$error":"#VALUE!"},0]
[null,49,{"$f":"'AP49'!$N$3","v":0},{"$f":"'AP49'!$D$23","v":{"$error":"#VALUE!"}},{"$f":"SUMPRODUCT((D54<$D$6:$D$55)/COUNTIF($D$6:$D$55,$D$6:$D$55))+1","v":{"$error":"#VALUE!"}},{"$error":"#VALUE!"},0,null,49,{"$f":"'AP49'!$N$3","v":0},{"$f":"'AP49'!$Y$23","v":{"$error":"#VALUE!"}},{"$f":"SUMPRODUCT((K54<$K$6:$K$55)/COUNTIF($K$6:$K$55,$K$6:$K$55))+1","v":{"$error":"#VALUE!"}},{"$error":"#VALUE!"},0]
[null,50,{"$f":"'AP50'!$N$3","v":0},{"$f":"'AP50'!$D$23","v":{"$error":"#VALUE!"}},{"$f":"SUMPRODUCT((D55<$D$6:$D$55)/COUNTIF($D$6:$D$55,$D$6:$D$55))+1","v":{"$error":"#VALUE!"}},{"$error":"#VALUE!"},0,null,50,{"$f":"'AP50'!$N$3","v":0},{"$f":"'AP50'!$Y$23","v":{"$error":"#VALUE!"}},{"$f":"SUMPRODUCT((K55<$K$6:$K$55)/COUNTIF($K$6:$K$55,$K$6:$K$55))+1","v":{"$error":"#VALUE!"}},{"$error":"#VALUE!"},0]

{"sheet":"Checkbox_Value","index":61,"n_rows":8,"n_cols":19,"rows_kept":8,"cut":false,"hidden":true,"merged":[]}
["A. Unit Level",false]
["B. University Level",false]
["C. National/CSC Level",false]
["C.2.2. Innovations",false]
["C.2.3. Critical Incidents",false]
["Fresh Graduate",false]
["Public Service",false]
[null,null,null,null,null,null,null,null,null,null,null,null,null,null,null,null,null,null,true]

{"sheet":"datadict","index":62,"n_rows":4,"n_cols":8,"rows_kept":4,"cut":false,"hidden":true,"merged":[]}
[null,"PR","Education","Training","Experience","Accomplishment","PC & PT","Potential"]
["First Level",50,15,10,10,5,5,5]
["Second Level",45,10,10,10,10,5,10]
["Division Chief and Higher",45,5,10,10,10,10,10]